Deelmodel Revisies, filter collectie_REVTOP16_v1.7
type: Ontology
version info: Deelmodel Revisies, filter op CoFs REV TOP, cfk=16, versie=1.7 (2026-08-26T14:17:17)

has as aspect
type: ObjectProperty

has as output (inverse)
type: ObjectProperty
inverse of: has as output

has as aspect (inverse)
type: ObjectProperty
inverse of: has as aspect

has as reference (qualification)
type: ObjectProperty
type: FunctionalProperty

has as part (inverse)
type: ObjectProperty
inverse of: has as part

has as input
type: ObjectProperty

has as output
type: ObjectProperty

has as part
type: ObjectProperty

is connected to
type: ObjectProperty
type: SymmetricProperty

heeft Functie
type: ObjectProperty
range: Functie

has as input (inverse)
type: ObjectProperty
inverse of: has as input

heeft Doel
validity context: 6d
type: ObjectProperty
range: Doel

is represented by
author of change: Marinus Vonhof
date of change: 2026-07-23
comment: Vanaf versie 1.7.0 is deze relatie niet meer functioneel. Documentatie is representatie ipv kenmerk geworden, daarmee kan een subject meerdere representaties (symbool, revisietekening) hebben.
type: ObjectProperty

heeft Uitvoering
validity context: 6d
type: ObjectProperty
range: Uitvoering

heeft Technologie
validity context: 6d
type: ObjectProperty
range: Technologie

heeft Mechanisme
validity context: 6d
type: ObjectProperty
range: Mechanisme

heeft Toepassing
validity context: 6d
type: ObjectProperty
range: Toepassing

heeft Structuur
validity context: 6d
type: ObjectProperty
range: Structuur

is represented by (inverse)
type: ObjectProperty
inverse of: is represented by

author of change
type: AnnotationProperty
range: string

date of change
type: AnnotationProperty
range: date

author at start life
type: AnnotationProperty
range: string

date of start life
type: AnnotationProperty
range: date

units of measurements
type: AnnotationProperty

validity context
type: AnnotationProperty

has as value
type: FunctionalProperty
type: DatatypeProperty

Breedte bouwwerk (datatype)
type: Datatype
equivalent class: Datatype
  on datatype: integer
  with restrictions:
    min inclusive: 500
  with restrictions:
    max inclusive: 10000

Breedte leiding (datatype)
type: Datatype
equivalent class: Datatype
  on datatype: integer
  with restrictions:
    min inclusive: 63
  with restrictions:
    max inclusive: 4000

Breedte put (datatype)
type: Datatype
equivalent class: Datatype
  on datatype: integer
  with restrictions:
    min inclusive: 300
  with restrictions:
    max inclusive: 4000

Hoogte bouwwerk (datatype)
type: Datatype
equivalent class: Datatype
  on datatype: integer
  with restrictions:
    min inclusive: 500
  with restrictions:
    max inclusive: 10000

Hoogte leiding (datatype)
type: Datatype
equivalent class: Datatype
  on datatype: integer
  with restrictions:
    min inclusive: 63
  with restrictions:
    max inclusive: 4000

Hoogte put (datatype)
type: Datatype
equivalent class: Datatype
  on datatype: integer
  with restrictions:
    min inclusive: 500
  with restrictions:
    max inclusive: 4000

Lengte bouwwerk (datatype)
type: Datatype
equivalent class: Datatype
  on datatype: integer
  with restrictions:
    min inclusive: 500
  with restrictions:
    max inclusive: 10000

Lengte leiding (datatype)
type: Datatype
equivalent class: Datatype
  on datatype: decimal
  with restrictions:
    min inclusive: 1
  with restrictions:
    max inclusive: 75

Lengte put (datatype)
type: Datatype
equivalent class: Datatype
  on datatype: integer
  with restrictions:
    min inclusive: 300
  with restrictions:
    max inclusive: 4000

Z-coördinaat (datatype)
type: Datatype
equivalent class: Datatype
  on datatype: decimal
  with restrictions:
    min inclusive: -20
  with restrictions:
    max inclusive: 325

Vorm leiding
label: Shape @en
author of change: Marinus Vonhof
date of change: 2015-05-29
definition: [EN13508-2+A1] The shape of the cross-section of the pipeline as follows @en
notation: ACA
notation: GCA
author at start life: Marinus Vonhof
date of start life: 2012-05-01
comment: Intrinsiek aspect
comment: [is aspect]
scope note: Cof TOP
type: Class
subclass of: Vorm
subclass of: Restriction
  author of change: Marinus Vonhof
  date of change: 2015-10-31
  author at start life: Finy Teitsma (Oranjewoud)
  date of start life: 2006-02-25
  validity context: *t
  on class: Leiding
  on property: has as aspect (inverse)
  qualified cardinality: 1
subclass of: Restriction
  author at start life: Marinus Vonhof
  date of start life: 2015-10-30
  on class: Inwinning
  on property: has as aspect
  max qualified cardinality: 1
subclass of: Restriction
  on property: has as reference (qualification)
  all values from: Vorm leiding (coll)

Hoogte leiding
label: Height @en
author of change: Marinus Vonhof
date of change: 2019-01-24
definition: De bij het materiaal gebruikelijke aanduiding van de hoogte van een leiding (zie diameter leiding)
definition: [EN13508-2+A1] The height of the section in millimetres @en
notation: ACB
notation: GCB
author at start life: Marinus Vonhof
date of start life: 2011-12-15
units of measurements: mm
comment: Intrinsiek aspect
comment: [is aspect]
scope note: Cof TOP
type: Class
subclass of: Hoogte
subclass of: Restriction
  author of change: Marinus Vonhof
  date of change: 2014-12-03
  author at start life: Marinus Vonhof
  date of start life: 2011-12-15
  validity context: *t
  on class: Leiding
  on property: has as aspect (inverse)
  qualified cardinality: 1
subclass of: Restriction
  author at start life: Marinus Vonhof
  date of start life: 2024-05-16
  on class: Inwinning
  on property: has as aspect
  max qualified cardinality: 1
subclass of: Restriction
  on property: has as value
  all values from: Hoogte leiding (datatype)

Breedte leiding
label: Width @en
author of change: Marinus Vonhof
date of change: 2019-01-24
definition: De bij het materiaal gebruikelijke aanduiding van de breedte van een leiding (zie diameter leiding)
definition: [EN13508-2+A1] The width of the section in millimetres. (Not required where both dimensions are the same -e.g. circle) @en
notation: ACC
notation: GCC
author at start life: Marinus Vonhof
date of start life: 2013-09-17
units of measurements: mm
comment: Intrinsiek aspect
comment: [is aspect]
scope note: Cof TOP
type: Class
subclass of: Breedte
subclass of: Restriction
  author of change: Marinus Vonhof
  date of change: 2015-05-29
  author at start life: Marinus Vonhof
  date of start life: 2011-12-15
  validity context: *t
  on class: Leiding
  on property: has as aspect (inverse)
  qualified cardinality: 1
subclass of: Restriction
  author at start life: Marinus Vonhof
  date of start life: 2024-05-16
  on class: Inwinning
  on property: has as aspect
  max qualified cardinality: 1
subclass of: Restriction
  on property: has as value
  all values from: Breedte leiding (datatype)

Materiaal leiding
label: Material sewer @en
author of change: Johan Post
date of change: 2022-09-29
definition: De bouwstof van de leiding
definition: [EN13508-2+A1] The material of the fabric of the sewer, in accordance with Table C.4. Where the pipeline has been lined the material recorded is the material of the original pipeline @en
notation: ACD
notation: GCD
author at start life: Marinus Vonhof
date of start life: 2013-09-17
comment: Intrinsiek aspect
alternative label: Leidingmateriaal
comment: [is aspect]
scope note: Cof TOP
type: Class
subclass of: Materiaal
subclass of: Restriction
  author of change: Marinus Vonhof
  date of change: 2015-06-01
  author at start life: Finy Teitsma (Oranjewoud)
  date of start life: 2006-02-25
  validity context: *t
  on class: Leiding
  on property: has as aspect (inverse)
  qualified cardinality: 1
subclass of: Restriction
  on property: has as reference (qualification)
  all values from: Materiaal leiding (coll)
subclass of: Restriction
  on class: Inwinning
  on property: has as aspect
  max qualified cardinality: 1

Wijze van inwinning (coll)
author of change: Johan Post
date of change: 2022-11-25
comment: [is coll]
scope note: Cof TOP
type: Class
subclass of: Verzameling soorten
subclass of: Class

Technologie
author of change: Marinus Vonhof
date of change: 2021-01-09
definition: Bij activiteit: werkwijze, eisen
author at start life: Nic Roest (Idoro)
date of start life: 2008-03-11
validity context: 6d
comment: Onderscheidend kenmerk
comment: [is aspect]
scope note: Cof TOP
type: Class
subclass of: Onderscheidend kenmerk

Uitvoering
author of change: Marinus Vonhof
date of change: 2021-01-09
definition: Materiaal, afwerking, vorm
author at start life: Nic Roest (Idoro)
date of start life: 2008-03-11
validity context: 6d
comment: Onderscheidend kenmerk
comment: [is aspect]
scope note: Cof TOP
type: Class
subclass of: Onderscheidend kenmerk

Melding meting knooppunt (coll)
author at start life: Marinus Vonhof
date of start life: 2024-09-18
comment: [is coll]
scope note: Cof REV
type: Class
subclass of: Verzameling soorten
subclass of: Class
  one of: Scheur in object
  one of: Oppervlakteschade in object
  one of: Toegang tot object belemmerd
  one of: Toegang tot bodem belemmerd
  one of: Geur waargenomen
  one of: Vuil in object
  one of: Grond in object
  one of: Aangehechte afzetting in object
  one of: Wortels in object
  one of: Object niet gevonden
  one of: Object ontbreekt in opdracht
  one of: Ongedierte in object

Melding meting leiding (coll)
author at start life: Marinus Vonhof
date of start life: 2024-09-18
comment: [is coll]
scope note: Cof REV
type: Class
subclass of: Verzameling soorten
subclass of: Class
  one of: Scheur in object
  one of: Object niet te meten
  one of: Wortels in object
  one of: Vuil in object
  one of: Grond in object
  one of: Aangehechte afzetting in object
  one of: Object niet gevonden
  one of: Object ontbreekt in opdracht
  one of: Ongedierte in object
  one of: Object te diep voor meting
  one of: Afmeting leiding wijkt af bij eindpunt

Datum
author of change: Marinus Vonhof
date of change: 2025-01-16
date of change: 2017-11-16
definition: [IMBOR] Aanduiding van een bepaalde dag volgens een kalender.
author at start life: Marinus Vonhof
date of start life: 2015-02-28
units of measurements: yyyy-mm-dd
comment: [is aspect]
scope note: Cof TOP
type: Class
subclass of: Kenmerk
subclass of: Restriction
  on property: has as value
  all values from: date

Afstand
author of change: Marinus Vonhof
date of change: 2015-02-28
author at start life: Nic Roest (Idoro)
date of start life: 2006-03-03
comment: [is aspect]
scope note: Cof TOP
type: Class
subclass of: Kenmerk

Aansluiting
author of change: Marinus Vonhof
date of change: 2018-10-17
definition: Het geheel van overdrachtspunt, leiding en inlaat voor de aanvoer van afvalwater
author at start life: Marinus Vonhof
date of start life: 2015-02-28
validity context: 3d 5d 10f 11d 13d 14f 15d
scope note: Cof TOP
type: Class
subclass of: Fysiek object
subclass of: Restriction
  author of change: Marinus Vonhof
  date of change: 2019-05-15
  author at start life: Finy Teitsma (Oranjewoud)
  date of start life: 2007-11-30
  on class: Inlaat
  on property: has as part
  qualified cardinality: 1
subclass of: Restriction
  author of change: Marinus Vonhof
  date of change: 2016-04-22
  author at start life: Marinus Vonhof
  date of start life: 2014-03-15
  on class: Vrijverval rioolstelsel
  on property: has as part (inverse)
  qualified cardinality: 1
subclass of: Restriction
  author at start life: Marinus Vonhof
  date of start life: 2019-05-15
  on class: Goot
  on property: has as part
  min qualified cardinality: 0
subclass of: Restriction
  author at start life: Marinus Vonhof
  date of start life: 2021-08-05
  on class: Slangsifon
  on property: has as part
  min qualified cardinality: 0
subclass of: Restriction
  author at start life: Marinus Vonhof
  date of start life: 2022-10-02
  on class: Verbindingsstuk
  on property: has as part
  min qualified cardinality: 0
subclass of: Restriction
  author at start life: Marinus Vonhof
  date of start life: 2024-07-16
  on class: Maaiveldoriëntatie
  on property: is connected to
  max qualified cardinality: 1
subclass of: Restriction
  on property: heeft Functie
  has value: Aanvoer van afvalwater

Maatregel
author of change: Marinus Vonhof
date of change: 2018-12-10
definition: [IRIS-RIOKEN:2012] Activiteiten die worden uitgevoerd ter verbetering van werken
author at start life: Marinus Vonhof
date of start life: 2013-03-26
validity context: 1f 3f 5d 10f 11d 12f 14f
scope note: Cof TOP
type: Class
subclass of: Activiteit
subclass of: Restriction
  author of change: Marinus Vonhof
  date of change: 2018-05-01
  author at start life: Marinus Vonhof
  date of start life: 2013-03-26
  validity context: 1t 3t 12t
  on class: Datum maatregel
  on property: has as aspect
  max qualified cardinality: 1

Kenmerk
author of change: Marinus Vonhof
author of change: Wouter van Riel
date of change: 2024-04-22
date of change: 2017-11-16
definition: Eigenschap van iets
definition: [Gellish] Is an individual object that is a phenomenon that is possessed by a totality and cannot exist without the existence of its possessor. It is an intrinsic, non-separable facet of its possessor @en
author at start life: Marinus Vonhof
date of start life: 2013-09-03
validity context: *f
comment: [cfk fout]
scope note: Cof TOP
type: Class

Verzameling soorten
author of change: Marinus Vonhof
date of change: 2017-11-16
author at start life: Marinus Vonhof
date of start life: 2014-07-11
comment: collection of qualitative aspects is specialisatie van collection of classes
alternative label: Collectie kenmerkwaarden
alternative label: Domeinwaarden
alternative label: Verzameling kenmerkwaarden
scope note: Cof TOP
type: Class

Activiteit
author of change: Marinus Vonhof
date of change: 2025-01-16
date of change: 2016-09-16
definition: [Gellish] Is a deed (a performance by changing a state of affairs) by carrying out an action or pattern of behavior. @en
definition: [IMBOR] Iets dat mogelijk of daadwerkelijke gebeurt in ruimte en tijd.
author at start life: Marinus Vonhof
date of start life: 2011-12-02
validity context: 1f 3f 5d 6d 10f 11d 12f 14f 15d
scope note: Cof TOP
type: Class

Functie
author of change: Marinus Vonhof
date of change: 2025-01-16
date of change: 2021-01-09
definition: Wat doet het
definition: [IMBOR] Een activiteit die het externe gedrag beschrijft van het object die de activiteit uitvoert.
author at start life: Marinus Vonhof
date of start life: 2013-09-03
comment: Onderscheidend kenmerk
comment: [is aspect]
scope note: Cof TOP
type: Class
subclass of: Onderscheidend kenmerk

Doel
author of change: Marinus Vonhof
date of change: 2021-01-09
definition: Bij activiteit: wat te bereiken
author at start life: Marinus Vonhof
date of start life: 2014-04-29
validity context: 6d
comment: Onderscheidend kenmerk
comment: [is aspect]
scope note: Cof TOP
type: Class
subclass of: Onderscheidend kenmerk

Hoogte t.o.v. NAP
author of change: Marinus Vonhof
author of change: Eric van Gorkom
date of change: 2015-05-29
date of change: 2024-05-13
date of change: 2024-05-20
date of change: 2024-07-12
definition: Conform coordinatenstelsel EPSG:5709
definition: Hoogte aangegeven t.o.v. NAP
author at start life: Nic Roest (Idoro)
date of start life: 2006-02-21
units of measurements: m
alternative label: Normaal Amsterdams Peil
comment: [is aspect]
scope note: Cof TOP
type: Class
subclass of: Kenmerk
subclass of: Restriction
  on property: has as value
  all values from: Z-coördinaat (datatype)

Pomp
author of change: Marinus Vonhof
author of change: Johan Post
date of change: 2017-08-31
date of change: 2024-04-30
definition: Een technische installatie die het afvalwater onder druk transporteert.
notation: PMP
author at start life: Finy Teitsma (Oranjewoud)
date of start life: 2007-10-23
validity context: 1d 10d 12d
see also: Vervallen link: https://imgeo.geostandaarden.nl/def/imgeo-object/installatie/pomp-niet-bgt
see also: [IHW:20130706] Werktuig dat door middel van een verschil in druk vloeistoffen of gassen verplaatst
see also: [IMGeo:1.0/2007] Werktuig dat door middel van een verschil in druk vloeistoffen of gassen verplaatst.
see also: [IRIS-RIOKEN:2012] Werktuig dat door middel van een verschil in druk vloeistoffen of gassen verplaatst.
alternative label: Pomp (type installatie)
scope note: Cof MDS
scope note: Cof REV
scope note: Cof HYD
scope note: Cof RGM
scope note: Cof DMO
type: Class
subclass of: Constructieonderdeel
subclass of: Restriction
  author of change: Marinus Vonhof
  date of change: 2016-04-15
  author at start life: Finy Teitsma (Oranjewoud)
  date of start life: 2006-02-25
  on class: Pompput
  on property: has as part (inverse)
  max qualified cardinality: 1
subclass of: Restriction
  author of change: Marinus Vonhof
  date of change: 2017-08-19
  author at start life: Finy Teitsma (Oranjewoud)
  date of start life: 2006-02-25
  on class: Gemaal
  on property: has as part (inverse)
  max qualified cardinality: 1
subclass of: Restriction
  author of change: Marinus Vonhof
  date of change: 2018-05-03
  author at start life: Marinus Vonhof
  date of start life: 2012-04-22
  validity context: 5t 11t 14t
  on class: Onderdeeloriëntatie
  on property: has as aspect
  max qualified cardinality: 1
subclass of: Restriction
  author at start life: Marinus Vonhof
  date of start life: 2014-04-29
  on class: Bijzondere putconstructie
  on property: has as part (inverse)
  max qualified cardinality: 1
subclass of: Restriction
  on property: heeft Technologie
  has value: Door middel van drukverschil
subclass of: Restriction
  on property: heeft Technologie
  has value: Mechanisch
subclass of: Restriction
  on property: heeft Functie
  has value: Verplaatsen van water

Toepassing
author of change: Marinus Vonhof
date of change: 2021-01-09
definition: Proces waarin iets gebruikt wordt, waarom
author at start life: Nic Roest (Idoro)
date of start life: 2008-03-11
validity context: 6d
comment: Onderscheidend kenmerk
comment: [is aspect]
scope note: Cof TOP
type: Class
subclass of: Onderscheidend kenmerk

Fysiek object
label: Physical object @en
author of change: Eric van Gorkom
date of change: 2021-10-01
definition: [Gellish] That is a distribution of matter or energy in time and space that satisfies the laws of physics. All kinds of physical objects are subtypes of this class. It is the top of the hierarchical network of specializations of kinds of physical objects. @en
definition: [NEN 2660] Een object dat bestaat of kan bestaan binnen de fysieke 4D ruimte-tijd. Het vormt een manifestatie en een afbakening van materie en/of energie, en is (in)direct waarneembaar door de zintuigen.
author at start life: Marinus Vonhof
date of start life: 2013-09-03
validity context: *f
comment: [cfk fout]
scope note: Cof TOP
type: Class
subclass of: Restriction
  on property: has as part
  all values from: Class
    union of: Ruimte
    union of: Fysiek object
disjoint with: Ruimte

Inlaat
author of change: JohanPost
date of change: 2021-10-01
definition: Een fysieke constructie met een of meerdere aftakkingen bestemd voor het aansluiten van aansluitleidingen op het riool.
definition: [NEN 3300:1996] Punt waar aanvoer van afvalwater in een rioolstelsel mogelijk is
author at start life: Marinus Vonhof
date of start life: 2019-05-15
comment: 20151014: NEN3300-definitie aangepast
alternative label: Inlaatconstructie
alternative label: Spruitstuk
scope note: Cof MDS
scope note: Cof LDR
scope note: Cof REV
scope note: Cof MTR
type: Class
subclass of: Hulpstuk
subclass of: Restriction
  author at start life: Marinus Vonhof
  date of start life: 2022-10-02
  on class: Aansluiting
  on property: has as part (inverse)
  max qualified cardinality: 1
subclass of: Restriction
  on property: heeft Functie
  has value: Verbinden aansluitleiding met rioolput of rioolleiding

Vrijverval rioolstelsel
label: Name of sewer system @en
author of change: Marinus Vonhof
author of change: Johan Post
author of change: Eric van Gorkom
author of change: Wouter van Riel
date of change: 2026-05-01
date of change: 2024-04-22
date of change: 2026-07-17
date of change: 2024-05-13
definition: Een rioolstelsel waarbij het transport door middel van de zwaartekracht plaatsvindt
definition: [EN13508-2+A1] The name of the sewer system, or a sewer system reference as specified by the employing authority @en
definition: [NEN-EN 752:2008] systeem van aansluitleidingen of een buitenriolering waarin het afvalwater door de zwaartekracht wordt getransporteerd en waar de leiding is ontworpen om onder normale omstandigheden deels gevuld te zijn [EN 1085:2007, definitie 2260]
notation: AAP
notation: CAP
notation: GAP
notation: JAP
author at start life: Finy Teitsma (Oranjewoud)
date of start life: 2006-02-17
validity context: *f
comment: 20151014: NEN3300-definitie aangepast
alternative label: Stelsel onder vrij verval
comment: [cfk fout]
scope note: Cof TOP
type: Class
subclass of: Rioolstelsel
subclass of: Restriction
  author of change: Marinus Vonhof
  date of change: 2016-04-22
  author at start life: Marinus Vonhof
  date of start life: 2014-03-15
  comment: 20160415: Inverse = optioneel, niet elke specialisatie zit in vv stelsel
  on class: Aansluiting
  on property: has as part
  min qualified cardinality: 1
subclass of: Restriction
  author at start life: Johan Post
  date of start life: 2026-05-01
  on class: Vrijverval transportleiding
  on property: has as part
  min qualified cardinality: 0
subclass of: Restriction
  on property: heeft Functie
  has value: Tijdelijke berging van afvalwater
subclass of: Restriction
  on property: heeft Technologie
  has value: Transport door de zwaartekracht

Goot
author of change: Marinus Vonhof
author of change: Johan Post
author of change: Eric van Gorkom
date of change: 2021-10-01
date of change: 2022-12-24
date of change: 2023-01-10
definition: Aansluitend aan of in de 'verharding' aangebrachte verharde, open afvoer voor hemelwater / Aanvoer afstromend hemelwater vanaf de verharding middels een aansluitend aan de verharding aangebrachte verharde open afvoer
author at start life: Finy Teitsma (Oranjewoud)
date of start life: 2007-10-23
validity context: 1d
alternative label: Lijnafwatering
scope note: Cof MDS
scope note: Cof REV
scope note: Cof HYD
type: Class
subclass of: Open leiding
subclass of: Restriction
  author of change: Marinus Vonhof
  date of change: 2016-04-13
  author at start life: Finy Teitsma (Oranjewoud)
  date of start life: 2007-10-24
  on class: Hemelwaterstelsel
  on property: has as part (inverse)
  max qualified cardinality: 1
subclass of: Restriction
  author of change: Marinus Vonhof
  date of change: 2019-04-30
  author at start life: Marinus Vonhof
  date of start life: 2014-04-30
  on class: Gemengd rioolstelsel
  on property: has as part (inverse)
  max qualified cardinality: 1
subclass of: Restriction
  author at start life: Marinus Vonhof
  date of start life: 2019-05-15
  on class: Aansluiting
  on property: has as part (inverse)
  max qualified cardinality: 1
subclass of: Restriction
  on property: heeft Uitvoering
  has value: Open en aansluitend aan verharding
subclass of: Restriction
  on property: heeft Uitvoering
  has value: Opening aan de bovenzijde
subclass of: Restriction
  on property: heeft Functie
  has value: Opvang en afvoer hemelwater

Slangsifon
author of change: Marinus Vonhof
date of change: 2020-05-26
definition: Gebruikt in aansluitleidingen om deze (aan één zijde) stankvrij te maken. Vaak (altijd?) gecombineerd met een ontstoppingsstuk.
author at start life: Marinus Vonhof
date of start life: 2020-04-17
scope note: Cof REV
scope note: Cof BAS
type: Class
subclass of: Stankafsluiter
subclass of: Restriction
  author at start life: Marinus Vonhof
  date of start life: 2021-08-05
  on class: Aansluiting
  on property: has as part (inverse)
  max qualified cardinality: 1
subclass of: Restriction
  on property: heeft Uitvoering
  has value: Stank afsluiten met water

Verbindingsstuk
author of change: Marinus Vonhof
author of change: Johan Post
date of change: 2018-10-17
date of change: 2024-05-02
definition: Een hulpstuk bestemd voor het verbinden van leidingen.
author at start life: Marinus Vonhof
author at start life: Finy Teitsma (Oranjewoud)
date of start life: 2006-11-29
scope note: Cof MDS
scope note: Cof LDR
scope note: Cof REV
scope note: Cof PLI
scope note: Cof HYD
type: Class
subclass of: Hulpstuk
subclass of: Restriction
  author at start life: Marinus Vonhof
  date of start life: 2022-10-02
  on class: Transportleiding
  on property: has as part (inverse)
  max qualified cardinality: 1
subclass of: Restriction
  on property: heeft Functie
  has value: Verbinden van leidingen
subclass of: Restriction
  on class: Aansluiting
  on property: has as part (inverse)
  max qualified cardinality: 1

Maaiveldoriëntatie
author of change: Marinus Vonhof
date of change: 2018-12-05
definition: Een topologisch element dat het punt (vertex) op het maaiveld beschrijft
author at start life: Marinus Vonhof
date of start life: 2012-04-22
scope note: Cof TOP
type: Class
subclass of: Vertex
subclass of: Restriction
  author of change: Marinus Vonhof
  date of change: 2017-08-21
  author at start life: Marinus Vonhof
  date of start life: 2017-08-19
  on class: Bouwwerkoriëntatie
  on property: is connected to
  max qualified cardinality: 1
subclass of: Restriction
  author of change: Marinus Vonhof
  date of change: 2017-12-12
  author at start life: Marinus Vonhof
  date of start life: 2015-11-07
  validity context: 5t 11t
  on class: Putoriëntatie
  on property: is connected to
  max qualified cardinality: 1
subclass of: Restriction
  author of change: Marinus Vonhof
  date of change: 2018-12-12
  author at start life: Marinus Vonhof
  date of start life: 2012-04-22
  comment: Temporeel kenmerk, met kenmerk Inwinning
  on class: Maaiveldhoogte
  on property: has as aspect
  min qualified cardinality: 1
subclass of: Restriction
  author of change: Marinus Vonhof
  date of change: 2020-04-18
  author at start life: Marinus Vonhof
  date of start life: 2018-12-12
  comment: Temporeel kenmerk, met kenmerk Inwinning
  on class: Punt
  on property: has as aspect
  max qualified cardinality: 1

Kolk
author of change: Marinus Vonhof
date of change: 2019-04-04
definition: Een reservoir bestemd voor de opvang van hemelwater afkomstig van erop aangesloten oppervlakken, het laten bezinken van in dit water meegevoerde bezinkbare stoffen en de afvoer van dit water naar een rioolstelsel of naar de ondergrond
definition: [NEN 3300:1996] ingegraven bak voor de opvang van neerslag afkomstig van erop aangesloten oppervlakken, voor het laten bezinken van in dit water meegevoerde bezinkbare stoffen en voor de afvoer van dit water naar de riolering
notation: EAA
author at start life: Nic Roest (Idoro)
date of start life: 2006-03-23
validity context: 5d 11d 13d 15d
see also: Vervallen link: https://imgeo.geostandaarden.nl/def/imgeo-object/put/kolk-niet-bgt
see also: [IMGeo:1.0/2007] Open hemelwater afvoer, aangesloten op het transportnet van hemelwater.
alternative label: Afvoerput
scope note: Cof TOP
type: Class
subclass of: Put
subclass of: Restriction
  author of change: Marinus Vonhof
  date of change: 2021-08-06
  author at start life: Marinus Vonhof
  date of start life: 2020-04-18
  on class: Deksel
  on property: has as part
  qualified cardinality: 1
subclass of: Restriction
  author of change: Marinus Vonhof
  date of change: 2021-08-06
  author at start life: Marinus Vonhof
  date of start life: 2020-05-26
  on class: Stankscherm
  on property: has as part
  max qualified cardinality: 1
subclass of: Restriction
  author at start life: Marinus Vonhof
  date of start life: 2020-04-18
  on class: Uitklimvoorziening
  on property: has as part
  max qualified cardinality: 1
subclass of: Restriction
  on property: heeft Functie
  has value: Bezinken stoffen
subclass of: Restriction
  on property: heeft Functie
  has value: Opvang van afstromend hemelwater

Spuikolk
definition: Een bovengrondse uitstroomvoorziening die hemelwater vanuit een ondergrondse leiding aan het maaiveld aanbiedt.
notation: EAA
author at start life: Johan Post
date of start life: 2026-05-04
alternative label: Hemelwaterbrievenbus
scope note: Cof TOP
type: Class
subclass of: Put
subclass of: Restriction
  author of change: Marinus Vonhof
  date of change: 2021-08-06
  author at start life: Marinus Vonhof
  date of start life: 2020-04-18
  on class: Deksel
  on property: has as part
  max qualified cardinality: 1
subclass of: Restriction
  author at start life: Marinus Vonhof
  date of start life: 2020-04-18
  on class: Uitklimvoorziening
  on property: has as part
  max qualified cardinality: 1
subclass of: Restriction
  on property: heeft Functie
  has value: Afvoeren hemelwater naar de bovengrond

Aansluitleiding
label: Drain (EN) @en
author of change: Marinus Vonhof
date of change: 2019-03-20
definition: Een leiding voor de aanvoer van afvalwater.
definition: [EN 16323:2014] pipeline, usually underground, designed to carry wastewater from a source to a sewer @en
definition: [NEN 3300:1996] Leiding tussen een gebouw of een kolk en een knooppunt of leiding
definition: [NEN-EN 752:2008] gewoonlijk ondergrondse leiding die afvalwater van een gebouw of een kolk naar een riool voert [EN 1085:2007, definitie 2250]
author at start life: Finy Teitsma (Oranjewoud)
date of start life: 2006-02-20
validity context: 5d 11d 13d 14f 15d
comment: 20151014: NEN3300-definitie aangepast
scope note: Cof TOP
type: Class
subclass of: Leiding
subclass of: Restriction
  on property: heeft Functie
  has value: Aanvoer van afvalwater

Leiding
author of change: Johan Post
author of change: Eric van Gorkom
author of change: Wouter van Riel
date of change: 2024-05-01
date of change: 2026-05-01
date of change: 2021-11-23
date of change: 2024-04-23
date of change: 2026-05-13
date of change: 2026-04-30
definition: Een geheel van geleiders welke voorzien zijn van 1 ommanteling en bestemd is voor transport van materie
author at start life: Finy Teitsma (Oranjewoud)
date of start life: 2006-02-24
validity context: *f
see also: [IMKL:1.1/2008] Holle leiding voor het doorstromen van gassen, vloeistoffen of capsules, bestemd om hetzij gas, een vloeistof of capsules te transporteren, hetzij een vloeistof als intermediair te gebruiken voor het transport van warmte of een opgeloste of verpulverde stof.
see also: [NEN 3610:2010] (Ongeldig) Buis of kabel bestemd voor de voortgeleiding van energie of materie.
alternative label: Buis
alternative label: Pijp
comment: [cfk fout]
scope note: Cof TOP
type: Class
subclass of: Fysiek object
subclass of: Restriction
  author of change: Marinus Vonhof
  date of change: 2015-06-01
  author at start life: Finy Teitsma (Oranjewoud)
  date of start life: 2006-02-25
  validity context: *t
  on class: Materiaal leiding
  on property: has as aspect
  qualified cardinality: 1
subclass of: Restriction
  author of change: Marinus Vonhof
  date of change: 2015-08-24
  author at start life: Finy Teitsma (Oranjewoud)
  date of start life: 2006-02-25
  validity context: *t
  on class: Lengte leiding
  on property: has as aspect
  qualified cardinality: 1
subclass of: Restriction
  author of change: Marinus Vonhof
  date of change: 2015-10-31
  author at start life: Finy Teitsma (Oranjewoud)
  date of start life: 2006-02-25
  validity context: *t
  on class: Vorm leiding
  on property: has as aspect
  qualified cardinality: 1
subclass of: Restriction
  author of change: Marinus Vonhof
  date of change: 2014-12-03
  author at start life: Marinus Vonhof
  date of start life: 2011-12-15
  validity context: *t
  on class: Hoogte leiding
  on property: has as aspect
  qualified cardinality: 1
subclass of: Restriction
  author of change: Marinus Vonhof
  date of change: 2015-05-29
  author at start life: Marinus Vonhof
  date of start life: 2011-12-15
  validity context: *t
  on class: Breedte leiding
  on property: has as aspect
  qualified cardinality: 1
subclass of: Restriction
  author at start life: Finy Teitsma (Oranjewoud)
  date of start life: 2006-02-25
  on property: has as aspect
  some values from: Lengte leiding
subclass of: Restriction
  author at start life: Finy Teitsma (Oranjewoud)
  date of start life: 2006-02-25
  on property: has as aspect
  some values from: Materiaal leiding
subclass of: Restriction
  author at start life: Finy Teitsma (Oranjewoud)
  date of start life: 2006-02-25
  on property: has as aspect
  some values from: Vorm leiding
subclass of: Restriction
  author at start life: Johan Post
  date of start life: 2026-05-13
  on class: Inwinning
  on property: has as aspect
  max qualified cardinality: 1
subclass of: Restriction
  author at start life: Marinus Vonhof
  date of start life: 2011-12-15
  on property: has as aspect
  some values from: Breedte leiding
subclass of: Restriction
  author at start life: Marinus Vonhof
  date of start life: 2011-12-15
  on property: has as aspect
  some values from: Hoogte leiding
subclass of: Restriction
  author at start life: Marinus Vonhof
  date of start life: 2012-04-22
  validity context: *t
  on class: Leidingoriëntatie
  on property: has as aspect
  qualified cardinality: 1
subclass of: Restriction
  author at start life: Marinus Vonhof
  date of start life: 2014-12-02
  on class: Status functioneren
  on property: has as aspect
  max qualified cardinality: 1
subclass of: Restriction
  on property: heeft Functie
  has value: Voortgeleiding van materie

Aansluitpunt
definition: Een topologisch element (knooppunt) met de aansluitlocatie tussen leidingen, putten en open water. Een aansluitpunt kan ook de koppeling vormen tussen een leiding en een hydraulisch element (zoals een klep), het is dan het knooppunt tussen twee verbindingen.
author at start life: Marinus Vonhof
date of start life: 2017-12-12
scope note: Cof TOP
type: Class
subclass of: Knooppunt
subclass of: Restriction
  on property: heeft Functie
  has value: Aanvoer van afvalwater

Knooppunt
label: Node @en
author of change: Marinus Vonhof
author of change: Wouter van Riel
date of change: 2024-04-22
date of change: 2022-10-01
date of change: 2020-11-24
definition: De knoop binnen de netwerkdefinitie, waar verbindingen bij elkaar komen
definition: [NEN 3300:1996] Begin- of eindpunt van 1 of meer leidingen, meestal gevormd door een fysieke constructie
author at start life: Marinus Vonhof
date of start life: 2013-09-03
see also: [GFO/RIO2] Begin- of eindpunt van 1 of meer leidingen, meestal gevormd door een fysieke constructie
alternative label: Knoop
scope note: Cof TOP
type: Class
subclass of: Vertex
subclass of: Restriction
  author of change: Marinus Vonhof
  date of change: 2022-10-01
  author at start life: Marinus Vonhof
  date of start life: 2011-12-02
  on class: Beginpunt leiding
  on property: is connected to
  min qualified cardinality: 0
subclass of: Restriction
  author of change: Marinus Vonhof
  date of change: 2022-10-01
  author at start life: Marinus Vonhof
  date of start life: 2011-12-02
  on class: Eindpunt leiding
  on property: is connected to
  min qualified cardinality: 0
subclass of: Restriction
  author of change: Marinus Vonhof
  date of change: 2022-10-01
  author at start life: Marinus Vonhof
  date of start life: 2017-12-12
  on class: Beginpunt onderdeel
  on property: is connected to
  min qualified cardinality: 0
subclass of: Restriction
  author of change: Marinus Vonhof
  date of change: 2022-10-01
  author at start life: Marinus Vonhof
  date of start life: 2017-12-12
  on class: Eindpunt onderdeel
  on property: is connected to
  min qualified cardinality: 0
subclass of: Restriction
  author at start life: Wouter van Riel
  date of start life: 2022-05-04
  on class: Punt
  on property: has as aspect
  max qualified cardinality: 1

Put
author of change: Johan Post
author of change: Eric van Gorkom
date of change: 2022-09-27
date of change: 2024-05-01
date of change: 2026-05-01
date of change: 2024-05-13
date of change: 2026-04-30
date of change: 20262-05-13
author at start life: Marinus Vonhof
date of start life: 2013-07-18
validity context: *f
see also: Vervallen link: https://imgeo.geostandaarden.nl/def/imgeo-object/put
see also: [IMGeo:1.0/2007] Gegraven of geboorde kokervormige diepte waarin zich (vloei)stoffen bevinden.
comment: [cfk fout]
scope note: Cof TOP
type: Class
subclass of: Fysiek object
subclass of: Restriction
  author of change: Marinus Vonhof
  date of change: 2014-08-01
  author at start life: Finy Teitsma (Oranjewoud)
  date of start life: 2006-02-25
  validity context: *t
  on class: Breedte put
  on property: has as aspect
  qualified cardinality: 1
subclass of: Restriction
  author of change: Marinus Vonhof
  date of change: 2014-08-01
  author at start life: Finy Teitsma (Oranjewoud)
  date of start life: 2006-02-25
  validity context: *t
  on class: Hoogte put
  on property: has as aspect
  qualified cardinality: 1
subclass of: Restriction
  author of change: Marinus Vonhof
  date of change: 2014-08-01
  author at start life: Finy Teitsma (Oranjewoud)
  date of start life: 2006-02-25
  validity context: *t
  on class: Lengte put
  on property: has as aspect
  qualified cardinality: 1
subclass of: Restriction
  author of change: Marinus Vonhof
  date of change: 2015-06-01
  author at start life: Finy Teitsma (Oranjewoud)
  date of start life: 2007-10-24
  validity context: 5t 10t 12t 14t
  on class: Materiaal put
  on property: has as aspect
  max qualified cardinality: 1
subclass of: Restriction
  author of change: Marinus Vonhof
  date of change: 2021-08-06
  author at start life: Finy Teitsma (Oranjewoud)
  date of start life: 2006-02-25
  validity context: *t
  on class: Vorm put
  on property: has as aspect
  qualified cardinality: 1
subclass of: Restriction
  author at start life: Finy Teitsma (Oranjewoud)
  date of start life: 2006-02-25
  on property: has as aspect
  some values from: Breedte put
subclass of: Restriction
  author at start life: Finy Teitsma (Oranjewoud)
  date of start life: 2006-02-25
  on property: has as aspect
  some values from: Hoogte put
subclass of: Restriction
  author at start life: Finy Teitsma (Oranjewoud)
  date of start life: 2006-02-25
  on property: has as aspect
  some values from: Lengte put
subclass of: Restriction
  author at start life: Finy Teitsma (Oranjewoud)
  date of start life: 2006-02-25
  on property: has as aspect
  some values from: Vorm put
subclass of: Restriction
  author at start life: Finy Teitsma (Oranjewoud)
  date of start life: 2007-10-24
  on property: has as aspect
  some values from: Materiaal put
subclass of: Restriction
  author at start life: Johan Post
  date of start life: 2026-05-13
  on class: Inwinning
  on property: has as aspect
  max qualified cardinality: 1
subclass of: Restriction
  author at start life: Marinus Vonhof
  date of start life: 2012-04-22
  validity context: *t
  on class: Putoriëntatie
  on property: has as aspect
  qualified cardinality: 1
subclass of: Restriction
  author at start life: Marinus Vonhof
  date of start life: 2014-12-02
  on class: Status functioneren
  on property: has as aspect
  max qualified cardinality: 1
subclass of: Restriction
  on property: heeft Uitvoering
  has value: Gegraven of geboorde kokervormige diepte
subclass of: Restriction
  on class: Stellaag
  on property: has as part
  max qualified cardinality: 1

Inwinning
author of change: Johan Post
date of change: 2022-11-25
date of change: 2024-05-02
definition: Informatie over het verzamelen van gegevens
author at start life: Marinus Vonhof
date of start life: 2015-10-29
comment: Kenmerken van kenmerk
alternative label: Inwinning-informatie
comment: [is aspect]
scope note: Cof TOP
type: Class
subclass of: Kenmerk
subclass of: Restriction
  author of change: Marinus Vonhof
  date of change: 2015-11-03
  author at start life: Marinus Vonhof
  date of start life: 2013-03-29
  on class: Lengte leiding
  on property: has as aspect (inverse)
  max qualified cardinality: 1
subclass of: Restriction
  author of change: Marinus Vonhof
  date of change: 2017-05-17
  author at start life: Marinus Vonhof
  date of start life: 2015-10-29
  on class: B.o.b. beginpunt leiding
  on property: has as aspect (inverse)
  max qualified cardinality: 1
subclass of: Restriction
  author of change: Marinus Vonhof
  date of change: 2017-05-17
  author at start life: Marinus Vonhof
  date of start life: 2015-10-30
  on class: Vorm put
  on property: has as aspect (inverse)
  max qualified cardinality: 1
subclass of: Restriction
  author of change: Marinus Vonhof
  date of change: 2019-04-25
  author at start life: Marinus Vonhof
  date of start life: 2015-10-29
  on class: Datum inwinning
  on property: has as aspect
  max qualified cardinality: 1
subclass of: Restriction
  author of change: Marinus Vonhof
  date of change: 2019-04-25
  author at start life: Marinus Vonhof
  date of start life: 2015-10-29
  on class: Wijze van inwinning
  on property: has as aspect
  max qualified cardinality: 1
subclass of: Restriction
  author of change: Marinus Vonhof
  date of change: 2019-04-25
  author at start life: Marinus Vonhof
  date of start life: 2015-11-03
  on class: Capaciteit
  on property: has as aspect (inverse)
  max qualified cardinality: 1
subclass of: Restriction
  author at start life: Marinus Vonhof
  date of start life: 2015-10-29
  on class: B.o.b. eindpunt leiding
  on property: has as aspect (inverse)
  max qualified cardinality: 1
subclass of: Restriction
  author at start life: Marinus Vonhof
  date of start life: 2015-10-30
  on class: Drempelniveau
  on property: has as aspect (inverse)
  max qualified cardinality: 1
subclass of: Restriction
  author at start life: Marinus Vonhof
  date of start life: 2015-10-30
  on class: Vorm leiding
  on property: has as aspect (inverse)
  max qualified cardinality: 1
subclass of: Restriction
  author at start life: Marinus Vonhof
  date of start life: 2015-11-07
  on class: Maaiveldhoogte
  on property: has as aspect (inverse)
  max qualified cardinality: 1
subclass of: Restriction
  author at start life: Marinus Vonhof
  date of start life: 2016-11-09
  on class: Geometrie
  on property: has as aspect (inverse)
  max qualified cardinality: 1
subclass of: Restriction
  author at start life: Marinus Vonhof
  date of start life: 2023-01-10
  on class: Status functioneren
  on property: has as aspect (inverse)
  max qualified cardinality: 1
subclass of: Restriction
  author at start life: Marinus Vonhof
  date of start life: 2024-05-16
  on class: Breedte leiding
  on property: has as aspect (inverse)
  max qualified cardinality: 1
subclass of: Restriction
  author at start life: Marinus Vonhof
  date of start life: 2024-05-16
  on class: Drempelbreedte
  on property: has as aspect (inverse)
  max qualified cardinality: 1
subclass of: Restriction
  author at start life: Marinus Vonhof
  date of start life: 2024-05-16
  on class: Hoogte leiding
  on property: has as aspect (inverse)
  max qualified cardinality: 1
subclass of: Restriction
  on class: Leiding
  on property: has as aspect (inverse)
  max qualified cardinality: 1
subclass of: Restriction
  on class: Materiaal leiding
  on property: has as aspect (inverse)
  max qualified cardinality: 1
subclass of: Restriction
  on class: Put
  on property: has as aspect (inverse)
  max qualified cardinality: 1

Hemelwaterriool
author of change: Johan Post
date of change: 2026-05-18
definition: [NEN 3300:1996] (Regenwaterriool) Riool alleen bestemd voor de inzameling en het transport van neerslag
author at start life: Marinus Vonhof
date of start life: 2012-04-29
alternative label: Regenwaterriool
alternative label: Rwa-riool
scope note: Cof MDS
scope note: Cof REV
scope note: Cof HYD
type: Class
subclass of: Vrijverval rioolleiding
subclass of: Restriction
  author of change: Marinus Vonhof
  date of change: 2014-04-30
  author at start life: Finy Teitsma (Oranjewoud)
  date of start life: 2007-10-24
  on class: Hemelwaterstelsel
  on property: has as part (inverse)
  max qualified cardinality: 1
subclass of: Restriction
  author at start life: Marinus Vonhof
  date of start life: 2020-05-26
  on class: Gemengd rioolstelsel
  on property: has as part (inverse)
  max qualified cardinality: 1
subclass of: Restriction
  author at start life: Marinus Vonhof
  date of start life: 2026-08-04
  on class: Vuilwaterstelsel
  on property: has as part (inverse)
  max qualified cardinality: 1
subclass of: Restriction
  on property: heeft Functie
  has value: Inzameling van hemelwater
subclass of: Restriction
  on property: heeft Functie
  has value: Transport van hemelwater

Vuilwaterriool
author of change: Marinus Vonhof
date of change: 2021-08-05
definition: [NEN 3300:1996] Dwa-riool is synoniem van vuilwaterriool
definition: [NEN 3300:1996] riool alleen bestemd voor de inzameling en het transport van huishoudelijk- en bedrijfsafvalwater, niet zijnde neerslag
author at start life: Marinus Vonhof
date of start life: 2012-04-29
alternative label: Dwa-riool
scope note: Cof MDS
scope note: Cof REV
scope note: Cof HYD
type: Class
subclass of: Vrijverval rioolleiding
subclass of: Restriction
  author at start life: Marinus Vonhof
  date of start life: 2020-05-26
  on class: Gemengd rioolstelsel
  on property: has as part (inverse)
  max qualified cardinality: 1
subclass of: Restriction
  author at start life: Marinus Vonhof
  date of start life: 2020-05-26
  on class: Vuilwaterstelsel
  on property: has as part (inverse)
  max qualified cardinality: 1
subclass of: Restriction
  on property: heeft Functie
  has value: Inzameling van vuilwater
subclass of: Restriction
  on property: heeft Functie
  has value: Transport van vuilwater

Rioolput
author of change: Marinus Vonhof
author of change: Johan Post
author of change: Wouter van Riel
date of change: 2016-08-26
date of change: 2026-05-01
date of change: 2022-12-19
date of change: 2024-04-22
definition: Een put met een verwijderbare deksel, dat toegang geeft tot de aangesloten rioolleidingen
definition: [EN13508-2+A1] The node reference of the manhole or inspection chamber as specified by the employing authority. @en
definition: [NEN 3300:1996] constructie toegang gevend tot het rioolstelsel
notation: CAA
notation: JAA
author at start life: Marinus Vonhof
date of start life: 2013-03-31
validity context: *f
alternative label: Node reference @en
comment: [cfk fout]
scope note: Cof MLD
scope note: Cof TOP
type: Class
subclass of: Put
subclass of: Restriction
  author at start life: Marinus Vonhof
  date of start life: 2026-08-20
  on class: Vuilvangrooster
  on property: has as part
  max qualified cardinality: 1
subclass of: Restriction
  author of change: Marinus Vonhof
  date of change: 2017-03-06
  author at start life: Marinus Vonhof
  date of start life: 2014-04-29
  validity context: *t
  on class: Vrijverval rioolleiding
  on property: is connected to
  min qualified cardinality: 0
subclass of: Restriction
  author of change: Wouter van Riel
  date of change: 2024-04-22
  author at start life: Marinus Vonhof
  date of start life: 2011-12-02
  on class: Putdeksel
  on property: has as part
  min qualified cardinality: 0
subclass of: Restriction
  author at start life: Marinus Vonhof
  date of start life: 2019-05-15
  on class: Klimijzer
  on property: has as part
  min qualified cardinality: 0
subclass of: Restriction
  author at start life: Marinus Vonhof
  date of start life: 2024-05-20
  on class: Bodemprofiel
  on property: has as aspect
  max qualified cardinality: 1
subclass of: Restriction
  author at start life: Marinus Vonhof
  date of start life: 2026-07-23
  on class: Afdekplaat
  on property: has as part
  max qualified cardinality: 1
subclass of: Restriction
  on property: heeft Functie
  has value: Leidingen aansluiten
subclass of: Restriction
  on property: heeft Functie
  has value: Rioolleidingen aansluiten
subclass of: Restriction
  on property: heeft Uitvoering
  has value: Verticale waterdichte constructie

Gemengd riool
author of change: Marinus Vonhof
date of change: 2019-03-20
definition: Vrijverval rioolleiding ontworpen om zowel verontreinigd afvalwater als afgestroomd hemelwater binnen een stelsel te transporteren
author at start life: Marinus Vonhof
date of start life: 2013-10-02
scope note: Cof MDS
scope note: Cof REV
scope note: Cof HYD
type: Class
subclass of: Vrijverval rioolleiding
subclass of: Restriction
  author at start life: Marinus Vonhof
  date of start life: 2020-05-26
  validity context: *t
  on class: Gemengd rioolstelsel
  on property: has as part (inverse)
  max qualified cardinality: 1
subclass of: Restriction
  author at start life: Marinus Vonhof
  date of start life: 2026-08-04
  on class: Vuilwaterstelsel
  on property: has as part (inverse)
  max qualified cardinality: 1
subclass of: Restriction
  on property: heeft Functie
  has value: Inzameling van hemelwater
subclass of: Restriction
  on property: heeft Functie
  has value: Inzameling van vuilwater
subclass of: Restriction
  on property: heeft Functie
  has value: Transport van hemelwater
subclass of: Restriction
  on property: heeft Functie
  has value: Transport van vuilwater

Absoluut rioolstelsel
author of change: Johan Post
date of change: 2021-10-01
definition: [NEN 3300:1996] een gemengd rioolstelsel zonder overstort, eventueel voorzien van een nooduitlaat
author at start life: Marinus Vonhof
date of start life: 2012-04-29
scope note: Cof MDS
scope note: Cof REV
scope note: Cof HYD
scope note: Cof DMO
type: Class
subclass of: Gemengd rioolstelsel
subclass of: Restriction
  on property: heeft Doel
  has value: Verminderen vuilbelasting van oppervlaktewater

Gemengd rioolstelsel
author of change: Marinus Vonhof
author of change: Johan Post
author of change: Eric van Gorkom
date of change: 2024-05-16
date of change: 2021-10-01
date of change: 2024-05-13
definition: Een vrijverval rioolstelsel bestemd voor de inzameling, het transport en de tijdelijke berging van afvalwater.
definition: [NEN 3300:1996] Rioolstelsel, waarbij afvalwater door 1 leidingstelsel wordt getransporteerd
definition: [NEN-EN 752:2008] riolering ontworpen om zowel verontreinigd afvalwater als afgestroomd hemelwater in 1 leidingstelsel te transporteren [EN 1085:2007, definitie 2110]
author at start life: Finy Teitsma (Oranjewoud)
date of start life: 2007-10-23
comment: 20151014: NEN3300-definitie aangepast
alternative label: GWA stelsel
alternative label: Gemengd stelsel
scope note: Cof TOP
type: Class
subclass of: Vrijverval rioolstelsel
subclass of: Restriction
  author of change: Marinus Vonhof
  date of change: 2019-04-30
  author at start life: Marinus Vonhof
  date of start life: 2014-04-30
  on class: Goot
  on property: has as part
  min qualified cardinality: 0
subclass of: Restriction
  author at start life: Marinus Vonhof
  date of start life: 2020-05-26
  validity context: *t
  on class: Gemengd riool
  on property: has as part
  min qualified cardinality: 0
subclass of: Restriction
  author at start life: Marinus Vonhof
  date of start life: 2020-05-26
  on class: Hemelwaterriool
  on property: has as part
  min qualified cardinality: 0
subclass of: Restriction
  author at start life: Marinus Vonhof
  date of start life: 2020-05-26
  on class: Rioolgemaal
  on property: has as part
  min qualified cardinality: 0
subclass of: Restriction
  author at start life: Marinus Vonhof
  date of start life: 2020-05-26
  on class: Vuilwaterriool
  on property: has as part
  min qualified cardinality: 0
subclass of: Restriction
  author at start life: Marinus Vonhof
  date of start life: 2024-05-16
  on class: Externe overstortput
  on property: has as part
  min qualified cardinality: 0
subclass of: Restriction
  on property: heeft Functie
  has value: Inzameling van hemelwater en vuilwater
subclass of: Restriction
  on property: heeft Functie
  has value: Tijdelijke berging van hemelwater en vuilwater
subclass of: Restriction
  on property: heeft Functie
  has value: Transport van hemelwater en vuilwater

Levensvorm
author of change: Marinus Vonhof
date of change: 2016-04-24
definition: Iets dat in staat is tot leven
author at start life: Marinus Vonhof
date of start life: 2014-11-29
validity context: *f 15d
comment: [cfk fout]
scope note: Cof TOP
type: Class

Gemaal
label: Pumping station @en
author of change: Johan Post
author of change: Eric van Gorkom
date of change: 2021-11-23
date of change: 2026-05-18
definition: Een constructie ten behoeve van het verplaatsen van water
definition: [EN 16323:2014] buildings, structures and equipment used to transfer wastewater through a rising main or otherwise to raise the wastewater @en
author at start life: Marinus Vonhof
date of start life: 2014-03-18
validity context: *f
comment: [cfk fout]
scope note: Cof TOP
type: Class
subclass of: Bouwwerk
subclass of: Restriction
  author of change: Marinus Vonhof
  date of change: 2017-08-19
  author at start life: Finy Teitsma (Oranjewoud)
  date of start life: 2006-02-25
  comment: per definitie
  on class: Pomp
  on property: has as part
  min qualified cardinality: 1
subclass of: Restriction
  author of change: Marinus Vonhof
  date of change: 2016-04-13
  author at start life: Marinus Vonhof
  date of start life: 2013-02-05
  on class: Veiligheidsrooster
  on property: has as part
  min qualified cardinality: 0
subclass of: Restriction
  on property: heeft Functie
  has value: Verpompen van water

Afdekking
author of change: Eric van Gorkom
date of change: 2022-09-27
author at start life: Marinus Vonhof
date of start life: 2016-04-15
validity context: 5d 10d 11d 12f 13d 14f
scope note: Cof TOP
type: Class
subclass of: Constructieonderdeel
subclass of: Restriction
  author of change: Marinus Vonhof
  date of change: 2015-10-31
  author at start life: Finy Teitsma (Oranjewoud)
  date of start life: 2006-02-25
  on class: Breedte afdekking
  on property: has as aspect
  max qualified cardinality: 1
subclass of: Restriction
  author of change: Marinus Vonhof
  date of change: 2021-08-05
  author at start life: Finy Teitsma (Oranjewoud)
  date of start life: 2006-02-25
  on class: Vorm afdekking
  on property: has as aspect
  max qualified cardinality: 1
subclass of: Restriction
  author of change: Marinus Vonhof
  date of change: 2015-10-31
  author at start life: Marinus Vonhof
  date of start life: 2014-11-16
  on class: Lengte afdekking
  on property: has as aspect
  max qualified cardinality: 1
subclass of: Restriction
  author of change: Marinus Vonhof
  date of change: 2021-08-06
  author at start life: Marinus Vonhof
  date of start life: 2013-10-26
  validity context: 12t 14t
  on class: Dekseloriëntatie
  on property: has as aspect
  max qualified cardinality: 1
subclass of: Restriction
  author at start life: Finy Teitsma (Oranjewoud)
  date of start life: 2006-02-25
  on property: has as aspect
  some values from: Breedte afdekking
subclass of: Restriction
  author at start life: Finy Teitsma (Oranjewoud)
  date of start life: 2006-02-25
  on property: has as aspect
  some values from: Materiaal afdekking
subclass of: Restriction
  author at start life: Finy Teitsma (Oranjewoud)
  date of start life: 2006-02-25
  on property: has as aspect
  some values from: Vorm afdekking
subclass of: Restriction
  validity context: 12t 14t
  on class: Materiaal afdekking
  on property: has as aspect
  max qualified cardinality: 1
subclass of: Restriction
  on property: heeft Functie
  has value: Afdekken

Constructieonderdeel
author of change: Marinus Vonhof
author of change: Johan Post
date of change: 2025-01-16
date of change: 2015-10-22
date of change: 2024-05-01
definition: [IMBOR] Een onderdeel van een objecttype dat als zelfstandig objecttype beheerd kan worden.
author at start life: Marinus Vonhof
date of start life: 2013-09-28
validity context: *f 15d
comment: [cfk fout]
scope note: Cof TOP
type: Class
subclass of: Fysiek object
subclass of: Restriction
  on property: heeft Toepassing
  has value: Deel van een op zichzelf staande constructie

Breedte afdekking
label: Breadth of cover @en
author of change: Marinus Vonhof
date of change: 2016-04-20
date of change: 2026-07-16
definition: [EN13508-2+A1] The breadth of the cover in millimetres (Not used for circular access) @en
notation: CCR
notation: JCR
author at start life: Nic Roest (Idoro)
date of start life: 2006-03-23
units of measurements: mm
comment: Intrinsiek aspect
comment: [is aspect]
scope note: Cof MDS
scope note: Cof EN
scope note: Cof RRB
scope note: Cof REV
type: Class
subclass of: Breedte
subclass of: Restriction
  author of change: Marinus Vonhof
  date of change: 2015-10-31
  author at start life: Finy Teitsma (Oranjewoud)
  date of start life: 2006-02-25
  on class: Afdekking
  on property: has as aspect (inverse)
  max qualified cardinality: 1
subclass of: Restriction
  on property: has as value
  all values from: integer

Vorm afdekking
label: Shape of cover @en
author of change: Marinus Vonhof
date of change: 2021-08-05
date of change: 2026-07-16
definition: [EN13508-2+A1] The shape of the cover @en
notation: CCO
notation: JCO
author at start life: Nic Roest (Idoro)
date of start life: 2006-03-23
comment: Intrinsiek aspect
comment: [is aspect]
scope note: Cof MDS
scope note: Cof REV
type: Class
subclass of: Vorm
subclass of: Restriction
  author of change: Marinus Vonhof
  date of change: 2021-08-05
  author at start life: Finy Teitsma (Oranjewoud)
  date of start life: 2006-02-25
  on class: Afdekking
  on property: has as aspect (inverse)
  max qualified cardinality: 1
subclass of: Restriction
  on property: has as reference (qualification)
  all values from: Vorm deksel (coll)

Lengte afdekking
label: Width of cover @en
author of change: Marinus Vonhof
author of change: Nic Roest (Idoro)
date of change: 2026-07-16
date of change: 2006-11-23
definition: [EN13508-2+A1] The width (or diameter if circular) of the cover in millimetres @en
notation: CCQ
notation: JCQ
author at start life: Nic Roest (Idoro)
date of start life: 2006-03-23
units of measurements: mm
comment: Intrinsiek aspect
comment: [is aspect]
scope note: Cof MDS
scope note: Cof EN
scope note: Cof RRB
scope note: Cof REV
type: Class
subclass of: Lengte
subclass of: Restriction
  author of change: Marinus Vonhof
  date of change: 2015-10-31
  author at start life: Marinus Vonhof
  date of start life: 2014-11-16
  on class: Afdekking
  on property: has as aspect (inverse)
  max qualified cardinality: 1
subclass of: Restriction
  on property: has as value
  all values from: integer

Dekseloriëntatie
author of change: Marinus Vonhof
date of change: 2018-12-05
definition: Een topologisch element dat het zwaartepunt (vertex) van de bovenkant deksel beschrijft
author at start life: Marinus Vonhof
date of start life: 2013-10-26
scope note: Cof MDS
scope note: Cof EN
scope note: Cof RRB
scope note: Cof REV
type: Class
subclass of: Representatie fysiek object
subclass of: Restriction
  author of change: Marinus Vonhof
  date of change: 2020-04-18
  author at start life: Marinus Vonhof
  date of start life: 2016-11-09
  comment: Temporeel kenmerk, met kenmerk Inwinning
  on class: Punt
  on property: has as aspect
  max qualified cardinality: 1
subclass of: Restriction
  author of change: Marinus Vonhof
  date of change: 2021-08-06
  author at start life: Marinus Vonhof
  date of start life: 2013-10-26
  on class: Afdekking
  on property: has as aspect (inverse)
  max qualified cardinality: 1

Materiaal afdekking
label: Material of cover @en
author of change: Marinus Vonhof
author of change: Eric van Gorkom
date of change: 2016-04-23
date of change: 2022-09-27
definition: [EN13508-2+A1] The material in accordance with Table C.4 @en
notation: CCP
notation: JCP
author at start life: Marinus Vonhof
date of start life: 2014-09-16
comment: Intrinsiek aspect
comment: [is aspect]
scope note: Cof TOP
type: Class
subclass of: Materiaal
subclass of: Restriction
  author of change: Marinus Vonhof
  date of change: 2015-02-22
  author at start life: Finy Teitsma (Oranjewoud)
  date of start life: 2006-02-25
  on class: Afdekking
  on property: has as aspect (inverse)
  max qualified cardinality: 1
subclass of: Restriction
  on property: has as reference (qualification)
  all values from: Materiaal deksel (coll)

Afdekplaat
author of change: Marinus Vonhof
date of change: 2025-01-16
date of change: 2026-07-23
definition: Een onderdeel dat openingen (gedeeltelijk) afdekt, bijvoorbeeld de onderbak van een inspectieput.
definition: [IMBOR] Een onderdeel dat bepaalde openingen afdekt, bijvoorbeeld goten aan de oppervlakte, kabelgeulen, etc.
author at start life: Marinus Vonhof
date of start life: 2018-12-05
alternative label: Dekplaat
scope note: Cof REV
scope note: Cof BAS
type: Class
subclass of: Afdekking
subclass of: Restriction
  on property: heeft Uitvoering
  has value: Vorm van een plaat
subclass of: Restriction
  on class: Rioolput
  on property: has as part (inverse)
  max qualified cardinality: 1

Vrijverval rioolleiding
author of change: Johan Post
author of change: Eric van Gorkom
author of change: Wouter van Riel
date of change: 2021-11-23
date of change: 2024-04-23
date of change: 2024-10-21
definition: Een gesloten rioolleiding waarin het afvalwater door de zwaartekracht wordt getransporteerd.
definition: [NEN 3300:1996] riool waardoor afvalwater door middel van de zwaartekracht wordt getransporteerd
definition: [NEN-EN 752:2008] leiding of andere constructie, gewoonlijk ondergronds, die afvalwater vanuit meer één dan lozingspunt transporteert [EN 1085:2007, definitie 2270]
notation: AAA
notation: GAA
author at start life: Finy Teitsma (Oranjewoud)
date of start life: 2006-11-29
validity context: *f 13d
see also: [IMKL:1.1/2008] Riool waardoor afvalwater door de zwaartekracht wordt getransporteerd (uit NEN 3300, Buitenriolering).
see also: [NEN 3398:2004] verzameling buizen tussen twee putten
alternative label: Inzamelleiding
alternative label: Vrijvervalriool
comment: [cfk fout]
scope note: Cof TOP
type: Class
subclass of: Rioolleiding
subclass of: Restriction
  author of change: Marinus Vonhof
  date of change: 2019-05-15
  author at start life: Finy Teitsma (Oranjewoud)
  date of start life: 2006-07-12
  on class: Inlaat leiding
  on property: has as part
  min qualified cardinality: 0
subclass of: Restriction
  author of change: Marinus Vonhof
  date of change: 2017-03-06
  author at start life: Marinus Vonhof
  date of start life: 2014-04-29
  validity context: *t
  on class: Rioolput
  on property: is connected to
  min qualified cardinality: 0
subclass of: Restriction
  author of change: Marinus Vonhof
  date of change: 2017-03-06
  author at start life: Marinus Vonhof
  date of start life: 2014-04-29
  on class: Rioolput
  on property: is connected to
  max qualified cardinality: 2
subclass of: Restriction
  author of change: Marinus Vonhof
  date of change: 2016-04-15
  author at start life: Nic Roest (Idoro)
  date of start life: 2007-11-29
  validity context: 1t 10t 12t
  on class: Vrijverval rioolstelsel
  on property: has as part (inverse)
  qualified cardinality: 1
subclass of: Restriction
  on property: heeft Structuur
  has value: Gesloten
subclass of: Restriction
  on property: heeft Technologie
  has value: Transport door de zwaartekracht

Mechanisme
author of change: Marinus Vonhof
date of change: 2021-01-09
definition: Bij activiteit: waarmee
author at start life: Marinus Vonhof
date of start life: 2014-04-29
validity context: 6d
comment: Onderscheidend kenmerk
comment: [is aspect]
scope note: Cof TOP
type: Class
subclass of: Onderscheidend kenmerk

Informatiedrager
author of change: Marinus Vonhof
date of change: 2013-12-01
definition: [Gellish] Is a medium intended or actually carrying physical objects from that properties information can be deducted. Typically paper that carries ink, magnetic fields on a disk or tape, electrically or optically modulated substances of electricity or light. @en
author at start life: Marinus Vonhof
date of start life: 2013-09-28
validity context: 10d 11d 12d 13d 14d 15d
scope note: Cof TOP
type: Class

Capaciteit
author of change: Marinus Vonhof
date of change: 2025-01-16
date of change: 2015-05-29
definition: [IMBOR] Vermogen tot opslaan of verwerken.
author at start life: Nic Roest (Idoro)
date of start life: 2006-02-21
validity context: 15d
comment: [is aspect]
scope note: Cof TOP
type: Class
subclass of: Kenmerk
subclass of: Restriction
  date of change: 2019-04-25
  author at start life: Marinus Vonhof
  date of start life: 2015-11-03
  on class: Inwinning
  on property: has as aspect
  max qualified cardinality: 1

Mechanische afsluiter
author of change: Marinus Vonhof
author of change: Johan Post
author of change: Wouter van Riel
date of change: 2026-05-21
date of change: 2024-04-22
date of change: 2019-07-11
definition: Een doorlaat met een voorziening om de stroming te regelen
author at start life: Marinus Vonhof
date of start life: 2019-05-15
validity context: 14f
alternative label: Mechanische doorlaat
scope note: Cof MDS
scope note: Cof REV
scope note: Cof PLI
scope note: Cof HYD
scope note: Cof DMO
type: Class
subclass of: Doorlaat
subclass of: Restriction
  author of change: Marinus Vonhof
  date of change: 2019-05-16
  author at start life: Marinus Vonhof
  date of start life: 2014-04-29
  on class: Bijzondere putconstructie
  on property: has as part (inverse)
  max qualified cardinality: 1
subclass of: Restriction
  author of change: Marinus Vonhof
  date of change: 2020-04-17
  author at start life: Marinus Vonhof
  date of start life: 2014-12-02
  on class: Transportleiding
  on property: is connected to
  max qualified cardinality: 2
subclass of: Restriction
  author at start life: Wouter van Riel
  date of start life: 2022-09-26
  on class: Overstortput
  on property: has as part (inverse)
  max qualified cardinality: 1
subclass of: Restriction
  on property: heeft Technologie
  has value: Mechanisch

Hulpstuk
author of change: Marinus Vonhof
author of change: Johan Post
author of change: Wouter van Riel
date of change: 2025-01-16
date of change: 2022-09-30
date of change: 2026-05-18
date of change: 2021-09-24
definition: [NEN 3300:1996] Verzamelnaam voor een constructieonderdeel van de riolering met een speciaal doel, zoals verloopstuk, overgangsstuk, ontstoppingsstuk
author at start life: Marinus Vonhof
date of start life: 2017-12-13
validity context: *f
comment: [cfk fout]
scope note: Cof MDS
scope note: Cof LDR
scope note: Cof REV
scope note: Cof PLI
scope note: Cof HYD
type: Class
subclass of: Constructieonderdeel
subclass of: Restriction
  on property: heeft Toepassing
  has value: Onderdeel van een leiding

Inlaat leiding
author of change: Marinus Vonhof
author of change: Johan Post
date of change: 2025-01-16
date of change: 2021-10-01
definition: [IMBOR] Een toegangsopening die een leiding toegankelijk maakt voor de door de leiding vervoerde substantie.
author at start life: Marinus Vonhof
date of start life: 2013-02-05
scope note: Cof MDS
scope note: Cof LDR
scope note: Cof REV
scope note: Cof MTR
type: Class
subclass of: Inlaat
subclass of: Restriction
  author of change: Marinus Vonhof
  date of change: 2019-05-15
  author at start life: Finy Teitsma (Oranjewoud)
  date of start life: 2006-07-12
  on class: Vrijverval rioolleiding
  on property: has as part (inverse)
  qualified cardinality: 1
subclass of: Restriction
  on property: heeft Uitvoering
  has value: Verbonden met leiding

Inlaat rioolput
author of change: Marinus Vonhof
author of change: Johan Post
date of change: 2025-01-16
date of change: 2021-10-01
definition: [IMBOR] Een toegangsopening die een put toegankelijk maakt voor de door de put geleide substantie.
author at start life: Marinus Vonhof
date of start life: 2013-02-05
scope note: Cof MDS
scope note: Cof LDR
scope note: Cof REV
scope note: Cof MTR
type: Class
subclass of: Inlaat
subclass of: Restriction
  author of change: Marinus Vonhof
  date of change: 2019-05-15
  author at start life: Finy Teitsma (Oranjewoud)
  date of start life: 2006-07-12
  on class: Inspectieput
  on property: has as part (inverse)
  qualified cardinality: 1
subclass of: Restriction
  on property: heeft Uitvoering
  has value: Verbonden met rioolput

Afstroomplaat
definition: verharde plaat rondom een slokop om begroeiing en erosie te voorkomen
author at start life: Johan Post
date of start life: 2026-05-01
scope note: Cof MDS
scope note: Cof REV
type: Class
subclass of: Afdekking
subclass of: Restriction
  on property: heeft Functie
  has value: Beschermen tegen begroeiing

Systeem
author of change: Marinus Vonhof
date of change: 2015-05-25
date of change: 2022-10-01
definition: De fysieke samenstelling van stelsels en inrichtingen die een functionele eenheid vormen
author at start life: Marinus Vonhof
date of start life: 2013-10-02
validity context: *f 10d 13d 14d 15d
comment: [cfk fout]
scope note: Cof TOP
type: Class
subclass of: Fysiek object
subclass of: Restriction
  on property: heeft Uitvoering
  has value: Geheel van stelsels

Transportstelsel
author of change: Marinus Vonhof
date of change: 2025-01-16
date of change: 2024-05-16
date of change: 2022-10-01
definition: [IMBOR] Voorzieningen voor het transport van afvalwater.
author at start life: Marinus Vonhof
date of start life: 2014-12-02
validity context: *f
comment: [cfk fout]
scope note: Cof TOP
type: Class
subclass of: Stelsel
subclass of: Restriction
  on property: heeft Functie
  has value: Transport van afvalwater

Rioolstelsel
label: Sewer system @en
definition: [EN 16323:2014] network of pipelines and ancillary works that conveys wastewater from drains to a treatment plant or other place of disposal @en
definition: [NEN 3300:1996] Het geheel aan voorzieningen voor de inzameling en het transport van afvalwater met uitzondering van zuiveringstechnische werken
definition: [NEN 3300:1996] Samenhangend geheel van riolen en rioolputten en de bijbehorende voorzieningen voor de inzameling en het transport van afvalwater
author at start life: Marinus Vonhof
date of start life: 2014-12-02
validity context: *f
alternative label: Riolering
alternative label: Rioleringsnet
comment: [cfk fout]
scope note: Cof TOP
type: Class
subclass of: Stelsel
subclass of: Restriction
  author of change: Marinus Vonhof
  date of change: 2016-04-24
  author at start life: Marinus Vonhof
  date of start life: 2014-11-30
  on class: Rioleringsgebied
  on property: has as part (inverse)
  max qualified cardinality: 1
subclass of: Restriction
  on property: heeft Functie
  has value: Inzameling van afvalwater
subclass of: Restriction
  on property: heeft Functie
  has value: Transport van afvalwater

Transportleiding
author of change: Marinus Vonhof
author of change: Johan Post
author of change: Wouter van Riel
date of change: 2025-01-16
date of change: 2024-04-23
date of change: 2026-05-13
date of change: 2025-04-02
definition: [IMBOR] Leiding met als functie de voortgeleiding van materie met mechanische en vrijverval leidingen als subtypen.
author at start life: Marinus Vonhof
date of start life: 2014-12-02
validity context: *f
comment: [cfk fout]
scope note: Cof TOP
type: Class
subclass of: Leiding
subclass of: Restriction
  author of change: Marinus Vonhof
  date of change: 2020-04-17
  author at start life: Marinus Vonhof
  date of start life: 2014-12-02
  on class: Mechanische afsluiter
  on property: is connected to
  max qualified cardinality: 2
subclass of: Restriction
  author at start life: Marinus Vonhof
  date of start life: 2026-07-20
  on class: Doorlaat
  on property: has as part
  min qualified cardinality: 0
subclass of: Restriction
  on property: heeft Functie
  has value: Transport van afvalwater
subclass of: Restriction
  on class: Verbindingsstuk
  on property: has as part
  min qualified cardinality: 0

Stuwmuur
author of change: Marinus Vonhof
author of change: Johan Post
date of change: 2025-01-16
date of change: 2024-05-01
date of change: 2015-07-28
date of change: 2026-07-02
definition: [IMBOR] Een onderdeel bestaande uit muur die als functie heeft het keren van water.
author at start life: Marinus Vonhof
date of start life: 2013-09-28
comment: Als de stuwmuur geen drempniveau heeft is er geen overstort mogelijk, er wordt van uitgegaan dat de muur tot aan de bovenzijde van de put reikt.
scope note: Cof MDS
scope note: Cof REV
scope note: Cof HYD
scope note: Cof DMO
type: Class
subclass of: Wand
subclass of: Restriction
  author of change: Marinus Vonhof
  date of change: 2026-07-20
  author at start life: Marinus Vonhof
  date of start life: 2019-03-20
  comment: Temporeel kenmerk, met kenmerk Inwinning
  on class: Drempelniveau
  on property: has as aspect
  min qualified cardinality: 0
subclass of: Restriction
  author at start life: Marinus Vonhof
  date of start life: 2017-12-07
  on class: Stuwput
  on property: has as part (inverse)
  qualified cardinality: 1
subclass of: Restriction
  author at start life: Marinus Vonhof
  date of start life: 2019-03-20
  validity context: 5t 11t 14t
  on class: Drempelbreedte
  on property: has as aspect
  max qualified cardinality: 1
subclass of: Restriction
  on property: heeft Functie
  has value: Keren van water

Overstortdrempel
author of change: Marinus Vonhof
author of change: Johan Post
date of change: 2025-01-16
date of change: 2024-05-01
date of change: 2026-07-02
definition: [IMBOR] De bovenste rand van een constructie om pieken in water toevoer te regelen, door water over deze rand te storten wanneer de toegevoerde waterhoeveelheid een bepaald volume overschrijdt.
notation: OVS
author at start life: Marinus Vonhof
date of start life: 2011-12-15
validity context: 1d
scope note: Cof MDS
scope note: Cof REV
scope note: Cof HYD
scope note: Cof DMO
type: Class
subclass of: Wand
subclass of: Restriction
  author of change: Marinus Vonhof
  date of change: 2019-09-02
  author at start life: Finy Teitsma (Oranjewoud)
  date of start life: 2006-02-25
  validity context: 12t
  comment: Temporeel kenmerk, met kenmerk Inwinning
  on class: Drempelniveau
  on property: has as aspect
  min qualified cardinality: 1
subclass of: Restriction
  author of change: Marinus Vonhof
  date of change: 2021-08-06
  author at start life: Finy Teitsma (Oranjewoud)
  date of start life: 2006-02-25
  on class: Overstortput
  on property: has as part (inverse)
  qualified cardinality: 1
subclass of: Restriction
  author at start life: Finy Teitsma (Oranjewoud)
  date of start life: 2006-02-25
  validity context: 5t 11t 14t
  on class: Drempelbreedte
  on property: has as aspect
  max qualified cardinality: 1
subclass of: Restriction
  on property: heeft Functie
  has value: Keren van water

Open leiding
author of change: Marinus Vonhof
date of change: 2019-04-30
definition: Een rioolleiding waarvan de bovenzijde niet is afgesloten.
notation: OPL
author at start life: Marinus Vonhof
author at start life: Finy Teitsma (Oranjewoud)
date of start life: 2006-03-23
validity context: *f
comment: [cfk fout]
scope note: Cof MDS
scope note: Cof REV
scope note: Cof HYD
type: Class
subclass of: Leiding
subclass of: Restriction
  on property: heeft Structuur
  has value: Open

Representatie fysiek object
author of change: Marinus Vonhof
date of change: 2017-12-12
date of change: 2024-07-17
definition: Een topologisch element met als enige functie het dragen van de geometrie voor het representeren van fysieke objecten. Het vormt dus geen onderdeel van een netwerkdefinitie
author at start life: Marinus Vonhof
date of start life: 2013-02-03
scope note: Cof TOP
type: Class
subclass of: Topologisch element

Gebied
author of change: Marinus Vonhof
date of change: 2017-11-16
date of change: 2024-11-22
author at start life: Marinus Vonhof
date of start life: 2014-11-29
validity context: *f
see also: [IRIS-RIOKEN:2012] Het geheel van virtuele en fysieke (aanwijsbare) opdelingen en indelingen van het aardoppervlak.
alternative label: Ruimtelijk gebied
comment: [cfk fout]
scope note: Cof TOP
type: Class
subclass of: Ruimte

Reservoir
author of change: Marinus Vonhof
author of change: Wouter van Riel
date of change: 2025-01-16
date of change: 2024-04-22
date of change: 2017-08-21
definition: Constructies met een specifieke functie binnen het rioolstelsel.
definition: Een natuurlijk of kunstmatig gebied dat gebruikt wordt om water op te slaan
author at start life: Marinus Vonhof
date of start life: 2013-03-30
validity context: *f 12f 13d
comment: [cfk fout]
scope note: Cof TOP
type: Class
subclass of: Bouwwerk
subclass of: Restriction
  on property: heeft Uitvoering
  has value: Natuurlijk of kunstmatig gebied
subclass of: Restriction
  on property: heeft Functie
  has value: Opslag van water

Stelsel
author of change: Marinus Vonhof
date of change: 2025-01-16
date of change: 2014-12-02
date of change: 2022-10-01
definition: Een netwerk van leidingen en aanverwante constructies
author at start life: Marinus Vonhof
date of start life: 2012-04-29
validity context: *f
comment: [cfk fout]
scope note: Cof TOP
type: Class
subclass of: Fysiek object
subclass of: Restriction
  on property: heeft Uitvoering
  has value: Netwerk van verbonden knooppunten

Verbinding
author of change: Marinus Vonhof
date of change: 2024-07-17
date of change: 2017-12-22
definition: De verbinding van de knopen binnen de netwerkdefinitie
author at start life: Marinus Vonhof
date of start life: 2013-09-03
see also: [SUF-HYD 1.10] Een stroomvoerend element
scope note: Cof TOP
type: Class
subclass of: Edge

Lijn
author of change: Marinus Vonhof
author of change: Johan Post
date of change: 2019-05-15
date of change: 2024-05-02
definition: Eéndimensionaal geometrisch element. Voor geografische beschrijvingen conform het coordinatenstelsel EPSG:7415 (x/y conform EPSG:28992, optioneel z conform EPSG:5709).
author at start life: Marinus Vonhof
date of start life: 2016-11-09
units of measurements: gml
comment: [is aspect]
scope note: Cof TOP
type: Class
subclass of: Geometrie
subclass of: Restriction
  author of change: Marinus Vonhof
  date of change: 2020-04-18
  author at start life: Marinus Vonhof
  date of start life: 2016-11-09
  on class: Leidingoriëntatie
  on property: has as aspect (inverse)
  max qualified cardinality: 1
subclass of: Restriction
  on property: has as value
  all values from: gmlLiteral

Bouwwerk
author of change: Marinus Vonhof
author of change: Johan Post
author of change: Eric van Gorkom
date of change: 2025-01-16
date of change: 2024-05-01
date of change: 2021-11-23
definition: [IMBOR] Gegevens die specifiek zijn voor een met de aarde verbonden duurzaam constructie, dat niet valt onder de definities van een pand of kunstwerk.
definition: [Omgevingswet] Constructie van enige omvang van hout, steen, metaal of ander materiaal, die op de plaats van bestemming hetzij direct of indirect met de grond verbonden is, hetzij direct of indirect steun vindt in of op de grond, bedoeld om ter plaatse te functioneren, met inbegrip van de daarvan deel uitmakende bouwwerkgebonden installaties
author at start life: Marinus Vonhof
date of start life: 2016-04-20
validity context: *f
comment: [cfk fout]
scope note: Cof TOP
type: Class
subclass of: Fysiek object
subclass of: Restriction
  author of change: Marinus Vonhof
  date of change: 2017-08-21
  author at start life: Finy Teitsma (Oranjewoud)
  date of start life: 2006-02-25
  validity context: 5t 11t 14t
  comment: Vorm = niet rond
  on class: Breedte bouwwerk
  on property: has as aspect
  max qualified cardinality: 1
subclass of: Restriction
  author of change: Marinus Vonhof
  date of change: 2017-08-21
  author at start life: Finy Teitsma (Oranjewoud)
  date of start life: 2006-02-25
  validity context: 5t 11t
  comment: Vorm = niet rond
  on class: Lengte bouwwerk
  on property: has as aspect
  max qualified cardinality: 1
subclass of: Restriction
  author of change: Marinus Vonhof
  date of change: 2017-08-21
  author at start life: Finy Teitsma (Oranjewoud)
  date of start life: 2006-02-25
  validity context: 5t 11t
  on class: Vorm bouwwerk
  on property: has as aspect
  max qualified cardinality: 1
subclass of: Restriction
  author of change: Marinus Vonhof
  date of change: 2017-08-21
  author at start life: Finy Teitsma (Oranjewoud)
  date of start life: 2006-02-25
  on class: Hoogte bouwwerk
  on property: has as aspect
  max qualified cardinality: 1
subclass of: Restriction
  author of change: Marinus Vonhof
  date of change: 2018-05-03
  author at start life: Marinus Vonhof
  date of start life: 2017-08-19
  validity context: 5t 10t 11t 14t
  on class: Bouwwerkoriëntatie
  on property: has as aspect
  max qualified cardinality: 1
subclass of: Restriction
  author of change: Marinus Vonhof
  date of change: 2018-12-06
  author at start life: Marinus Vonhof
  date of start life: 2014-12-02
  on class: Status functioneren
  on property: has as aspect
  max qualified cardinality: 1
subclass of: Restriction
  author at start life: Finy Teitsma (Oranjewoud)
  date of start life: 2006-02-25
  on property: has as aspect
  some values from: Breedte bouwwerk
subclass of: Restriction
  author at start life: Finy Teitsma (Oranjewoud)
  date of start life: 2006-02-25
  on property: has as aspect
  some values from: Hoogte bouwwerk
subclass of: Restriction
  author at start life: Finy Teitsma (Oranjewoud)
  date of start life: 2006-02-25
  on property: has as aspect
  some values from: Vorm bouwwerk
subclass of: Restriction
  author at start life: Marinus Vonhof
  date of start life: 2017-08-21
  validity context: 5t 11t 14t
  on class: Materiaal bouwwerk
  on property: has as aspect
  max qualified cardinality: 1
subclass of: Restriction
  author at start life: Marinus Vonhof
  date of start life: 2017-08-21
  on property: has as aspect
  some values from: Materiaal bouwwerk
subclass of: Restriction
  on property: heeft Uitvoering
  has value: Constructie van enige omvang
subclass of: Restriction
  on property: heeft Uitvoering
  has value: Verbonden met de grond

Vorm leiding (coll)
comment: [is coll]
scope note: Cof MDS
scope note: Cof EN
scope note: Cof RRB
scope note: Cof REV
scope note: Cof HYD
type: Class
subclass of: Verzameling soorten
subclass of: Class
  one of: Rond
  one of: Rechthoekig
  one of: Eivormig
  one of: Eivormig omgekeerd
  one of: U-vorm

Vorm opening (coll)
comment: [is coll]
scope note: Cof TOP
type: Class
subclass of: Verzameling soorten
subclass of: Class
  one of: Rechthoekig
  one of: Rond
  one of: Anders (vorm)

Vorm put (coll)
comment: [is coll]
scope note: Cof TOP
type: Class
subclass of: Verzameling soorten
subclass of: Class
  one of: Rechthoekig
  one of: Rond
  one of: Anders (vorm)

Apparatuur
author of change: Marinus Vonhof
author of change: Johan Post
author of change: Wouter van Riel
date of change: 2025-01-16
date of change: 2024-05-01
date of change: 2017-05-31
date of change: 2024-04-22
date of change: 2024-12-16
definition: De apparatuur bestemd voor meten, regelen, controleren en onderhouden van het transport van afvalwater.
definition: [IMBOR] Een (vaak compact) mechanisch of elektronisch ding dat is gemaakt of toegepast voor een specifieke toepassing en doorgaans in één behuizing gevat is.
author at start life: Marinus Vonhof
date of start life: 2016-04-20
validity context: 1d 3d 10d 11d 12d 13d 14f 15d
alternative label: Apparaat
scope note: Cof TOP
type: Class
subclass of: Fysiek object
subclass of: Restriction
  on property: heeft Functie
  has value: Meten, regelen, controleren en onderhouden

Punt
author of change: Marinus Vonhof
date of change: 2026-07-24
definition: Nuldimensionaal element van geografische informatie. Conform coordinatenstelsel EPSG:7415 (x/y conform EPSG:28992, optioneel z conform EPSG:5709).
author at start life: Marinus Vonhof
date of start life: 2016-11-09
units of measurements: gml
comment: [is aspect]
scope note: Cof TOP
type: Class
subclass of: Geometrie
subclass of: Restriction
  author of change: Marinus Vonhof
  date of change: 2020-04-18
  author at start life: Marinus Vonhof
  date of start life: 2016-11-09
  on class: Dekseloriëntatie
  on property: has as aspect (inverse)
  max qualified cardinality: 1
subclass of: Restriction
  author of change: Marinus Vonhof
  date of change: 2020-04-18
  author at start life: Marinus Vonhof
  date of start life: 2016-11-09
  on class: Aansluitpunt
  on property: has as aspect (inverse)
  qualified cardinality: 1
subclass of: Restriction
  author of change: Marinus Vonhof
  date of change: 2020-04-18
  author at start life: Marinus Vonhof
  date of start life: 2016-11-09
  on class: Knooppunt
  on property: has as aspect (inverse)
  qualified cardinality: 1
subclass of: Restriction
  author of change: Marinus Vonhof
  date of change: 2020-04-18
  author at start life: Marinus Vonhof
  date of start life: 2016-11-09
  on class: Putoriëntatie
  on property: has as aspect (inverse)
  qualified cardinality: 1
subclass of: Restriction
  author of change: Marinus Vonhof
  date of change: 2020-04-18
  author at start life: Marinus Vonhof
  date of start life: 2018-12-12
  on class: Maaiveldoriëntatie
  on property: has as aspect (inverse)
  max qualified cardinality: 1
subclass of: Restriction
  on property: has as value
  all values from: gmlLiteral

Materiaal deksel (coll)
author of change: Marinus Vonhof
date of change: 2025-12-19
comment: [is coll]
scope note: Cof TOP
type: Class
subclass of: Verzameling soorten
subclass of: Class
  one of: Soort ijzer of staal, niet geïdentificeerd
  one of: Soort kunststof, niet geïdentificeerd

Materiaal leiding (coll)
author of change: Marinus Vonhof
author of change: Johan Post
date of change: 2026-05-04
date of change: 2025-12-19
comment: [is coll]
scope note: Cof TOP
type: Class
subclass of: Verzameling soorten
subclass of: Class
  one of: Soort kunststof, niet geïdentificeerd

Materiaal put (coll)
author of change: Marinus Vonhof
author of change: Johan Post
author of change: Eric van Gorkom
date of change: 2026-05-04
date of change: 2022-10-03
date of change: 2026-05-21
date of change: 2024-05-13
author at start life: Marinus Vonhof
date of start life: 2026-05-01
comment: [is coll]
scope note: Cof TOP
type: Class
subclass of: Verzameling soorten
subclass of: Class
  one of: Soort ijzer of staal, niet geïdentificeerd
  one of: Soort kunststof, niet geïdentificeerd

Unieke identificatie
label: Resource identifier @en
author of change: Marinus Vonhof
date of change: 2025-01-16
date of change: 2015-08-24
date of change: 2024-11-22
definition: [IMBOR] Een ondubbelzinnige en unieke aanduiding van een object.
author at start life: Nic Roest (Idoro)
date of start life: 2006-03-23
comment: [is aspect]
scope note: Cof TOP
type: Class
subclass of: Kenmerk

Materiaal
author of change: Marinus Vonhof
date of change: 2015-06-01
author at start life: Marinus Vonhof
date of start life: 2013-09-03
validity context: 15d
comment: [is aspect]
scope note: Cof TOP
type: Class
subclass of: Kenmerk

Materiaal lining (coll)
author at start life: Marinus Vonhof
date of start life: 2026-07-17
comment: [is coll]
scope note: Cof TOP
type: Class
subclass of: Verzameling soorten
subclass of: Class
  one of: Betonnen segmenten

Rioolleiding
label: Pipeline (EN) @en
author of change: Johan Post
author of change: Eric van Gorkom
author of change: Wouter van Riel
date of change: 2022-09-27
date of change: 2024-04-23
date of change: 2026-05-13
definition: [EN 16323:2014] hollow structure for transporting wastewater between manholes or other structures @en
definition: [EN 16323:2014] pipeline or other construction, usually underground, designed to carry wastewater from more than one source @en
definition: [NEN 3300:1996] samenstel van buizen tussen twee putten bestemd voor de inzameling en/of het transport van afvalwater
author at start life: Marinus Vonhof
date of start life: 2014-04-28
validity context: *f
alternative label: Riool
alternative label: Rioolstreng
alternative label: Sewer @en
alternative label: Streng
comment: [cfk fout]
scope note: Cof TOP
type: Class
subclass of: Leiding
subclass of: Restriction
  author at start life: Marinus Vonhof
  date of start life: 2026-07-20
  on class: Doorlaat
  on property: has as part
  max qualified cardinality: 2
subclass of: Restriction
  author at start life: Marinus Vonhof
  date of start life: 2026-08-20
  on class: Vuilvangrooster
  on property: has as part
  max qualified cardinality: 1
subclass of: Restriction
  on property: heeft Functie
  has value: Inzameling van afvalwater
subclass of: Restriction
  on property: heeft Functie
  has value: Transport van afvalwater

Beginpunt leiding
label: Node 1 reference @en
author of change: Marinus Vonhof
date of change: 2016-04-24
definition: Het uiteinde van een leiding, anders dan het eindpunt. Ter plaatse van het leidingmidden op de bovenkant bodem.
definition: [EN13508-2+A1] The node reference of the second node as specified by the employing authority. @en
notation: AAD
notation: GAD
author at start life: Marinus Vonhof
date of start life: 2012-04-22
alternative label: Knooppuntreferentie 1
scope note: Cof TOP
type: Class
subclass of: Vertex
subclass of: Restriction
  author of change: Marinus Vonhof
  date of change: 2018-12-06
  author at start life: Marinus Vonhof
  date of start life: 2016-11-09
  validity context: *t
  comment: Temporeel kenmerk, met kenmerk Inwinning
  on class: B.o.b. beginpunt leiding
  on property: has as aspect
  min qualified cardinality: 1
subclass of: Restriction
  author at start life: Marinus Vonhof
  date of start life: 2011-12-02
  validity context: *t
  on class: Knooppunt
  on property: is connected to
  qualified cardinality: 1
subclass of: Restriction
  author at start life: Marinus Vonhof
  date of start life: 2011-12-02
  on class: Leidingoriëntatie
  on property: has as part (inverse)
  qualified cardinality: 1

Eindpunt leiding
label: Node 2 reference @en
author of change: Marinus Vonhof
date of change: 2016-04-24
definition: [EN13508-2+A1] The node reference of the second node as specified by the employing authority. @en
definition: Het uiteinde van een leiding, anders dan het beginpunt. Ter plaatse van het leidingmidden op de bovenkant bodem.
notation: AAF
notation: GAF
author at start life: Marinus Vonhof
date of start life: 2012-04-22
alternative label: Knooppuntreferentie 2
scope note: Cof TOP
type: Class
subclass of: Vertex
subclass of: Restriction
  author of change: Marinus Vonhof
  date of change: 2018-12-06
  author at start life: Marinus Vonhof
  date of start life: 2016-11-09
  validity context: *t
  comment: Temporeel kenmerk, met kenmerk Inwinning
  on class: B.o.b. eindpunt leiding
  on property: has as aspect
  min qualified cardinality: 1
subclass of: Restriction
  author at start life: Marinus Vonhof
  date of start life: 2011-12-02
  validity context: *t
  on class: Knooppunt
  on property: is connected to
  qualified cardinality: 1
subclass of: Restriction
  author at start life: Marinus Vonhof
  date of start life: 2011-12-02
  on class: Leidingoriëntatie
  on property: has as part (inverse)
  qualified cardinality: 1

Beginknooppunt
definition: Het knooppunt dat koppelt aan het (topologische) beginpunt van een leiding.
definition: [EN13508-2+A1] The node reference of the first node as specified by the employing authority. @en
author at start life: Marinus Vonhof
date of start life: 2026-07-17
alternative label: Beginknoop
scope note: Cof TOP
type: Class
subclass of: Extra objecttype (rol)

Extra objecttype (rol)
definition: Aanvullende niet-functionele objecttypering, bijvoorbeeld voor onderscheid van de uitvoeringswijze of de toegevoegde rol van het object. Het subtype is altijd multiparent, met ook een functioneel supertype
author at start life: Marinus Vonhof
date of start life: 2024-08-01
validity context: *f
comment: [cfk fout]
scope note: Cof TOP
type: Class
subclass of: Informatiedrager

Vertex
author of change: Marinus Vonhof
date of change: 2020-11-24
definition: Het punt waar lijnstukken bij elkaar komen, in de grafentheorie een knoop, in de meetkunde een hoekpunt
author at start life: Marinus Vonhof
date of start life: 2012-04-22
validity context: *f
alternative label: Knoop
comment: [cfk fout]
scope note: Cof TOP
type: Class
subclass of: Topologisch element

B.o.b. beginpunt leiding
definition: Binnenonderkant buis ter plaatse van het beginpunt
notation: AXG
notation: GXG
author at start life: Marinus Vonhof
date of start life: 2013-03-26
units of measurements: m
alternative label: B.o.b. bij beginknoop t.o.v. NAP
comment: [is aspect]
scope note: Cof TOP
type: Class
subclass of: Binnenonderkant buis
subclass of: Restriction
  author of change: Marinus Vonhof
  date of change: 2017-05-17
  date of change: 2024-05-15
  author at start life: Marinus Vonhof
  date of start life: 2015-10-29
  on class: Inwinning
  on property: has as aspect
  max qualified cardinality: 1
subclass of: Restriction
  author of change: Marinus Vonhof
  date of change: 2018-12-06
  author at start life: Marinus Vonhof
  date of start life: 2016-11-09
  validity context: *t
  on class: Beginpunt leiding
  on property: has as aspect (inverse)
  qualified cardinality: 1
subclass of: Restriction
  on property: has as value
  all values from: decimal

Leidingoriëntatie
author of change: Marinus Vonhof
date of change: 2020-04-18
definition: Een topologisch element dat het beginpunt, eindpunt (vertices) en de verbindingslijn (edge) daartussen beschrijft. De geometrie volgt het midden van de binnenonderkant van de leiding
notation: AXY
notation: GXY
author at start life: Marinus Vonhof
date of start life: 2017-12-12
scope note: Cof TOP
type: Class
subclass of: Verbinding
subclass of: Restriction
  author of change: Marinus Vonhof
  date of change: 2020-04-18
  author at start life: Marinus Vonhof
  date of start life: 2016-11-09
  comment: Temporeel kenmerk, met kenmerk Inwinning
  on class: Lijn
  on property: has as aspect
  max qualified cardinality: 1
subclass of: Restriction
  author at start life: Marinus Vonhof
  date of start life: 2011-12-02
  on class: Beginpunt leiding
  on property: has as part
  qualified cardinality: 1
subclass of: Restriction
  author at start life: Marinus Vonhof
  date of start life: 2011-12-02
  on class: Eindpunt leiding
  on property: has as part
  qualified cardinality: 1
subclass of: Restriction
  author at start life: Marinus Vonhof
  date of start life: 2012-04-22
  validity context: *t
  on class: Leiding
  on property: has as aspect (inverse)
  qualified cardinality: 1

Beginpunt onderdeel
author of change: Marinus Vonhof
date of change: 2017-12-08
definition: Bij een pomp, externe doorlaat of externe overstort bepaalt het beginpunt ook de stromingsrichting (= stroming van begin- naar eindpunt).
author at start life: Marinus Vonhof
date of start life: 2012-04-22
scope note: Cof MDS
scope note: Cof REV
scope note: Cof HYD
type: Class
subclass of: Vertex
subclass of: Restriction
  author of change: Marinus Vonhof
  date of change: 2017-12-07
  author at start life: Marinus Vonhof
  date of start life: 2012-04-22
  on class: Onderdeeloriëntatie
  on property: has as part (inverse)
  qualified cardinality: 1
subclass of: Restriction
  author at start life: Marinus Vonhof
  date of start life: 2017-12-12
  validity context: 5t 11t
  on class: Knooppunt
  on property: is connected to
  max qualified cardinality: 1

Onderdeeloriëntatie
author of change: Marinus Vonhof
author of change: Wouter van Riel
date of change: 2018-12-05
date of change: 2024-04-20
definition: Een topologisch element dat de verbindingslijn (edge) tussen het beginpunt en het eindpunt van het onderdeel beschrijft. Voor een wand, pomp of doorlaat beschrijft dit topologisch element de verbinding ervan binnen het netwerk, zie daarvoor de concepten "beginpunt/eindpunt onderdeel". Dit element kan een geometrie (punt of lijn) bevatten voor presentaties. Bij een wand (stuw-/overstortconstructie) beschrijft de geometrie het midden van de bovenkant wand in de breedterichting.
author at start life: Marinus Vonhof
date of start life: 2017-12-12
scope note: Cof MDS
scope note: Cof REV
scope note: Cof HYD
scope note: Cof DMO
type: Class
subclass of: Verbinding
subclass of: Restriction
  author of change: Marinus Vonhof
  date of change: 2015-06-08
  author at start life: Marinus Vonhof
  date of start life: 2012-04-22
  validity context: 5t 11t
  on class: Wand
  on property: has as aspect (inverse)
  max qualified cardinality: 1
subclass of: Restriction
  author of change: Marinus Vonhof
  date of change: 2017-12-07
  author at start life: Marinus Vonhof
  date of start life: 2012-04-22
  on class: Beginpunt onderdeel
  on property: has as part
  qualified cardinality: 1
subclass of: Restriction
  author of change: Marinus Vonhof
  date of change: 2017-12-07
  author at start life: Marinus Vonhof
  date of start life: 2012-04-22
  on class: Eindpunt onderdeel
  on property: has as part
  qualified cardinality: 1
subclass of: Restriction
  author of change: Marinus Vonhof
  date of change: 2018-05-03
  author at start life: Marinus Vonhof
  date of start life: 2012-04-22
  validity context: 5t 11t
  on class: Pomp
  on property: has as aspect (inverse)
  max qualified cardinality: 1
subclass of: Restriction
  author at start life: Marinus Vonhof
  date of start life: 2012-04-22
  validity context: 5t 11t
  on class: Doorlaat
  on property: has as aspect (inverse)
  max qualified cardinality: 1
subclass of: Restriction
  author at start life: Marinus Vonhof
  date of start life: 2025-03-19
  on class: Lijn
  on property: has as aspect
  max qualified cardinality: 1
subclass of: Restriction
  author at start life: Wouter van Riel
  date of start life: 2024-04-20
  on class: Punt
  on property: has as aspect
  max qualified cardinality: 1

Rooster
author of change: Marinus Vonhof
author of change: Johan Post
date of change: 2025-01-16
date of change: 2026-05-01
definition: Een open constructie van spijlen of sleuven die wordt toegepast om doorlaat van water of lucht mogelijk te maken, terwijl het toegang, instroom of doorgang van ongewenste objecten beperkt of voorkomt
definition: [IMBOR] Een in de ondergrond aangebracht horizontaal raamwerk dat dient voor infiltratie.
author at start life: Marinus Vonhof
date of start life: 2016-04-15
scope note: Cof MDS
scope note: Cof REV
type: Class
subclass of: Afdekking
subclass of: Restriction
  on property: heeft Functie
  has value: Afschermen
subclass of: Restriction
  on property: heeft Uitvoering
  has value: Doorlatend

Bemalingsgebied
author of change: Johan Post
date of change: 2021-10-01
definition: [NEN 3300:1996] een rioleringsgebied waaruit het afvalwater door een gemaal wordt verwijderd
author at start life: Marinus Vonhof
date of start life: 2013-02-05
scope note: Cof REV
scope note: Cof BAS
scope note: Cof DMO
type: Class
subclass of: Rioleringsgebied

Rioleringsgebied
author of change: Johan Post
date of change: 2022-09-29
date of change: 2024-10-21
definition: Een gebied zodanig gekozen dat het voldoende inzicht geeft in de belasting van oppervlaktewater en overnamepunt
author at start life: Marinus Vonhof
date of start life: 2014-11-30
validity context: 1d
see also: [IRIS-RIOKEN:2012] Het gebied waarbinnen 1 of meerdere inliggende rioolstelsel(s) het afvalwater naar 1 gemaal of overnamepunt transporteert/teren. Een rioleringsgebied kan een enkelvoudig gebied zijn, maar kan ook meerdere rioleringsgebieden omvatten.
scope note: Cof REV
scope note: Cof BAS
scope note: Cof DMO
type: Class
subclass of: Gebied
subclass of: Restriction
  author of change: Marinus Vonhof
  date of change: 2016-10-25
  author at start life: Marinus Vonhof
  date of start life: 2014-12-03
  on class: Rioleringsgebied
  on property: has as part (inverse)
  max qualified cardinality: 1
subclass of: Restriction
  author of change: Marinus Vonhof
  date of change: 2016-10-25
  author at start life: Marinus Vonhof
  date of start life: 2014-12-03
  on class: Rioleringsgebied
  on property: has as part
  min qualified cardinality: 0
subclass of: Restriction
  author at start life: Marinus Vonhof
  date of start life: 2022-10-01
  on class: Stelsel
  on property: has as part
  min qualified cardinality: 0
subclass of: Restriction
  author at start life: Marinus Vonhof
  date of start life: 2022-10-01
  on class: Systeem
  on property: has as part
  min qualified cardinality: 0

Transportrioolleiding
author of change: Marinus Vonhof
date of change: 2015-07-28
definition: Een gesloten rioolleiding waarop in principe geen aansluitleidingen zijn aangesloten.
definition: [NEN 3300:1996] Riool hoofdzakelijk bestemd voor het transport van afvalwater
author at start life: Finy Teitsma (Oranjewoud)
date of start life: 2006-11-29
comment: 20151014: NEN3300-definitie aangepast
alternative label: Hoofdriool
alternative label: Moerriool
alternative label: Transportriool
scope note: Cof MDS
scope note: Cof REV
scope note: Cof HYD
scope note: Cof DMO
type: Class
subclass of: Vrijverval transportleiding
subclass of: Restriction
  on property: heeft Uitvoering
  has value: Zonder aansluitingen

Verbeterd hemelwaterstelsel
author of change: Marinus Vonhof
date of change: 2019-03-20
definition: Hemelwaterstelsel met voorzieningen waardoor een deel van de neerslag naar het vuilwaterriool wordt afgevoerd of wordt gezuiverd door bijvoorbeeld een filterconstructie of wadi.
author at start life: Marinus Vonhof
date of start life: 2018-12-06
scope note: Cof TOP
type: Class
subclass of: Hemelwaterstelsel
subclass of: Restriction
  author at start life: Marinus Vonhof
  date of start life: 2020-05-26
  on class: Rioolgemaal
  on property: has as part
  min qualified cardinality: 0
subclass of: Restriction
  on property: heeft Functie
  has value: Tijdelijke berging van hemelwater

Putdeksel
author of change: Marinus Vonhof
author of change: Eric van Gorkom
author of change: Wouter van Riel
date of change: 2025-01-16
date of change: 2024-04-22
date of change: 2024-05-13
definition: [IMBOR] Het deksel waarmee een rioolput wordt afgesloten.
author at start life: Marinus Vonhof
date of start life: 2011-12-02
validity context: 5d 11d
scope note: Cof MDS
scope note: Cof EN
scope note: Cof RRB
scope note: Cof REV
type: Class
subclass of: Deksel
subclass of: Restriction
  author at start life: Marinus Vonhof
  date of start life: 2018-12-06
  on class: Knevelvoorziening
  on property: has as part
  max qualified cardinality: 1
subclass of: Restriction
  author at start life: Wouter van Riel
  date of start life: 2024-04-22
  on class: Rioolput
  on property: has as part (inverse)
  max qualified cardinality: 1
subclass of: Restriction
  on property: heeft Functie
  has value: Afdekken put

Inhoud
author of change: Marinus Vonhof
date of change: 2025-01-16
date of change: 2015-05-29
definition: [IMBOR] Kenmerk voor het volume van het beheerobject.
author at start life: Nic Roest (Idoro)
date of start life: 2006-02-21
units of measurements: m3
comment: [is aspect]
scope note: Cof TOP
type: Class
subclass of: Kenmerk
subclass of: Restriction
  on property: has as value
  all values from: decimal

Bergingsleiding
author of change: Marinus Vonhof
date of change: 2015-07-27
definition: Een gesloten leiding waarin het afvalwater tijdelijk wordt opgevangen.
definition: [NEN 3300:1996] riool waardoor extra berging in het rioolstelsel wordt verkregen
definition: [NEN-EN 752:2008] deel van een riool dat als bergingsbassin fungeert
author at start life: Finy Teitsma (Oranjewoud)
date of start life: 2006-05-23
alternative label: Bergingsriool
alternative label: Retentieleiding
scope note: Cof MDS
scope note: Cof REV
scope note: Cof HYD
type: Class
subclass of: Vrijverval rioolleiding
subclass of: Restriction
  on property: heeft Functie
  has value: Tijdelijke berging van afvalwater

Hemelwaterstelsel
author of change: Marinus Vonhof
author of change: Johan Post
author of change: Wouter van Riel
date of change: 2024-05-16
date of change: 2021-10-01
date of change: 2024-04-22
definition: Een enkelvoudig vrijverval rioolstelsel bestemd voor de inzameling, het transport en de tijdelijke berging van hemelwater.
definition: [NEN 3300:1996] Rwa-rioolstelsel is synoniem van hemelwaterstelsel
definition: [NEN 3300:1996] rioolstelsel alleen bestemd voor de inzameling en het transport van neerslag
author at start life: Finy Teitsma (Oranjewoud)
date of start life: 2007-10-23
alternative label: HWA stelsel
alternative label: RWA-rioolstelsel
alternative label: Regenwaterrioolstelsel
scope note: Cof TOP
type: Class
subclass of: Vrijverval rioolstelsel
subclass of: Restriction
  author of change: Marinus Vonhof
  date of change: 2014-04-30
  author at start life: Finy Teitsma (Oranjewoud)
  date of start life: 2007-10-24
  validity context: *t
  on class: Hemelwaterriool
  on property: has as part
  min qualified cardinality: 0
subclass of: Restriction
  author of change: Marinus Vonhof
  date of change: 2016-04-13
  author at start life: Finy Teitsma (Oranjewoud)
  date of start life: 2007-10-24
  on class: Goot
  on property: has as part
  min qualified cardinality: 0
subclass of: Restriction
  author at start life: Marinus Vonhof
  date of start life: 2020-05-26
  on class: Infiltratieriool
  on property: has as part
  min qualified cardinality: 0
subclass of: Restriction
  on property: heeft Functie
  has value: Inzameling van hemelwater
subclass of: Restriction
  on property: heeft Functie
  has value: Transport van hemelwater

Pompput
author of change: Finy Teitsma (Oranjewoud)
author of change: Johan Post
date of change: 2026-05-01
date of change: 2007-11-12
date of change: 2026-05-18
definition: Een rioolput met een inrichting bestemd voor het verpompen van afvalwater.
definition: [NEN 3300:1996] rioolput met een inrichting voor het verpompen van afvalwater
author at start life: Finy Teitsma (Oranjewoud)
date of start life: 2006-02-20
scope note: Cof TOP
type: Class
subclass of: Rioolput
subclass of: Restriction
  author of change: Marinus Vonhof
  date of change: 2016-04-15
  author at start life: Finy Teitsma (Oranjewoud)
  date of start life: 2006-02-25
  comment: per definitie
  on class: Pomp
  on property: has as part
  min qualified cardinality: 1
subclass of: Restriction
  author at start life: Marinus Vonhof
  date of start life: 2018-05-03
  on class: Veiligheidsrooster
  on property: has as part
  max qualified cardinality: 1
subclass of: Restriction
  on property: heeft Functie
  has value: Verpompen van afvalwater
subclass of: Restriction
  on class: Rioolstelsel
  on property: has as part (inverse)
  max qualified cardinality: 1

Betongevulde put
definition: Een put die buiten gebruik is, maar vol beton gezet is om problemen zoals ongedierte, gasvorming, en verzakkingen te voorkomen.
author at start life: Johan Post
date of start life: 2026-05-18
scope note: Cof REV
scope note: Cof BAS
type: Class
subclass of: Loze put
subclass of: Restriction
  on property: heeft Uitvoering
  has value: Betongevuld

Loze put
definition: Put is buiten gebruik, bijvoorbeeld vanwege doorlopende lining
author at start life: Marinus Vonhof
date of start life: 2019-05-15
scope note: Cof REV
scope note: Cof BAS
type: Class
subclass of: Put
subclass of: Restriction
  on property: heeft Functie
  has value: Geen functie

Structuur
author of change: Marinus Vonhof
date of change: 2021-01-09
definition: Onderscheidende beschrijving van topologie, afmetingen, opbouw (delen)
author at start life: Marinus Vonhof
date of start life: 2013-09-29
validity context: 6d
comment: Onderscheidend kenmerk
comment: [is aspect]
scope note: Cof TOP
type: Class
subclass of: Onderscheidend kenmerk

Bijzondere putconstructie
author of change: Marinus Vonhof
author of change: Johan Post
date of change: 2025-01-16
date of change: 2021-10-01
definition: Put met een constructie die niet onder bekend type is onder te brengen
author at start life: Marinus Vonhof
date of start life: 2014-04-29
scope note: Cof MDS
scope note: Cof REV
scope note: Cof HYD
type: Class
subclass of: Rioolput
subclass of: Restriction
  author of change: Marinus Vonhof
  date of change: 2016-04-13
  author at start life: Marinus Vonhof
  date of start life: 2014-04-29
  on class: Wand
  on property: has as part
  min qualified cardinality: 0
subclass of: Restriction
  author of change: Marinus Vonhof
  date of change: 2019-05-16
  author at start life: Marinus Vonhof
  date of start life: 2014-04-29
  on class: Mechanische afsluiter
  on property: has as part
  min qualified cardinality: 0
subclass of: Restriction
  author at start life: Marinus Vonhof
  date of start life: 2014-04-29
  on class: Pomp
  on property: has as part
  min qualified cardinality: 0
subclass of: Restriction
  on property: heeft Uitvoering
  has value: Put met speciale voorzieningen

Wand
author of change: Marinus Vonhof
date of change: 2019-04-05
date of change: 2022-10-01
date of change: 2025-03-19
author at start life: Marinus Vonhof
date of start life: 2012-04-24
validity context: *f
comment: [cfk fout]
scope note: Cof MDS
scope note: Cof REV
scope note: Cof HYD
scope note: Cof DMO
type: Class
subclass of: Constructieonderdeel
subclass of: Restriction
  author of change: Marinus Vonhof
  date of change: 2015-06-08
  author at start life: Marinus Vonhof
  date of start life: 2012-04-22
  validity context: 5t 11t 14t
  on class: Onderdeeloriëntatie
  on property: has as aspect
  max qualified cardinality: 1
subclass of: Restriction
  author of change: Marinus Vonhof
  date of change: 2016-04-13
  author at start life: Marinus Vonhof
  date of start life: 2014-04-29
  on class: Bijzondere putconstructie
  on property: has as part (inverse)
  max qualified cardinality: 1
subclass of: Restriction
  on property: heeft Technologie
  has value: Statisch

Binnenonderkant buis
author of change: Marinus Vonhof
date of change: 2015-06-01
definition: Hoogteligging t.o.v. NAP van de binnen-onderkant-buis van de leiding
author at start life: Marinus Vonhof
date of start life: 2014-11-28
units of measurements: m
see also: [IRIS-RIOKEN:2012] Binnonderkant buis
alternative label: B.o.b.
alternative label: B.o.k.
comment: [is aspect]
scope note: Cof TOP
type: Class
subclass of: Hoogte t.o.v. NAP
subclass of: Restriction
  on property: has as value
  all values from: decimal

Eindpunt onderdeel
author of change: Marinus Vonhof
date of change: 2017-12-12
definition: Als het eindpunt ontbreekt bij het onderdeel (doorlaat, pomp, wand) wordt uitgegaan van externe lozing. Het transport verdwijnt uit het stelsel
author at start life: Marinus Vonhof
date of start life: 2012-04-22
scope note: Cof MDS
scope note: Cof REV
scope note: Cof HYD
type: Class
subclass of: Vertex
subclass of: Restriction
  author of change: Marinus Vonhof
  date of change: 2017-12-07
  author at start life: Marinus Vonhof
  date of start life: 2012-04-22
  on class: Onderdeeloriëntatie
  on property: has as part (inverse)
  qualified cardinality: 1
subclass of: Restriction
  author at start life: Marinus Vonhof
  date of start life: 2017-12-12
  validity context: 5t 11t
  on class: Knooppunt
  on property: is connected to
  max qualified cardinality: 1

Blinde inlaat
author of change: Marinus Vonhof
date of change: 2025-01-16
definition: Een afgedopte inlaat, zonder aansluiting
author at start life: Marinus Vonhof
date of start life: 2021-08-06
scope note: Cof MDS
scope note: Cof LDR
scope note: Cof REV
type: Class
subclass of: Inlaat
subclass of: Restriction
  on property: heeft Toepassing
  has value: Aansluiting ontbreekt
subclass of: Restriction
  on property: heeft Uitvoering
  has value: Afgedopt

Blinde put
author of change: Marinus Vonhof
author of change: Eric van Gorkom
date of change: 2022-09-27
date of change: 2015-07-09
author at start life: Marinus Vonhof
date of start life: 2012-05-01
scope note: Cof REV
scope note: Cof BAS
scope note: Cof HYD
type: Class
subclass of: Put
subclass of: Extra objecttype (rol)
subclass of: Restriction
  on property: heeft Uitvoering
  has value: Geen opening aan de bovenzijde

B.o.b. eindpunt leiding
definition: Binnenonderkant buis ter plaatse van het eindpunt
notation: AXH
notation: GXH
author at start life: Marinus Vonhof
date of start life: 2013-03-26
units of measurements: m
alternative label: B.o.b. bij eindknoop t.o.v. NAP
comment: [is aspect]
scope note: Cof TOP
type: Class
subclass of: Binnenonderkant buis
subclass of: Restriction
  author of change: Marinus Vonhof
  date of change: 2018-12-06
  author at start life: Marinus Vonhof
  date of start life: 2016-11-09
  validity context: *t
  on class: Eindpunt leiding
  on property: has as aspect (inverse)
  qualified cardinality: 1
subclass of: Restriction
  author at start life: Marinus Vonhof
  date of start life: 2015-10-29
  on class: Inwinning
  on property: has as aspect
  max qualified cardinality: 1
subclass of: Restriction
  on property: has as value
  all values from: decimal

Bochtstuk
author of change: Marinus Vonhof
date of change: 2017-12-13
definition: Een buis of buisstuk in de vorm van een bocht.
author at start life: Finy Teitsma (Oranjewoud)
date of start life: 2006-05-23
scope note: Cof MDS
scope note: Cof LDR
scope note: Cof REV
scope note: Cof PLI
scope note: Cof HYD
type: Class
subclass of: Verbindingsstuk
subclass of: Restriction
  on property: heeft Uitvoering
  has value: Buis in gebogen vorm
subclass of: Restriction
  on property: heeft Functie
  has value: Verbinden van leidingen in een hoek

Bodemprofiel
author of change: Marinus Vonhof
date of change: 2024-07-15
definition: Een regelvoorziening voor het geleiden van de afvoer van afvalwater.
definition: [NEN 3300:1996] beloop voor geleiding van de afvoer van water
author at start life: Johan Post
date of start life: 2024-04-30
alternative label: Stroomprofiel
comment: [is aspect]
scope note: Cof REV
scope note: Cof BAS
type: Class
subclass of: Vorm
subclass of: Restriction
  on property: has as reference (qualification)
  all values from: Bodemprofiel (coll)
subclass of: Restriction
  on property: heeft Functie
  has value: Geleiden van de afvoer van het afvalwater
subclass of: Restriction
  on class: Rioolput
  on property: has as aspect (inverse)
  max qualified cardinality: 1

Vorm
author of change: Marinus Vonhof
date of change: 2025-01-16
definition: Geometrische omschrijving
definition: [IMBOR] Kwalitatieve aanduiding van de contouren van een beheerobject.
author at start life: Marinus Vonhof
date of start life: 2016-04-23
validity context: 15d
comment: [is aspect]
scope note: Cof TOP
type: Class
subclass of: Kenmerk

Bodemprofiel (coll)
comment: [is coll]
scope note: Cof REV
scope note: Cof BAS
type: Class
subclass of: Verzameling soorten
subclass of: Class
  one of: Geulprofiel
  one of: Bolle bodem
  one of: Vlakke bodem
  one of: Vlakke bodem met banken

Onderzoeken
author of change: Marinus Vonhof
date of change: 2015-08-24
definition: [NEN 3300:1996] Verzamelen, ordenen, analyseren en verwerken van gegevens, zodat informatie kan worden afgeleid over de toestand en het functioneren van de buitenriolering
author at start life: Marinus Vonhof
date of start life: 2013-03-26
validity context: 1f 3f 5d 10f 11d 12f 14f
scope note: Cof TOP
type: Class
subclass of: Maatregel

Rioolgemaal
author of change: Marinus Vonhof
author of change: Johan Post
date of change: 2024-04-30
date of change: 2017-08-19
definition: Een gemaal voor het verpompen van afvalwater.
definition: [NEN 3300:1996] een inrichting voor het verpompen van afvalwater
definition: [NEN-EN 752:2008] geheel van gebouw, constructies en apparatuur dat wordt gebruikt om afvalwater via een persleiding te transporteren of om het afvalwater op andere wijze omhoog te brengen
author at start life: Marinus Vonhof
date of start life: 2012-04-29
see also: [IRIS-RIOKEN:2012] Civiel werk waarin alle technische voorzieningen zijn ondergebracht die benodigd zijn voor het verpompen van rioolwater. Voor het waterschap zijn in principe alleen de riooleindgemalen interessant, waar overdracht van afvalwater plaatsvindt naar een stelsel dat onder beheer van dit waterschap is.
see also: [IRIS-RIOKEN:2012] Influentgemaal is synoniem van Rioolgemaal
alternative label: Influentgemaal
scope note: Cof TOP
type: Class
subclass of: Gemaal
subclass of: Restriction
  author of change: Marinus Vonhof
  date of change: 2019-07-10
  author at start life: Marinus Vonhof
  date of start life: 2014-10-14
  on class: Transportstelsel
  on property: has as part (inverse)
  max qualified cardinality: 1
subclass of: Restriction
  author of change: Marinus Vonhof
  date of change: 2017-03-06
  author at start life: Nic Roest (Idoro)
  date of start life: 2007-11-29
  on class: Persleiding
  on property: is connected to
  min qualified cardinality: 0
subclass of: Restriction
  author at start life: Marinus Vonhof
  date of start life: 2020-05-26
  on class: Gemengd rioolstelsel
  on property: has as part (inverse)
  max qualified cardinality: 1
subclass of: Restriction
  author at start life: Marinus Vonhof
  date of start life: 2020-05-26
  on class: Verbeterd hemelwaterstelsel
  on property: has as part (inverse)
  max qualified cardinality: 1
subclass of: Restriction
  author at start life: Marinus Vonhof
  date of start life: 2020-05-26
  on class: Vuilwaterstelsel
  on property: has as part (inverse)
  max qualified cardinality: 1
subclass of: Restriction
  on property: heeft Functie
  has value: Verpompen van afvalwater

Breedte bouwwerk
author of change: Marinus Vonhof
date of change: 2024-05-16
date of change: 2017-08-21
definition: De inwendige breedte van het bouwwerk
author at start life: Nic Roest (Idoro)
date of start life: 2006-02-21
units of measurements: mm
comment: Intrinsiek aspect
comment: [is aspect]
scope note: Cof MDS
scope note: Cof REV
scope note: Cof HYD
scope note: Cof RGM
type: Class
subclass of: Breedte
subclass of: Restriction
  author of change: Marinus Vonhof
  date of change: 2017-08-21
  author at start life: Finy Teitsma (Oranjewoud)
  date of start life: 2006-02-25
  validity context: 5t 11t
  on class: Bouwwerk
  on property: has as aspect (inverse)
  max qualified cardinality: 1
subclass of: Restriction
  on property: has as value
  all values from: Breedte bouwwerk (datatype)

Lengte bouwwerk
author of change: Marinus Vonhof
date of change: 2024-05-16
date of change: 2017-08-21
definition: De inwendige lengte van het bouwwerk
author at start life: Nic Roest (Idoro)
date of start life: 2006-02-21
units of measurements: mm
validity context: 15d
comment: [is aspect]
scope note: Cof MDS
scope note: Cof REV
scope note: Cof HYD
scope note: Cof RGM
type: Class
subclass of: Lengte
subclass of: Restriction
  author of change: Marinus Vonhof
  date of change: 2017-08-21
  author at start life: Finy Teitsma (Oranjewoud)
  date of start life: 2006-02-25
  validity context: 5t 11t
  on class: Bouwwerk
  on property: has as aspect (inverse)
  max qualified cardinality: 1
subclass of: Restriction
  on property: has as value
  all values from: Lengte bouwwerk (datatype)

Vorm bouwwerk
author of change: Marinus Vonhof
date of change: 2013-09-20
author at start life: Marinus Vonhof
date of start life: 2012-05-01
comment: Intrinsiek aspect
alternative label: Bouwwerkvorm
comment: [is aspect]
scope note: Cof MDS
scope note: Cof REV
scope note: Cof HYD
scope note: Cof RGM
type: Class
subclass of: Vorm
subclass of: Restriction
  author of change: Marinus Vonhof
  date of change: 2017-08-21
  author at start life: Finy Teitsma (Oranjewoud)
  date of start life: 2006-02-25
  validity context: 5t 11t
  on class: Bouwwerk
  on property: has as aspect (inverse)
  max qualified cardinality: 1
subclass of: Restriction
  on property: has as reference (qualification)
  all values from: Vorm put (coll)

Hoogte bouwwerk
author of change: Marinus Vonhof
date of change: 2024-05-16
date of change: 2017-08-21
definition: De inwendige hoogte van het bouwwerk
author at start life: Nic Roest (Idoro)
date of start life: 2006-02-21
units of measurements: mm
validity context: 5t 11t
comment: Intrinsiek aspect
comment: [is aspect]
scope note: Cof MDS
scope note: Cof REV
scope note: Cof HYD
type: Class
subclass of: Hoogte
subclass of: Restriction
  author of change: Marinus Vonhof
  date of change: 2017-08-21
  author at start life: Finy Teitsma (Oranjewoud)
  date of start life: 2006-02-25
  on class: Bouwwerk
  on property: has as aspect (inverse)
  max qualified cardinality: 1
subclass of: Restriction
  on property: has as value
  all values from: Hoogte bouwwerk (datatype)

Bouwwerkoriëntatie
author of change: Marinus Vonhof
date of change: 2018-12-05
definition: Een topologisch element dat de contouren (edge) of het zwaartepunt (vertex) van een bouwwerk beschrijft
author at start life: Marinus Vonhof
date of start life: 2017-12-12
scope note: Cof TOP
type: Class
subclass of: Knooppunt
subclass of: Restriction
  author of change: Marinus Vonhof
  date of change: 2017-08-21
  author at start life: Marinus Vonhof
  date of start life: 2017-08-19
  on class: Maaiveldoriëntatie
  on property: is connected to
  max qualified cardinality: 1
subclass of: Restriction
  author of change: Marinus Vonhof
  date of change: 2018-05-03
  author at start life: Marinus Vonhof
  date of start life: 2017-08-19
  validity context: 5t 11t
  on class: Bouwwerk
  on property: has as aspect (inverse)
  max qualified cardinality: 1
subclass of: Restriction
  author of change: Marinus Vonhof
  date of change: 2020-04-18
  date of change: 2026-07-24
  author at start life: Marinus Vonhof
  date of start life: 2016-11-09
  comment: Temporeel kenmerk, met kenmerk Inwinning
  on class: Buitengrens
  on property: has as aspect
  max qualified cardinality: 1

Status functioneren
author of change: Marinus Vonhof
date of change: 2018-05-03
author at start life: Marinus Vonhof
date of start life: 2014-12-02
validity context: 6d 15d
comment: [is aspect]
scope note: Cof REV
scope note: Cof BAS
scope note: Cof RGM
scope note: Cof DMO
type: Class
subclass of: Kenmerk
subclass of: Restriction
  author of change: Marinus Vonhof
  date of change: 2018-12-06
  author at start life: Marinus Vonhof
  date of start life: 2014-12-02
  on class: Bouwwerk
  on property: has as aspect (inverse)
  max qualified cardinality: 1
subclass of: Restriction
  author at start life: Marinus Vonhof
  date of start life: 2014-12-02
  on class: Leiding
  on property: has as aspect (inverse)
  max qualified cardinality: 1
subclass of: Restriction
  author at start life: Marinus Vonhof
  date of start life: 2014-12-02
  on class: Put
  on property: has as aspect (inverse)
  max qualified cardinality: 1
subclass of: Restriction
  author at start life: Marinus Vonhof
  date of start life: 2023-01-10
  on class: Inwinning
  on property: has as aspect
  max qualified cardinality: 1
subclass of: Restriction
  on property: has as reference (qualification)
  all values from: Status functioneren (coll)

Materiaal bouwwerk
author at start life: Marinus Vonhof
date of start life: 2015-05-29
comment: Intrinsiek aspect
comment: [is aspect]
scope note: Cof MDS
scope note: Cof REV
scope note: Cof HYD
scope note: Cof RGM
type: Class
subclass of: Materiaal
subclass of: Restriction
  author at start life: Marinus Vonhof
  date of start life: 2017-08-21
  validity context: 5t 11t
  on class: Bouwwerk
  on property: has as aspect (inverse)
  max qualified cardinality: 1
subclass of: Restriction
  on property: has as reference (qualification)
  all values from: Materiaal put (coll)

Buitengrens
author of change: Marinus Vonhof
date of change: 2024-07-17
date of change: 2020-11-24
date of change: 2024-12-07
definition: Het vlak dat de buitengrens beschrijft van de ruimte of de bovenkant van de constructie (topini: outer boundary/1661)
author at start life: Marinus Vonhof
date of start life: 2013-09-03
units of measurements: gml
comment: [is aspect]
scope note: Cof TOP
type: Class
subclass of: Vlak
subclass of: Restriction
  author of change: Marinus Vonhof
  date of change: 2020-04-18
  author at start life: Marinus Vonhof
  date of start life: 2012-11-23
  on class: Putoriëntatie
  on property: has as aspect (inverse)
  max qualified cardinality: 1
subclass of: Restriction
  author of change: Marinus Vonhof
  date of change: 2020-04-18
  author at start life: Marinus Vonhof
  date of start life: 2016-11-09
  on class: Bouwwerkoriëntatie
  on property: has as aspect (inverse)
  max qualified cardinality: 1
subclass of: Restriction
  on property: has as value
  all values from: gmlLiteral

Ruimte
author of change: Marinus Vonhof
date of change: 2017-11-16
definition: [Gellish] Is an inanimate physical object (a physical object that is not capable of life) that is volumetric and is enclosed by physical or imaginary boundaries and exists in time. This is distinguished from a volumetric spatial aspect and from a volume as a property. @en
author at start life: Marinus Vonhof
date of start life: 2013-09-03
validity context: *f 15d
comment: 2 of meer
comment: [cfk fout]
scope note: Cof TOP
type: Class
subclass of: Restriction
  on property: has as part
  all values from: Class
    union of: Ruimte
    union of: Fysiek object
disjoint with: Fysiek object

Breedte
author of change: Marinus Vonhof
date of change: 2015-05-29
definition: In zelfde vlak als lengte, haaks op lengtemeting
author at start life: Nic Roest (Idoro)
date of start life: 2006-02-21
validity context: 15d
comment: [is aspect]
scope note: Cof TOP
type: Class
subclass of: Afstand

Breedte opening
author of change: Marinus Vonhof
date of change: 2015-06-01
author at start life: Marinus Vonhof
date of start life: 2011-12-15
units of measurements: mm
comment: Intrinsiek aspect
comment: [is aspect]
scope note: Cof MDS
scope note: Cof REV
scope note: Cof HYD
type: Class
subclass of: Breedte
subclass of: Restriction
  author of change: Marinus Vonhof
  date of change: 2017-12-07
  author at start life: Marinus Vonhof
  date of start life: 2011-12-15
  validity context: 5t 11t
  on class: Doorlaat
  on property: has as aspect (inverse)
  max qualified cardinality: 1
subclass of: Restriction
  on property: has as value
  all values from: integer

Doorlaat
author of change: Marinus Vonhof
date of change: 2018-12-13
definition: Een regelvoorziening voor de stroming van het afvalwater.
notation: DRL
author at start life: Marinus Vonhof
date of start life: 2012-05-05
validity context: *f
comment: [cfk fout]
scope note: Cof MDS
scope note: Cof REV
scope note: Cof PLI
scope note: Cof HYD
scope note: Cof DMO
type: Class
subclass of: Constructieonderdeel
subclass of: Restriction
  author of change: Marinus Vonhof
  date of change: 2017-12-07
  author at start life: Marinus Vonhof
  date of start life: 2011-12-15
  validity context: 11t 14t
  on class: Hoogte opening
  on property: has as aspect
  max qualified cardinality: 1
subclass of: Restriction
  author of change: Marinus Vonhof
  date of change: 2017-12-07
  author at start life: Marinus Vonhof
  date of start life: 2011-12-15
  validity context: 5t 11t 14t
  on class: Breedte opening
  on property: has as aspect
  max qualified cardinality: 1
subclass of: Restriction
  author of change: Marinus Vonhof
  date of change: 2017-12-07
  author at start life: Marinus Vonhof
  date of start life: 2011-12-15
  validity context: 5t 11t 14t
  on class: Vorm opening
  on property: has as aspect
  max qualified cardinality: 1
subclass of: Restriction
  author at start life: Marinus Vonhof
  date of start life: 2011-12-15
  on property: has as aspect
  some values from: Breedte opening
subclass of: Restriction
  author at start life: Marinus Vonhof
  date of start life: 2011-12-15
  on property: has as aspect
  some values from: Hoogte opening
subclass of: Restriction
  author at start life: Marinus Vonhof
  date of start life: 2011-12-15
  on property: has as aspect
  some values from: Vorm opening
subclass of: Restriction
  author at start life: Marinus Vonhof
  date of start life: 2012-04-22
  validity context: 5t 11t 14t
  on class: Onderdeeloriëntatie
  on property: has as aspect
  max qualified cardinality: 1
subclass of: Restriction
  author at start life: Marinus Vonhof
  date of start life: 2017-12-07
  validity context: 5t 11t 14t
  on class: Doorlaatniveau
  on property: has as aspect
  max qualified cardinality: 1
subclass of: Restriction
  author at start life: Marinus Vonhof
  date of start life: 2026-07-20
  on class: Rioolleiding
  on property: has as part (inverse)
  max qualified cardinality: 1
subclass of: Restriction
  author at start life: Marinus Vonhof
  date of start life: 2026-07-20
  on class: Transportleiding
  on property: has as part (inverse)
  max qualified cardinality: 1
subclass of: Restriction
  on property: heeft Functie
  has value: Beperken debiet

Breedte put
author of change: Marinus Vonhof
author of change: Johan Post
date of change: 2021-08-06
date of change: 2026-05-01
definition: De inwendige breedte (horizontaal, uit het bovenaanzicht). Indien aanwezig de breedte van de onderbak - zie afbeelding dc (bron EN13508-2)
author at start life: Marinus Vonhof
date of start life: 2018-10-17
units of measurements: mm
comment: Intrinsiek aspect
comment: [is aspect]
scope note: Cof TOP
type: Class
subclass of: Breedte
subclass of: Restriction
  author of change: Marinus Vonhof
  date of change: 2014-08-01
  author at start life: Finy Teitsma (Oranjewoud)
  date of start life: 2006-02-25
  validity context: *t
  on class: Put
  on property: has as aspect (inverse)
  qualified cardinality: 1
subclass of: Restriction
  on property: has as value
  all values from: Breedte put (datatype)

Overstortput
label: Combined sewer overflow @en
author of change: Marinus Vonhof
author of change: Wouter van Riel
date of change: 2024-04-20
date of change: 2024-05-17
definition: Een rioolput voorzien van een overstortdrempel met een ontworpen drempellengte en -hoogte.
definition: [EN 16323:2014] device on a combined system that relieves the system of excess flow @en
definition: [NEN 3300:1996] rioolput voorzien van een overstortdrempel
definition: [Omgevingswet] Een kunstwerk waarmee rioolwater op het oppervlaktewater wordt geloosd, zodra het riool door te grote neerslaghoeveelheden niet al het rioolwater kan verwerken
author at start life: Finy Teitsma (Oranjewoud)
date of start life: 2006-02-20
validity context: 3f 10f 11f 14f
see also: [IRIS-RIOKEN:2012] Een inzamelknooppunt, uitgevoerd als voorziening met drempel, voor het onder bepaalde omstandigheden lozen van afvalwater uit het rioleringsnetwerk naar een ander rioleringsnetwerk of oppervlaktewater in de zin van de Wet verontreiniging oppervlaktewateren. Een riooloverstort is dus een voorziening door middel waarvan bij de neerslag van hemelwater het teveel aan hemelwater, al of niet vermengd met afvalwater dat niet in het stelsel wordt geborgen, kan worden geloosd op oppervlaktewater.
alternative label: Overstort
alternative label: Riooloverstort
scope note: Cof TOP
type: Class
subclass of: Rioolput
subclass of: Restriction
  author of change: Marinus Vonhof
  date of change: 2021-08-06
  author at start life: Finy Teitsma (Oranjewoud)
  date of start life: 2006-02-25
  comment: per definitie
  on class: Overstortdrempel
  on property: has as part
  min qualified cardinality: 1
subclass of: Restriction
  on property: heeft Toepassing
  has value: Calamiteit
subclass of: Restriction
  on property: heeft Functie
  has value: Overtollig afvalwater laten wegstromen

Status functioneren (coll)
validity context: 6d
comment: [is coll]
scope note: Cof REV
scope note: Cof BAS
scope note: Cof DMO
type: Class
subclass of: Verzameling soorten
subclass of: Class
  one of: In ontwerp
  one of: In gebruik
  one of: In aanleg
  one of: Buiten gebruik

Vlak
author of change: Marinus Vonhof
date of change: 2019-05-15
definition: Tweedimensionaal geometrisch element. Voor geografische beschrijvingen conform coordinatenstelsel EPSG:7415 (x/y conform EPSG:28992, optioneel z conform EPSG:5709).
author at start life: Marinus Vonhof
date of start life: 2016-11-09
units of measurements: gml
comment: [is aspect]
scope note: Cof TOP
type: Class
subclass of: Geometrie
subclass of: Restriction
  on property: has as value
  all values from: gmlLiteral

Putoriëntatie
author of change: Marinus Vonhof
date of change: 2018-12-10
definition: Een topologisch element dat het zwaartepunt (vertex) van de bovenkant putbodem en/of de contouren van de constructie (edge) beschrijft.
author at start life: Marinus Vonhof
date of start life: 2017-12-12
scope note: Cof TOP
type: Class
subclass of: Knooppunt
subclass of: Restriction
  author of change: Marinus Vonhof
  date of change: 2017-12-12
  author at start life: Marinus Vonhof
  date of start life: 2015-11-07
  validity context: 5t 11t
  on class: Maaiveldoriëntatie
  on property: is connected to
  max qualified cardinality: 1
subclass of: Restriction
  author of change: Marinus Vonhof
  date of change: 2020-04-18
  author at start life: Marinus Vonhof
  date of start life: 2012-11-23
  comment: Temporeel kenmerk, met kenmerk Inwinning
  on class: Buitengrens
  on property: has as aspect
  min qualified cardinality: 0
subclass of: Restriction
  author at start life: Marinus Vonhof
  date of start life: 2012-04-22
  validity context: *t
  on class: Put
  on property: has as aspect (inverse)
  qualified cardinality: 1

Materiaal put
label: Material (manhole) @en
author of change: Marinus Vonhof
date of change: 2014-12-17
definition: [EN13508-2+A1] The material of the fabric of the manhole or inspection chamber in accordance with Table C.4. @en
notation: CCD
notation: ECD
notation: JCD
author at start life: Marinus Vonhof
date of start life: 2012-05-01
comment: Intrinsiek aspect
alternative label: Putmateriaal
comment: [is aspect]
scope note: Cof TOP
type: Class
subclass of: Materiaal
subclass of: Restriction
  author of change: Marinus Vonhof
  date of change: 2015-06-01
  author at start life: Finy Teitsma (Oranjewoud)
  date of start life: 2007-10-24
  validity context: *t
  on class: Put
  on property: has as aspect (inverse)
  qualified cardinality: 1
subclass of: Restriction
  on property: has as reference (qualification)
  all values from: Materiaal put (coll)

Deelmodel Revisies
author of change: Marinus Vonhof
date of change: 2025-10-07
date of change: 2025-12-22
definition: Registratie revisies en inmetingen. De term 'revisie' wordt gebruikt voor het inmeten van de objectgegevens na de aanleg (de realisatie van het ontwerp). GWSW Revisies heeft een bredere scope, ook het inmeten van al langer in gebruik zijnde objecten is een toepassing van dit deelmodel.
author at start life: Johan Post
date of start life: 2024-09-10
comment: [cfk=16]
scope note: Cof REV
scope note: Cof BAS
type: Class
subclass of: GWSW Deelmodel

Stuwput
author of change: Marinus Vonhof
date of change: 2015-02-28
date of change: 2026-07-20
definition: Een rioolput voorzien van een wand met opening of bijvoorbeeld een wervelventiel om de bergingscapaciteit van het bovenstroomse rioolstelsel te benutten.
definition: [NEN 3300:1996] Rioolput voorzien van een afvoerbeperking
author at start life: Finy Teitsma (Oranjewoud)
date of start life: 2006-02-20
comment: 20151014: NEN3300-definitie aangepast
scope note: Cof MDS
scope note: Cof RRB
scope note: Cof LDR
scope note: Cof REV
scope note: Cof HYD
type: Class
subclass of: Rioolput
subclass of: Restriction
  author of change: Marinus Vonhof
  date of change: 2018-12-12
  author at start life: Marinus Vonhof
  date of start life: 2017-12-07
  on class: Opening in wand
  on property: has as part
  max qualified cardinality: 1
subclass of: Restriction
  author at start life: Marinus Vonhof
  date of start life: 2017-12-07
  on class: Stuwmuur
  on property: has as part
  max qualified cardinality: 1
subclass of: Restriction
  author at start life: Marinus Vonhof
  date of start life: 2018-12-12
  on class: Wervelventiel
  on property: has as part
  max qualified cardinality: 1
subclass of: Restriction
  on property: heeft Functie
  has value: Waterniveau in stelsel regelen

Pompunit
author of change: Marinus Vonhof
author of change: Johan Post
date of change: 2024-05-16
date of change: 2022-10-02
date of change: 2017-05-30
date of change: 2026-05-18
definition: Pompput in een drukrioleringsstelsel
author at start life: Marinus Vonhof
date of start life: 2012-04-24
validity context: 12d
see also: [Waterkring West] Onderdeel van een mechanisch rioolstelsel
alternative label: Drukrioleringsunit
alternative label: Minigemaal
scope note: Cof MDS
scope note: Cof REV
scope note: Cof RGM
scope note: Cof DMO
type: Class
subclass of: Rioolput
subclass of: Restriction
  author at start life: Marinus Vonhof
  date of start life: 2022-10-02
  on class: Veiligheidsrooster
  on property: has as part
  max qualified cardinality: 1
subclass of: Restriction
  on property: heeft Functie
  has value: Inzameling van afvalwater
subclass of: Restriction
  on property: heeft Functie
  has value: Verpompen van afvalwater

Klimijzer
author of change: Marinus Vonhof
date of change: 2025-01-16
definition: [IMBOR] Ingestorte stalen of aluminium staven in een beton- of baksteenconstructie die gebruikt kan worden als ladderconstructie.
author at start life: Marinus Vonhof
date of start life: 2018-03-20
validity context: 10d 14d
scope note: Cof LDR
scope note: Cof REV
scope note: Cof BAS
scope note: Cof MTR
type: Class
subclass of: Constructieonderdeel
subclass of: Restriction
  author at start life: Marinus Vonhof
  date of start life: 2019-05-15
  on class: Rioolput
  on property: has as part (inverse)
  max qualified cardinality: 1
subclass of: Restriction
  on property: heeft Uitvoering
  has value: Metalen beugel

T-stuk
author of change: Marinus Vonhof
date of change: 2025-01-16
date of change: 2018-10-17
definition: Een verbindingsstuk dat drie leidingen onder een rechte hoek (haaks) verbindt
definition: [IMBOR] Een verbindingsstuk in de vorm van een T-splitsing.
author at start life: Marinus Vonhof
date of start life: 2012-04-24
validity context: 1d
scope note: Cof MDS
scope note: Cof LDR
scope note: Cof REV
scope note: Cof PLI
scope note: Cof HYD
type: Class
subclass of: Verbindingsstuk
subclass of: Restriction
  on property: heeft Functie
  has value: Verbinden van drie leidingen

Contactpersoon
author of change: Marinus Vonhof
date of change: 2024-09-18
date of change: 2016-04-20
author at start life: Marinus Vonhof
date of start life: 2014-09-25
scope note: Cof REV
scope note: Cof DMO
type: Class
subclass of: Levensvorm
subclass of: Restriction
  on class: Revisieproject
  on property: has as input (inverse)
  qualified cardinality: 1

Revisieproject
author of change: Marinus Vonhof
date of change: 2025-12-22
definition: Een project dat tot doel heeft een inmeting te verrichten of een revisie te maken. Een revisieproject gebruikt de brongegevens van de in te meten objecten, dit kunnen gegevens zijn van bestaande objecten (uit een database) of van nieuwe objecten (uit een CAD/NLCS-ontwerp). Als projectresultaat worden de inmetingen terug geleverd, vaak wordt hierbij ook een verschilanalyse uitgevoerd.
author at start life: Johan Post
date of start life: 2024-09-10
scope note: Cof REV
type: Class
subclass of: Project
subclass of: Restriction
  on class: Inmeten knooppunt
  on property: has as part
  min qualified cardinality: 0
subclass of: Restriction
  on class: Inmeten leiding
  on property: has as part
  min qualified cardinality: 0
subclass of: Restriction
  on class: Contactpersoon
  on property: has as input
  qualified cardinality: 1

Datum inwinning
author of change: Johan Post
date of change: 2022-09-29
author at start life: Marinus Vonhof
date of start life: 2015-10-29
units of measurements: yyyy-mm-dd
alternative label: Inwinningsdatum
comment: [is aspect]
scope note: Cof TOP
type: Class
subclass of: Datum
subclass of: Restriction
  date of change: 2019-04-25
  author at start life: Marinus Vonhof
  date of start life: 2015-10-29
  on class: Inwinning
  on property: has as aspect (inverse)
  max qualified cardinality: 1
subclass of: Restriction
  on property: has as value
  all values from: date

Datum maatregel
author of change: Marinus Vonhof
date of change: 2019-03-14
definition: De datum waarop de status van de maatregel (ontwerp, uitgevoerd) is ingegaan. Als de status ontbreekt de datum waarop de uitvoering van de maatregel is afgerond
author at start life: Marinus Vonhof
date of start life: 2013-03-26
units of measurements: yyyy-mm-dd
validity context: 6d 15d
comment: [is aspect]
scope note: Cof TOP
type: Class
subclass of: Datum
subclass of: Restriction
  author of change: Marinus Vonhof
  date of change: 2018-05-01
  author at start life: Marinus Vonhof
  date of start life: 2013-03-26
  validity context: *t
  on class: Maatregel
  on property: has as aspect (inverse)
  qualified cardinality: 1
subclass of: Restriction
  on property: has as value
  all values from: date

Persleiding
label: Pressure main @en
author of change: Marinus Vonhof
author of change: Wouter van Riel
date of change: 2018-12-13
date of change: 2024-04-23
definition: Een gesloten leiding waarin het afvalwater door middel van overdruk wordt getransporteerd.
definition: [EN 16323:2014] pipeline for conveying wastewater under pressure @en
definition: [NEN 3300:1996] leiding waardoor onder overdruk afvalwater wordt getransporteerd
definition: [NEN-EN 752:2008] leiding waardoor afvalwater wordt gepompt [EN 1085:2007, definitie 2170]
author at start life: Marinus Vonhof
author at start life: Finy Teitsma (Oranjewoud)
date of start life: 2007-10-23
validity context: 1d 12d
scope note: Cof TOP
type: Class
subclass of: Mechanische transportleiding
subclass of: Restriction
  author of change: Marinus Vonhof
  date of change: 2017-03-06
  author at start life: Nic Roest (Idoro)
  date of start life: 2007-11-29
  on class: Rioolgemaal
  on property: is connected to
  max qualified cardinality: 1
subclass of: Restriction
  on property: heeft Technologie
  has value: Transport onder overdruk

GWSW Deelmodel
author of change: Marinus Vonhof
date of change: 2025-11-18
definition: Een selectie van het GWSW Datamodel, gericht op een specifieke toepassing.
author at start life: Marinus Vonhof
date of start life: 2021-02-17
scope note: Cof REV
scope note: Cof BAS
type: Class
subclass of: Informatiedrager
subclass of: Restriction
  author at start life: Marinus Vonhof
  date of start life: 2026-07-24
  on class: Gegevenswoordenboek Stedelijk Water
  on property: has as part (inverse)
  qualified cardinality: 1

Deksel
label: Cover @en
author of change: Marinus Vonhof
author of change: Eric van Gorkom
author of change: Wouter van Riel
date of change: 2025-01-16
date of change: 2018-05-03
date of change: 2022-09-27
date of change: 2024-04-22
definition: [IMBOR] Een verwijderbare afdekking van een bepaald object.
notation: B
author at start life: Marinus Vonhof
date of start life: 2013-09-29
validity context: *f
comment: [cfk fout]
scope note: Cof MDS
scope note: Cof EN
scope note: Cof RRB
scope note: Cof REV
type: Class
subclass of: Afdekking
subclass of: Restriction
  author of change: Marinus Vonhof
  date of change: 2021-08-06
  author at start life: Marinus Vonhof
  date of start life: 2020-04-18
  on class: Kolk
  on property: has as part (inverse)
  qualified cardinality: 1
subclass of: Restriction
  author at start life: Johan Post
  date of start life: 2026-05-04
  on class: Spuikolk
  on property: has as part (inverse)
  max qualified cardinality: 1
subclass of: Restriction
  author at start life: Marinus Vonhof
  date of start life: 2014-11-16
  on property: has as aspect
  some values from: Lengte afdekking
subclass of: Restriction
  on property: heeft Functie
  has value: Afdekken
subclass of: Restriction
  on property: heeft Functie
  has value: Toegankelijk houden

Melding meting deksel (coll)
author at start life: Marinus Vonhof
date of start life: 2024-09-18
comment: [is coll]
scope note: Cof REV
type: Class
subclass of: Verzameling soorten
subclass of: Class
  one of: Deksel ontbreekt
  one of: Deksel gebroken
  one of: Gebroken putrand
  one of: Deksel niet op hart put
  one of: Deksel naast object
  one of: Deksel onder maaiveld
  one of: Deksel boven maaiveld
  one of: Deksel zit vast

Resultaat
author of change: Marinus Vonhof
date of change: 2024-05-16
date of change: 2020-10-09
definition: Bij activiteit: de output, het rapport
author at start life: Marinus Vonhof
date of start life: 2014-04-29
validity context: 1d 3d 5d 6d 10d 11d 12d 14d
scope note: Cof TOP
type: Class
subclass of: Informatiedrager

Diameter
author of change: Marinus Vonhof
date of change: 2018-12-05
definition: De lengte van de koorde die het middelpunt van de cirkel snijdt
definition: Zowel een lijn (de koorde die het middelpunt van de cirkel snijdt) als de lengte van die lijn
author at start life: Nic Roest (Idoro)
date of start life: 2006-02-21
validity context: 15d
alternative label: Middellijn
comment: [is aspect]
scope note: Cof TOP
type: Class
subclass of: Afstand

Dikte
author of change: Marinus Vonhof
date of change: 2015-05-29
definition: In de richting haaks op het vlak van een plat voorwerp, waarbij de meetpunten op de buitenkant liggen
author at start life: Nic Roest (Idoro)
date of start life: 2006-02-21
validity context: 15d
comment: [is aspect]
scope note: Cof TOP
type: Class
subclass of: Afstand

Onderscheidend kenmerk
author of change: Marinus Vonhof
date of change: 2021-01-09
definition: Een dicriminerend (onderscheidend) kenmerk
author at start life: Marinus Vonhof
date of start life: 2015-02-25
comment: [is aspect]
scope note: Cof TOP
type: Class
subclass of: Kenmerk

Hoogte opening
author of change: Marinus Vonhof
date of change: 2015-02-28
author at start life: Marinus Vonhof
date of start life: 2011-12-15
units of measurements: mm
comment: Intrinsiek aspect
comment: [is aspect]
scope note: Cof MDS
scope note: Cof REV
scope note: Cof HYD
type: Class
subclass of: Hoogte
subclass of: Restriction
  author of change: Marinus Vonhof
  date of change: 2017-12-07
  author at start life: Marinus Vonhof
  date of start life: 2011-12-15
  on class: Doorlaat
  on property: has as aspect (inverse)
  max qualified cardinality: 1
subclass of: Restriction
  on property: has as value
  all values from: integer

Vorm opening
author of change: Eric van Gorkom
date of change: 2024-05-13
definition: A 2 48-49 Vst rond
author at start life: Marinus Vonhof
date of start life: 2011-12-15
comment: Intrinsiek aspect
comment: [is aspect]
scope note: Cof MDS
scope note: Cof REV
scope note: Cof HYD
type: Class
subclass of: Vorm
subclass of: Restriction
  author of change: Marinus Vonhof
  date of change: 2017-12-07
  author at start life: Marinus Vonhof
  date of start life: 2011-12-15
  validity context: 5t 11t
  on class: Doorlaat
  on property: has as aspect (inverse)
  max qualified cardinality: 1
subclass of: Restriction
  on property: has as reference (qualification)
  all values from: Vorm opening (coll)

Doorlaatniveau
author of change: Marinus Vonhof
date of change: 2019-08-12
definition: Niveau binnenonderkant doorlaatopening
author at start life: Marinus Vonhof
date of start life: 2017-12-07
units of measurements: m
comment: [is aspect]
scope note: Cof MDS
scope note: Cof REV
scope note: Cof HYD
type: Class
subclass of: Hoogte t.o.v. NAP
subclass of: Restriction
  author at start life: Marinus Vonhof
  date of start life: 2017-12-07
  validity context: 5t 11t
  on class: Doorlaat
  on property: has as aspect (inverse)
  max qualified cardinality: 1
subclass of: Restriction
  on property: has as value
  all values from: decimal

Infiltratieriool
author of change: Marinus Vonhof
author of change: Johan Post
date of change: 2024-05-01
date of change: 2026-07-13
definition: Een rioolleiding met waterdoorlatende wanden bestemd voor de inzameling en transport van hemelwater, waarbij het hemelwater door middel van infiltratie door de wanden kan worden afgevoerd. Kan ook beschouwd worden als een soort infiltratievoorziening.
notation: ITR
author at start life: Marinus Vonhof
date of start life: 2017-05-20
alternative label: IT-riool
alternative label: Infiltratieleiding
scope note: Cof MDS
scope note: Cof REV
scope note: Cof HYD
type: Class
subclass of: Vrijverval rioolleiding
subclass of: Restriction
  author at start life: Marinus Vonhof
  date of start life: 2020-05-26
  on class: Hemelwaterstelsel
  on property: has as part (inverse)
  max qualified cardinality: 1
subclass of: Restriction
  on property: heeft Functie
  has value: Afvoeren hemelwater naar de ondergrond
subclass of: Restriction
  on property: heeft Uitvoering
  has value: Waterdoorlatende wanden

Infiltratiekolk
author of change: Marinus Vonhof
author of change: Johan Post
date of change: 2021-08-06
date of change: 2024-05-01
date of change: 2026-07-13
definition: Een kolk met waterdoorlatende wanden bestemd voor de inzameling van hemelwater, waarbij het hemelwater door middel van infiltratie door de wanden kan worden afgevoerd. Kan ook beschouwd worden als een soort infiltratievoorziening.
notation: D
author at start life: Finy Teitsma (Oranjewoud)
date of start life: 2006-11-29
comment: ron afbeelding: Wavin
scope note: Cof MDS
scope note: Cof RRB
scope note: Cof LDR
scope note: Cof REV
type: Class
subclass of: Kolk
subclass of: Restriction
  on property: heeft Functie
  has value: Afvoeren hemelwater naar de ondergrond
subclass of: Restriction
  on property: heeft Uitvoering
  has value: Waterdoorlatende wanden

Inspectieput
label: Manhole @en
author of change: Wouter van Riel
date of change: 2024-04-22
definition: Een rioolput die voor mens of apparatuur vanaf het maaiveld toegang biedt tot de aangesloten rioolleidingen.
definition: [EN 16323:2014] structure with a removable cover, constructed on a drain or sewer to permit entry by personnel @en
definition: [NEN-EN 752:2008] (Ongeldig) put met een afneembaar deksel, gekoppeld aan een aansluitleiding of riool waarmee reinigings- en inspectieapparatuur vanaf de oppervlakte kan worden ingebracht, maar die geen toegang biedt voor personeel
notation: INS
author at start life: Finy Teitsma (Oranjewoud)
date of start life: 2006-05-23
see also: [IMGeo:1.0/2007] Put die toegang geeft tot een (riool)leiding.
see also: [IRIS-RIOKEN:2012] Constructie toeganggevend tot het rioolstelsel.
alternative label: Controleput
scope note: Cof MDS
scope note: Cof RRB
scope note: Cof LDR
scope note: Cof REV
scope note: Cof HYD
type: Class
subclass of: Rioolput
subclass of: Restriction
  author of change: Marinus Vonhof
  date of change: 2019-05-15
  author at start life: Finy Teitsma (Oranjewoud)
  date of start life: 2006-07-12
  on class: Inlaat rioolput
  on property: has as part
  min qualified cardinality: 0
subclass of: Restriction
  author of change: Marinus Vonhof
  date of change: 2015-04-21
  author at start life: Marinus Vonhof
  date of start life: 2014-12-02
  on class: Vrijverval transportstelsel
  on property: has as part (inverse)
  qualified cardinality: 1
subclass of: Restriction
  author of change: Marinus Vonhof
  date of change: 2018-12-11
  author at start life: Marinus Vonhof
  date of start life: 2012-04-29
  on class: Zonk
  on property: has as part
  max qualified cardinality: 1
subclass of: Restriction
  on property: heeft Functie
  has value: Beluchten of ventileren
subclass of: Restriction
  on property: heeft Functie
  has value: Inzameling van afvalwater
subclass of: Restriction
  on property: heeft Functie
  has value: Toegang geven tot het rioolstelsel
subclass of: Restriction
  on property: heeft Functie
  has value: Toegang verschaffen
subclass of: Restriction
  on property: heeft Uitvoering
  has value: Toegankelijk voor inspectie- en reinigingsapparatuur
subclass of: Restriction
  on property: heeft Uitvoering
  has value: Verwijderbaar deksel

Lozingsput
author of change: Marinus Vonhof
date of change: 2016-04-15
definition: Een put waarop een rioolleiding is aangesloten waarmee het afvalwater het rioolstelsel verlaat naar, of ontvangt uit, een ander rioolstelsel
author at start life: Nic Roest (Idoro)
date of start life: 2006-03-23
alternative label: Ontvangstput
scope note: Cof MDS
scope note: Cof REV
scope note: Cof HYD
type: Class
subclass of: Rioolput
subclass of: Restriction
  on property: heeft Uitvoering
  has value: Naar ander rioolstelsel
subclass of: Restriction
  on property: heeft Functie
  has value: Overtollig afvalwater laten wegstromen

Verzameldrain
definition: Een leiding met ondoorlatende wand die het door drains aangevoerde water verzamelt en transporteert, zonder zelf water uit de omliggende bodem op te nemen.
author at start life: Johan Post
date of start life: 2026-05-19
type: Class
subclass of: Vrijverval rioolleiding
subclass of: Restriction
  on property: heeft Functie
  has value: Transport van grondwater

Drainputdeksel
author of change: Marinus Vonhof
date of change: 2025-01-16
definition: [IMBOR] Een putdeksel met openingen aan het oppervlak zodat afval- of hemelwater er ten alle tijden in kan lopen.
author at start life: Marinus Vonhof
date of start life: 2018-12-06
scope note: Cof REV
scope note: Cof BAS
type: Class
subclass of: Deksel
subclass of: Restriction
  on property: heeft Toepassing
  has value: Drainput

Drempelbreedte
definition: De ontwikkelde lengte van de overlaat, waarover het afvalwater overstort, gemeten haaks op de stroomrichting
definition: [NEN 3300:1996] Overstortbreedte is synoniem van drempelbreedte
definition: [NEN 3300:1996] de ontwikkelde lengte van de overlaat waarover het water overstort, gemeten haaks op de stroomrichting
author at start life: Marinus Vonhof
date of start life: 2017-05-17
units of measurements: mm
alternative label: Overstortbreedte
comment: [is aspect]
scope note: Cof MDS
scope note: Cof REV
scope note: Cof HYD
type: Class
subclass of: Breedte
subclass of: Restriction
  author at start life: Finy Teitsma (Oranjewoud)
  date of start life: 2006-02-25
  validity context: 5t 11t
  on class: Overstortdrempel
  on property: has as aspect (inverse)
  max qualified cardinality: 1
subclass of: Restriction
  author at start life: Marinus Vonhof
  date of start life: 2019-03-20
  validity context: 5t 11t
  on class: Stuwmuur
  on property: has as aspect (inverse)
  max qualified cardinality: 1
subclass of: Restriction
  author at start life: Marinus Vonhof
  date of start life: 2024-05-16
  on class: Inwinning
  on property: has as aspect
  max qualified cardinality: 1
subclass of: Restriction
  on property: has as value
  all values from: integer

Drempelniveau
definition: De hoogte van de drempel
definition: [NEN 3300:1996] Drempelhoogte is synoniem van drempelniveau
definition: [NEN 3300:1996] de hoogte van de bovenkant van de drempel ten opzichte van een referentiepeil
author at start life: Marinus Vonhof
date of start life: 2016-04-24
units of measurements: m
alternative label: Drempelhoogte
alternative label: Drempelpeil
comment: [is aspect]
scope note: Cof MDS
scope note: Cof REV
scope note: Cof HYD
type: Class
subclass of: Hoogte t.o.v. NAP
subclass of: Restriction
  author of change: Marinus Vonhof
  date of change: 2019-09-02
  author at start life: Finy Teitsma (Oranjewoud)
  date of start life: 2006-02-25
  on class: Overstortdrempel
  on property: has as aspect (inverse)
  qualified cardinality: 1
subclass of: Restriction
  author at start life: Marinus Vonhof
  date of start life: 2015-10-30
  on class: Inwinning
  on property: has as aspect
  max qualified cardinality: 1
subclass of: Restriction
  author at start life: Marinus Vonhof
  date of start life: 2019-03-20
  on class: Stuwmuur
  on property: has as aspect (inverse)
  qualified cardinality: 1
subclass of: Restriction
  on property: has as value
  all values from: decimal

Drukleiding
author of change: Marinus Vonhof
date of change: 2024-05-16
date of change: 2021-08-06
definition: Leiding bestemd voor de inzameling en het transport van huishoudelijk- en bedrijfsafvalwater, niet zijnde neerslag waarin het afvalwater door middel van overdruk wordt getransporteerd
author at start life: Marinus Vonhof
date of start life: 2013-09-14
validity context: 1d
scope note: Cof MDS
scope note: Cof REV
scope note: Cof RGM
type: Class
subclass of: Mechanische rioolleiding
subclass of: Restriction
  on property: heeft Functie
  has value: Transport van vuilwater

Mechanische rioolleiding
author of change: Marinus Vonhof
author of change: Johan Post
author of change: Wouter van Riel
date of change: 2016-08-26
date of change: 2024-04-23
date of change: 2024-05-04
date of change: 2026-05-19
definition: Een gesloten rioolleiding waarin het afvalwater door middel van onder-/overdruk wordt getransporteerd.
author at start life: Marinus Vonhof
author at start life: Finy Teitsma (Oranjewoud)
date of start life: 2006-02-20
validity context: *f 11d 12d 13d
see also: [IMKL:1.1/2008] Riolering waarbij het transport plaatsvindt door overdruk (uit NEN 3300, Buitenriolering).
comment: [cfk fout]
scope note: Cof TOP
type: Class
subclass of: Rioolleiding
subclass of: Restriction
  on property: heeft Structuur
  has value: Gesloten
subclass of: Restriction
  on property: heeft Technologie
  has value: Transport onder overdruk of onderdruk

Duiker
author of change: Marinus Vonhof
date of change: 2017-05-31
definition: Een leiding die oppervlaktewater-elementen verbindt
author at start life: Marinus Vonhof
date of start life: 2012-04-29
see also: [IHW:20130706] Een kokervormige constructie met als doel de wederzijdse verbinding tussen oppervlaktewater te waarborgen
see also: [IMGeo:1.0/2007] Kunstmatige doorstroomopening onder een rivier; kanaal weg enz., die een functie vervult in de waterhuishouding.
scope note: Cof MDS
scope note: Cof REV
type: Class
subclass of: Leiding
subclass of: Restriction
  on property: heeft Functie
  has value: Verbinding tussen oppervlaktewater

Edge
author of change: Marinus Vonhof
date of change: 2020-11-24
definition: Wiskundige term (engels) voor zijde, kant, boog, tak
author at start life: Marinus Vonhof
date of start life: 2011-12-15
alternative label: Zijde
scope note: Cof TOP
type: Class
subclass of: Topologisch element

Topologisch element
author of change: Marinus Vonhof
date of change: 2025-01-16
date of change: 2016-11-09
definition: [Gellish] Is a configuration that indicates how items are connected or positioned relative to each other. The topology in terms of connections usually doesn't change when the positions of the items change. @en
definition: [IMBOR] Een configuratie waarin vastgelegd wordt hoe objecten verbonden zijn of hoe ze relatief tot elkaar gepositioneerd zijn.
author at start life: Marinus Vonhof
date of start life: 2013-10-04
validity context: *f 15d
comment: [cfk fout]
scope note: Cof TOP
type: Class

Eindknooppunt
definition: [EN13508-2+A1] The node reference of the second node as specified by the employing authority. @en
definition: Het knooppunt dat koppelt aan het (topologische) eindpunt van een leiding.
author at start life: Marinus Vonhof
date of start life: 2026-07-17
alternative label: Eindknoop
scope note: Cof TOP
type: Class
subclass of: Extra objecttype (rol)

Explosievrije kolk
author of change: Marinus Vonhof
date of change: 2025-01-16
definition: [IMBOR] Een explosievrije of explosieveilige kolk kan worden uitgevoerd als straatkolk voor in het wegdek bij bijvoorbeeld tankstations. Het rooster komt gelijk te liggen met het wegdek en kan worden geopend om de kolk leeg te zuigen of om het leidingwerk of kolk te controleren.
author at start life: Marinus Vonhof
date of start life: 2021-08-06
scope note: Cof MDS
scope note: Cof RRB
scope note: Cof LDR
scope note: Cof REV
type: Class
subclass of: Kolk
subclass of: Restriction
  on property: heeft Functie
  has value: Voorkomen van explosie

Externe overstortput
author of change: Finy Teitsma (Oranjewoud)
date of change: 2007-11-12
definition: Een overstortput waarbij overtollig afvalwater uit een rioolstelsel kan stromen.
definition: [NEN 3300:1996] rioolput voorzien van een overstortdrempel die loost buiten het in beschouwing genomen rioolstelsel, meestal op oppervlaktewater
definition: [NEN-EN 752:2008] voorziening in een gemengd systeem waarmee overtollig afvalwater wordt afgevoerd [EN 1085:2007, definitie 2130]
author at start life: Finy Teitsma (Oranjewoud)
date of start life: 2006-05-23
alternative label: Externe overstort
scope note: Cof MDS
scope note: Cof REV
scope note: Cof HYD
scope note: Cof DMO
type: Class
subclass of: Overstortput
subclass of: Restriction
  on property: heeft Functie
  has value: Lozen buiten het stelsel

Opmerking
label: Remarks @en
author of change: Marinus Vonhof
date of change: 2016-08-05
author at start life: Marinus Vonhof
date of start life: 2015-10-22
comment: [is aspect]
scope note: Cof EN
scope note: Cof RRB
scope note: Cof REV
scope note: Cof PLI
type: Class
subclass of: Kenmerk
subclass of: Restriction
  author of change: Marinus Vonhof
  date of change: 2014-08-06
  author at start life: Marinus Vonhof
  date of start life: 2013-01-05
  on class: Waarneming
  on property: has as aspect (inverse)
  qualified cardinality: 1

Gegevenswoordenboek Stedelijk Water
author of change: Marinus Vonhof
date of change: 2024-05-16
date of change: 2024-07-31
date of change: 2021-12-29
date of change: 2021-09-20
date of change: 2021-10-02
date of change: 2025-11-18
date of change: 2026-08-25
definition: Een datamodel (ontologie, kennismodel) voor het vakgebied Stedelijk Water, het bevat modellen voor systemen en processen binnen het vakgebied. Belangrijke onderdelen ervan zijn modellen van constructies (systemen, stelsels, bouwwerken, leidingen, putten) en modellen van activiteiten (plannen, projecten, maatregelen). Het datamodel is onderdeel van het Semantisch Web, de datastructuur is gebaseerd op de linked-data-taal RDF/RDFS/OWL.
author at start life: Marinus Vonhof
date of start life: 2011-11-11
validity context: 6d
comment: URI gewijzigd (was GWSW_Datamodel) (20251118)
comment: Vigerend: GWSW versie 1.7.0 (25-08-2026)
alternative label: GWSW
scope note: Cof TOP
type: Class
subclass of: Informatiedrager
subclass of: Restriction
  author at start life: Marinus Vonhof
  date of start life: 2025-11-18
  on class: GWSW Deelmodel
  on property: has as part
  min qualified cardinality: 1
subclass of: Restriction
  author at start life: Marinus Vonhof
  date of start life: 2026-07-24
  on class: GWSW.orox
  on property: has as part
  qualified cardinality: 1

GWSW.orox
definition: Het uitwisselprotocol voor toepassingen van het GWSW. Het protocol beschrijft met de linked-data-taal RDF/RDFS/OWL de inhoud van het GWSW Datamodel en de GWSW Datasets (de gemeentelijke gegevens). In alle gevallen wordt het zogenaamde Turtle-formaat voor de uitwisselbestanden gebruikt, maar in principe is elk RDF-formaat bruikbaar. De door gemeenten gebruikte beheersystemen kunnen in de meeste gevallen gegevens exporteren conform GWSW OroX.
author at start life: Marinus Vonhof
date of start life: 2026-07-24
alternative label: GWSW OroX
scope note: Cof TOP
type: Class
subclass of: Informatiedrager
subclass of: Restriction
  author at start life: Marinus Vonhof
  date of start life: 2026-07-24
  on class: Gegevenswoordenboek Stedelijk Water
  on property: has as part (inverse)
  qualified cardinality: 1

Gecombineerde straat-trottoirkolk
author of change: Marinus Vonhof
date of change: 2021-08-06
definition: Een kolk met de inlaat aan de boven- en voorzijde bestemd om te worden aangebracht zowel gedeeltelijk in het vlak van de wegverharding als gedeeltelijk in de vlakken van de aansluitende trottoirbanden die in het zicht blijven.
notation: C
author at start life: Finy Teitsma (Oranjewoud)
date of start life: 2006-11-29
alternative label: Combikolk
alternative label: Gemengde kolk
scope note: Cof MDS
scope note: Cof RRB
scope note: Cof LDR
scope note: Cof REV
type: Class
subclass of: Kolk
subclass of: Restriction
  on property: heeft Functie
  has value: Afvoer naar kolkaansluitleiding
subclass of: Restriction
  on property: heeft Uitvoering
  has value: Met de inlaat aan de boven- en voorzijde

Loze leiding
author of change: Marinus Vonhof
date of change: 2025-01-16
date of change: 2018-12-10
definition: Leiding is buiten gebruik
definition: [IMBOR] Een leiding die buiten gebruik is, maar zich nog wel in de ondergrond bevindt.
author at start life: Marinus Vonhof
date of start life: 2016-04-29
alternative label: Verlaten leiding
scope note: Cof REV
scope note: Cof BAS
scope note: Cof MTR
type: Class
subclass of: Leiding
subclass of: Restriction
  on property: heeft Functie
  has value: Geen functie

Veiligheidsrooster
author of change: Marinus Vonhof
date of change: 2025-01-16
date of change: 2026-08-03
definition: [IMBOR] Een vaak bewandelbaar rooster dat ter bescherming van mensen aan het oppervlak over een opening is aangebracht.
author at start life: Marinus Vonhof
date of start life: 2013-03-31
validity context: 10d
alternative label: Valrooster
scope note: Cof REV
scope note: Cof BAS
scope note: Cof RGM
type: Class
subclass of: Afdekking
subclass of: Restriction
  author of change: Marinus Vonhof
  date of change: 2016-04-13
  author at start life: Marinus Vonhof
  date of start life: 2013-02-05
  on class: Gemaal
  on property: has as part (inverse)
  max qualified cardinality: 1
subclass of: Restriction
  author at start life: Marinus Vonhof
  date of start life: 2018-05-03
  on class: Pompput
  on property: has as part (inverse)
  max qualified cardinality: 1
subclass of: Restriction
  on property: heeft Functie
  has value: Beschermen tegen vallen

Vuilwaterstelsel
author of change: Johan Post
author of change: Eric van Gorkom
date of change: 2021-10-01
date of change: 2024-05-13
definition: Een vrijverval rioolstelsel bestemd voor de inzameling, het transport en de tijdelijke berging van vuilwater.
definition: [NEN 3300:1996] Dwa-rioolstelsel is synoniem van vuilwaterstelsel
definition: [NEN 3300:1996] rioolstelsel voor de inzameling en het transport van huishoudelijk- en bedrijfsafvalwater, niet zijnde neerslag
author at start life: Finy Teitsma (Oranjewoud)
date of start life: 2007-10-23
alternative label: DWA stelsel
alternative label: Dwa-rioolstelsel
alternative label: Vuilwaterrioolstelsel
scope note: Cof TOP
type: Class
subclass of: Vrijverval rioolstelsel
subclass of: Restriction
  author at start life: Marinus Vonhof
  date of start life: 2020-05-26
  on class: Rioolgemaal
  on property: has as part
  min qualified cardinality: 0
subclass of: Restriction
  author at start life: Marinus Vonhof
  date of start life: 2020-05-26
  on class: Vuilwaterriool
  on property: has as part
  min qualified cardinality: 1
subclass of: Restriction
  on class: Vrijverval rioolleiding
  on property: has as part
  min qualified cardinality: 0
subclass of: Restriction
  on property: heeft Functie
  has value: Inzameling van vuilwater
subclass of: Restriction
  on property: heeft Functie
  has value: Tijdelijke berging van vuilwater
subclass of: Restriction
  on property: heeft Functie
  has value: Transport van vuilwater

Geometrie
author of change: Marinus Vonhof
date of change: 2025-01-16
date of change: 2017-11-16
definition: [Gellish] Is a scale that is a measurement of spatial aspects. (This may otherwise be called geometry)
definition: [IMBOR] Een kenmerk waarmee de locatie van een object wordt vastgelegd.
author at start life: Marinus Vonhof
date of start life: 2016-10-14
units of measurements: gml
validity context: 15d
comment: [is aspect]
scope note: Cof TOP
type: Class
subclass of: Kenmerk
subclass of: Restriction
  author at start life: Marinus Vonhof
  date of start life: 2016-11-09
  on class: Inwinning
  on property: has as aspect
  max qualified cardinality: 1
subclass of: Restriction
  on property: has as value
  all values from: gmlLiteral

Hoogte
author of change: Marinus Vonhof
date of change: 2015-05-29
definition: In de richting haaks op het horizontale vlak
author at start life: Nic Roest (Idoro)
date of start life: 2006-02-21
units of measurements: mm
validity context: 15d
comment: [is aspect]
scope note: Cof TOP
type: Class
subclass of: Afstand
subclass of: Restriction
  on property: has as value
  all values from: integer

Hoogte put
author of change: Marinus Vonhof
author of change: Eric van Gorkom
date of change: 2021-08-06
date of change: 2024-05-13
definition: De inwendige hoogte (verticaal, vanuit het zijaanzicht). De afstand van binnenonderkant tot binnenbovenkant putconstructie (inclusief onderbak) - zie afbeelding C+F (bron EN13508-2)
author at start life: Marinus Vonhof
date of start life: 2014-08-01
units of measurements: mm
comment: Intrinsiek aspect
comment: [is aspect]
scope note: Cof TOP
type: Class
subclass of: Hoogte
subclass of: Restriction
  author of change: Marinus Vonhof
  date of change: 2014-08-01
  author at start life: Finy Teitsma (Oranjewoud)
  date of start life: 2006-02-25
  validity context: 5t 11t
  on class: Put
  on property: has as aspect (inverse)
  max qualified cardinality: 1
subclass of: Restriction
  on property: has as value
  all values from: Hoogte put (datatype)

Hoogte stellaag
definition: De hoogte van de stellaag (verticaal, vanuit het zijaanzicht)
author at start life: Marinus Vonhof
date of start life: 2024-05-18
units of measurements: mm
comment: Intrinsiek aspect
comment: [is aspect]
scope note: Cof REV
scope note: Cof BAS
type: Class
subclass of: Hoogte
subclass of: Restriction
  on property: has as value
  all values from: integer
subclass of: Restriction
  on class: Stellaag
  on property: has as aspect (inverse)
  max qualified cardinality: 1

Stellaag
author of change: Marinus Vonhof
date of change: 2025-01-16
definition: De - meestal uit baksteen bestaande - verhoging van de putschacht om de putdeksel op maaiveldhoogte te brengen
author at start life: Eric van Gorkom
date of start life: 2024-05-13
date of start life: 2024-05-18
validity context: 10d
scope note: Cof REV
scope note: Cof BAS
type: Class
subclass of: Constructieonderdeel
subclass of: Restriction
  on property: heeft Uitvoering
  has value: Bestaat meestal uit baksteen
subclass of: Restriction
  on property: heeft Doel
  has value: Putdeksel op maaiveldhoogte brengen
subclass of: Restriction
  on property: heeft Uitvoering
  has value: Verhoging putschacht
subclass of: Restriction
  on class: Hoogte stellaag
  on property: has as aspect
  max qualified cardinality: 1
subclass of: Restriction
  on class: Put
  on property: has as part (inverse)
  max qualified cardinality: 1

Lengte put
author of change: Marinus Vonhof
author of change: Johan Post
date of change: 2021-08-06
date of change: 2026-05-01
definition: De inwendige lengte (horizontaal, uit het bovenaanzicht). Indien aanwezig de lengte van de onderbak - zie afbeelding dc (bron EN13508-2)
author at start life: Marinus Vonhof
date of start life: 2016-08-05
units of measurements: mm
validity context: 15d
comment: Intrinsiek aspect
comment: [is aspect]
scope note: Cof TOP
type: Class
subclass of: Lengte
subclass of: Restriction
  author of change: Marinus Vonhof
  date of change: 2014-08-01
  author at start life: Finy Teitsma (Oranjewoud)
  date of start life: 2006-02-25
  validity context: *t
  on class: Put
  on property: has as aspect (inverse)
  qualified cardinality: 1
subclass of: Restriction
  on property: has as value
  all values from: Lengte put (datatype)

Lengte leiding
author of change: Marinus Vonhof
date of change: 2015-05-29
author at start life: Nic Roest (Idoro)
date of start life: 2006-02-21
units of measurements: m
comment: Intrinsiek aspect
comment: [is aspect]
scope note: Cof TOP
type: Class
subclass of: Lengte
subclass of: Restriction
  author of change: Marinus Vonhof
  date of change: 2015-08-24
  author at start life: Finy Teitsma (Oranjewoud)
  date of start life: 2006-02-25
  validity context: *t
  on class: Leiding
  on property: has as aspect (inverse)
  qualified cardinality: 1
subclass of: Restriction
  date of change: 2015-11-03
  author at start life: Marinus Vonhof
  date of start life: 2013-03-29
  on class: Inwinning
  on property: has as aspect
  max qualified cardinality: 1
subclass of: Restriction
  on property: has as value
  all values from: Lengte leiding (datatype)

Maaiveldhoogte
author of change: Marinus Vonhof
date of change: 2015-11-07
definition: Het niveau van het maaiveld
author at start life: Marinus Vonhof
date of start life: 2012-04-22
units of measurements: m
comment: [is aspect]
scope note: Cof TOP
type: Class
subclass of: Hoogte t.o.v. NAP
subclass of: Restriction
  author of change: Marinus Vonhof
  date of change: 2018-12-12
  author at start life: Marinus Vonhof
  date of start life: 2012-04-22
  on class: Maaiveldoriëntatie
  on property: has as aspect (inverse)
  qualified cardinality: 1
subclass of: Restriction
  author at start life: Marinus Vonhof
  date of start life: 2015-11-07
  on class: Inwinning
  on property: has as aspect
  max qualified cardinality: 1
subclass of: Restriction
  on property: has as value
  all values from: decimal

Opdrachtgever
label: Employing authority @en
author of change: Marinus Vonhof
date of change: 2025-01-16
date of change: 2020-04-20
definition: Een rechtspersoon die opdracht geeft voor het uitvoeren van activiteiten dan wel het leveren van producten of diensten. De initiator van het project, dus ongeacht onderaanneming.
definition: [IMBOR] Een opdrachtgever is een organisatie die een bepaalde opdracht tot het verrichten van werkzaamheden verstrekt aan een andere (rechts)persoon, de opdrachtnemer.
notation: AAM
notation: CAM
notation: EAM
notation: GAM
notation: JAM
author at start life: Marinus Vonhof
date of start life: 2011-12-02
validity context: 3d 14d
see also: [KIB] De naam van de bevoegde instantie
alternative label: Bevoegde instantie
scope note: Cof TOP
type: Class
subclass of: Levensvorm
subclass of: Restriction
  author at start life: Marinus Vonhof
  date of start life: 2015-10-26
  on class: Project
  on property: has as input (inverse)
  qualified cardinality: 1

Opdrachtnemer
author of change: Marinus Vonhof
date of change: 2017-05-08
definition: Rechtspersoon die door middel van een overeenkomst door een opdrachtgever tegen vergoeding in staat wordt gesteld tot het uitvoeren van bepaalde activiteiten dan wel het leveren van producten of diensten
author at start life: Marinus Vonhof
date of start life: 2015-10-26
validity context: 3d 6d 14d
scope note: Cof TOP
type: Class
subclass of: Levensvorm
subclass of: Restriction
  author of change: Marinus Vonhof
  date of change: 2015-10-31
  author at start life: Marinus Vonhof
  date of start life: 2015-10-26
  on class: Project
  on property: has as output (inverse)
  qualified cardinality: 1

Vorm put
author of change: Marinus Vonhof
date of change: 2021-08-06
definition: De inwendige vorm (horizontaal, uit het bovenaanzicht). Indien aanwezig de vorm van de onderbak
author at start life: Marinus Vonhof
date of start life: 2012-05-01
comment: Intrinsiek aspect
comment: [is aspect]
scope note: Cof TOP
type: Class
subclass of: Vorm
subclass of: Restriction
  author of change: Marinus Vonhof
  date of change: 2021-08-06
  author at start life: Finy Teitsma (Oranjewoud)
  date of start life: 2006-02-25
  validity context: *t
  on class: Put
  on property: has as aspect (inverse)
  qualified cardinality: 1
subclass of: Restriction
  date of change: 2017-05-17
  author at start life: Marinus Vonhof
  date of start life: 2015-10-30
  on class: Inwinning
  on property: has as aspect
  max qualified cardinality: 1
subclass of: Restriction
  on property: has as reference (qualification)
  all values from: Vorm put (coll)

Tubelure
author of change: Marinus Vonhof
date of change: 2025-01-16
definition: [IMBOR] Een verbindingsstuk dat drie leidingen verbindt.
author at start life: Marinus Vonhof
date of start life: 2019-05-15
validity context: 1d
scope note: Cof MDS
scope note: Cof REV
scope note: Cof PLI
scope note: Cof HYD
type: Class
subclass of: Verbindingsstuk
subclass of: Restriction
  on property: heeft Toepassing
  has value: Toegang voor injecteren

Inmeten knooppunt
author of change: Marinus Vonhof
date of change: 2024-09-19
definition: Landmeetkundige inmeting van een put of bouwwerk
author at start life: Johan Post
date of start life: 2024-09-10
scope note: Cof REV
type: Class
subclass of: Meten
subclass of: Restriction
  on class: Bouwwerk
  on property: has as input
  max qualified cardinality: 1
subclass of: Restriction
  on class: Bouwwerk
  on property: has as output
  max qualified cardinality: 1
subclass of: Restriction
  on class: Melding meting knooppunt
  on property: has as aspect
  max qualified cardinality: 1
subclass of: Restriction
  on class: Meting waterstand
  on property: has as output
  max qualified cardinality: 1
subclass of: Restriction
  on class: Put
  on property: has as input
  max qualified cardinality: 1
subclass of: Restriction
  on class: Put
  on property: has as output
  max qualified cardinality: 1
subclass of: Restriction
  on class: Melding meting deksel
  on property: has as aspect
  min qualified cardinality: 0
subclass of: Restriction
  on class: Opmerking
  on property: has as aspect
  min qualified cardinality: 0
subclass of: Restriction
  on class: Datum inwinning
  on property: has as aspect
  qualified cardinality: 1
subclass of: Restriction
  on class: Revisieproject
  on property: has as part (inverse)
  qualified cardinality: 1
subclass of: Restriction
  on class: Wijze van inwinning
  on property: has as aspect
  qualified cardinality: 1

Meten
author of change: Marinus Vonhof
author of change: Johan Post
date of change: 2014-04-29
date of change: 2024-09-10
author at start life: Marinus Vonhof
date of start life: 2013-09-28
validity context: 6d
scope note: Cof REV
scope note: Cof BAS
scope note: Cof DMO
type: Class
subclass of: Onderzoeken

Melding meting knooppunt
author of change: Marinus Vonhof
date of change: 2024-09-18
definition: Melding bij een meting van een put of bouwwerk
author at start life: Johan Post
date of start life: 2024-09-10
comment: [is aspect]
scope note: Cof REV
type: Class
subclass of: Kenmerk
subclass of: Restriction
  on property: has as reference (qualification)
  all values from: Melding meting knooppunt (coll)
subclass of: Restriction
  on class: Inmeten knooppunt
  on property: has as aspect (inverse)
  qualified cardinality: 1

Meting waterstand
definition: Gemeten waterstand bij de inmeting van een object, de hoogte tov de bodem
author at start life: Johan Post
date of start life: 2024-09-10
comment: [is aspect]
scope note: Cof REV
type: Class
subclass of: Kenmerk
subclass of: Restriction
  on property: has as value
  all values from: decimal
subclass of: Restriction
  on class: Inmeten knooppunt
  on property: has as output (inverse)
  qualified cardinality: 1

Melding meting deksel
author of change: Marinus Vonhof
date of change: 2024-09-18
definition: Melding bij een meting van een putdeksel
author at start life: Johan Post
date of start life: 2024-09-10
comment: [is aspect]
scope note: Cof REV
type: Class
subclass of: Kenmerk
subclass of: Restriction
  on property: has as reference (qualification)
  all values from: Melding meting deksel (coll)
subclass of: Restriction
  on class: Inmeten knooppunt
  on property: has as aspect (inverse)
  qualified cardinality: 1

Wijze van inwinning
author of change: Johan Post
date of change: 2022-09-29
definition: Wijze waarop gegevens verzameld zijn
author at start life: Marinus Vonhof
date of start life: 2013-02-05
alternative label: Wijze van inwinnen
comment: [is aspect]
scope note: Cof TOP
type: Class
subclass of: Kenmerk
subclass of: Restriction
  author of change: Marinus Vonhof
  date of change: 2026-07-26
  date of change: 2024-05-15
  date of change: 2019-04-25
  author at start life: Marinus Vonhof
  date of start life: 2015-10-29
  on class: Inwinning
  on property: has as aspect (inverse)
  max qualified cardinality: 1
subclass of: Restriction
  on property: has as reference (qualification)
  all values from: Wijze van inwinning (coll)

Inmeten leiding
author of change: Marinus Vonhof
date of change: 2024-09-19
definition: Landmeetkundige inmeting van een leiding
author at start life: Johan Post
date of start life: 2024-09-10
scope note: Cof REV
type: Class
subclass of: Meten
subclass of: Restriction
  on class: Leiding
  on property: has as input
  max qualified cardinality: 1
subclass of: Restriction
  on class: Melding meting leiding
  on property: has as aspect
  max qualified cardinality: 1
subclass of: Restriction
  on class: Opmerking
  on property: has as aspect
  min qualified cardinality: 0
subclass of: Restriction
  on class: Datum inwinning
  on property: has as aspect
  qualified cardinality: 1
subclass of: Restriction
  on class: Leiding
  on property: has as output
  qualified cardinality: 1
subclass of: Restriction
  on class: Revisieproject
  on property: has as part (inverse)
  qualified cardinality: 1
subclass of: Restriction
  on class: Wijze van inwinning
  on property: has as aspect
  qualified cardinality: 1

Melding meting leiding
author of change: Marinus Vonhof
date of change: 2024-09-18
definition: Melding bij een meting van een leiding
author at start life: Johan Post
date of start life: 2024-09-10
comment: [is aspect]
scope note: Cof REV
type: Class
subclass of: Kenmerk
subclass of: Restriction
  on property: has as reference (qualification)
  all values from: Melding meting leiding (coll)
subclass of: Restriction
  on class: Inmeten leiding
  on property: has as aspect (inverse)
  qualified cardinality: 1

Inspecteren
author of change: Marinus Vonhof
date of change: 2022-09-30
date of change: 2015-08-24
definition: [NEN 3300:1996] (Inspectie) Het waarnemen, herkennen en beschrijven van de toestand
author at start life: Marinus Vonhof
date of start life: 2013-03-26
validity context: 1f 3f 5d 10f 11d 12f 14f
scope note: Cof TOP
type: Class
subclass of: Onderzoeken

Mechanische transportleiding
author of change: Marinus Vonhof
author of change: Johan Post
author of change: Wouter van Riel
date of change: 2025-01-16
date of change: 2024-05-02
date of change: 2015-09-20
date of change: 2024-04-23
date of change: 2024-07-26
date of change: 2024-05-04
definition: [IMBOR] Een transportleiding waarin de materie op basis van onder- en bovendruk wordt verplaatst.
author at start life: Marinus Vonhof
date of start life: 2014-12-02
validity context: *f
comment: [cfk fout]
scope note: Cof TOP
type: Class
subclass of: Transportleiding
subclass of: Restriction
  on property: heeft Structuur
  has value: Gesloten
subclass of: Restriction
  on property: heeft Technologie
  has value: Transport onder overdruk of onderdruk

Project
author of change: Marinus Vonhof
date of change: 2025-01-16
definition: [IMBOR] Afbakening van het gebied (begrenzing) waarbinnen werkzaamheden gepland zijn, uitgevoerd worden of uitgevoerd zijn.
author at start life: Marinus Vonhof
date of start life: 2013-09-03
validity context: 3d 14d
scope note: Cof TOP
type: Class
subclass of: Activiteit
subclass of: Restriction
  author of change: Marinus Vonhof
  date of change: 2015-10-26
  author at start life: Marinus Vonhof
  date of start life: 2011-12-02
  validity context: 1t 10t 12t
  on class: Projectreferentie opdrachtgever
  on property: has as aspect
  max qualified cardinality: 1
subclass of: Restriction
  author of change: Marinus Vonhof
  date of change: 2015-10-31
  author at start life: Marinus Vonhof
  date of start life: 2015-10-26
  on class: Opdrachtnemer
  on property: has as output
  min qualified cardinality: 1
subclass of: Restriction
  author at start life: Marinus Vonhof
  date of start life: 2015-10-26
  validity context: 1t 10t 12t
  on class: Projectreferentie opdrachtnemer
  on property: has as aspect
  max qualified cardinality: 1
subclass of: Restriction
  author at start life: Marinus Vonhof
  date of start life: 2015-10-26
  on class: Opdrachtgever
  on property: has as input
  qualified cardinality: 1

Vrijverval transportstelsel
author of change: Marinus Vonhof
author of change: Johan Post
date of change: 2025-01-16
date of change: 2021-10-01
definition: [IMBOR] Een netwerk van leidingen en putten ten behoeve van het transport van materie dat door middel van zwaartekracht plaatsvindt.
author at start life: Marinus Vonhof
date of start life: 2014-12-02
scope note: Cof TOP
type: Class
subclass of: Transportstelsel
subclass of: Restriction
  author of change: Marinus Vonhof
  date of change: 2015-04-21
  author at start life: Marinus Vonhof
  date of start life: 2014-12-02
  on class: Inspectieput
  on property: has as part
  min qualified cardinality: 1
subclass of: Restriction
  author of change: Marinus Vonhof
  date of change: 2015-09-20
  author at start life: Marinus Vonhof
  date of start life: 2014-12-02
  validity context: 1t 10t 12t
  on class: Vrijverval transportleiding
  on property: has as part
  min qualified cardinality: 1
subclass of: Restriction
  on property: heeft Technologie
  has value: Transport door de zwaartekracht

Zonk
author of change: Finy Teitsma (Oranjewoud)
date of change: 2007-11-12
definition: Een toestel waarin ten gevolge van het verschil in dichtheid en het vertragen van de vloeistofstroom het zand door bezinking grotendeels van het afvalwater wordt gescheiden.
definition: [NEN 3300:1996] Zandvang is synoniem van zonk
author at start life: Finy Teitsma (Oranjewoud)
date of start life: 2007-10-23
validity context: 10d
alternative label: Zandvang
scope note: Cof REV
scope note: Cof BAS
type: Class
subclass of: Constructieonderdeel
subclass of: Restriction
  author of change: Marinus Vonhof
  date of change: 2018-12-11
  author at start life: Marinus Vonhof
  date of start life: 2012-04-29
  on class: Inspectieput
  on property: has as part (inverse)
  qualified cardinality: 1
subclass of: Restriction
  on property: heeft Functie
  has value: Bezinken stoffen
subclass of: Restriction
  on property: heeft Functie
  has value: Reinigen afvalwater

Interne overstortput
author of change: Marinus Vonhof
author of change: Finy Teitsma (Oranjewoud)
author of change: Wouter van Riel
date of change: 2024-04-20
date of change: 2007-11-12
date of change: 2025-03-20
definition: Een overstortput die loost op een voorziening binnen hetzelfde rioolstelsel.
definition: [NEN 3300:1996] rioolput voorzien van een overstortdrempel die loost binnen het in beschouwing genomen rioolstelsel
author at start life: Finy Teitsma (Oranjewoud)
date of start life: 2006-05-23
alternative label: Interne overstort
scope note: Cof MDS
scope note: Cof REV
scope note: Cof HYD
scope note: Cof DMO
type: Class
subclass of: Overstortput
subclass of: Restriction
  on property: heeft Functie
  has value: Lozen binnen het stelsel

Knevelvoorziening
author of change: Marinus Vonhof
author of change: Johan Post
date of change: 2025-01-16
date of change: 2024-04-30
definition: Voorziening om een putdeksel aan de rand te fixeren, waardoor deze niet opdrijft bij hoge water- en/of luchtdruk.
author at start life: Marinus Vonhof
date of start life: 2018-12-06
validity context: 10d
scope note: Cof REV
scope note: Cof BAS
type: Class
subclass of: Constructieonderdeel
subclass of: Restriction
  author at start life: Marinus Vonhof
  date of start life: 2018-12-06
  on class: Putdeksel
  on property: has as part (inverse)
  max qualified cardinality: 1
subclass of: Restriction
  on property: heeft Functie
  has value: Fixeren putdeksel

Stankscherm
definition: Vaak toegepast in een kolk, dan voorzien van een losse ophanging voor betere bereikbaarheid van het dieper gelegen kolkdeel
author at start life: Marinus Vonhof
date of start life: 2020-05-26
validity context: 1d 3d 10d 12d 14d
scope note: Cof RRB
scope note: Cof REV
scope note: Cof BAS
type: Class
subclass of: Stankafsluiter
subclass of: Restriction
  author of change: Marinus Vonhof
  date of change: 2021-08-06
  author at start life: Marinus Vonhof
  date of start life: 2020-05-26
  on class: Kolk
  on property: has as part (inverse)
  max qualified cardinality: 1
subclass of: Restriction
  on property: heeft Uitvoering
  has value: Stank afsluiten met scherm

Uitklimvoorziening
author of change: Marinus Vonhof
date of change: 2025-01-16
date of change: 2015-02-28
notation: EXL
author at start life: Marinus Vonhof
date of start life: 2013-10-18
validity context: 10d
see also: [KIB] De kolk is voorzien van een constructie die het mogelijk maakt dat amfibieën en kleine zoogdieren uit de kolk kunnen klimmen.
scope note: Cof RRB
scope note: Cof REV
scope note: Cof BAS
type: Class
subclass of: Constructieonderdeel
subclass of: Restriction
  author at start life: Johan Post
  date of start life: 2026-05-04
  on class: Spuikolk
  on property: has as part (inverse)
  max qualified cardinality: 1
subclass of: Restriction
  author at start life: Marinus Vonhof
  date of start life: 2020-04-18
  on class: Kolk
  on property: has as part (inverse)
  max qualified cardinality: 1
subclass of: Restriction
  on property: heeft Functie
  has value: Amfibieën en zoogdieren redden

Straatkolk
author of change: Marinus Vonhof
date of change: 2016-04-15
definition: Een kolk met de inlaat aan de bovenzijde, bestemd om te worden aangebracht in het vlak van de wegverharding
definition: [NEN 3300:1996] kolk met horizontaal boveninlaatrooster, waarvan de bovenzijde gelijk ligt met het wegoppervlak
notation: A
author at start life: Finy Teitsma (Oranjewoud)
date of start life: 2006-11-29
scope note: Cof MDS
scope note: Cof RRB
scope note: Cof LDR
scope note: Cof REV
type: Class
subclass of: Kolk
subclass of: Restriction
  on property: heeft Functie
  has value: Afvoer naar kolkaansluitleiding
subclass of: Restriction
  on property: heeft Uitvoering
  has value: Met de inlaat aan de bovenzijde

Trottoirkolk
author of change: Finy Teitsma (Oranjewoud)
date of change: 2007-11-12
definition: Een kolk met de inlaat aan de voorzijde, bestemd om te worden aangebracht in de in het zicht blijvende vlakken van de aansluitende trottoirbanden.
definition: [NEN 3300:1996] kolk met een verticaal voorinlaatrooster, waarvan de voorkant strookt met de trottoirband
notation: B
author at start life: Finy Teitsma (Oranjewoud)
date of start life: 2006-11-29
scope note: Cof MDS
scope note: Cof RRB
scope note: Cof LDR
scope note: Cof REV
type: Class
subclass of: Kolk
subclass of: Restriction
  on property: heeft Functie
  has value: Afvoer naar kolkaansluitleiding
subclass of: Restriction
  on property: heeft Uitvoering
  has value: Met de inlaat aan de voorzijde

Kruisingsput
author of change: Johan Post
date of change: 2021-10-01
definition: [NEN 3300:1996] rioolput voor de kruising van riolen, zonder dat de stromen elkaar raken
author at start life: Marinus Vonhof
date of start life: 2012-04-29
scope note: Cof MDS
scope note: Cof RRB
scope note: Cof LDR
scope note: Cof REV
scope note: Cof HYD
type: Class
subclass of: Rioolput
subclass of: Restriction
  on property: heeft Functie
  has value: Leiding gescheiden laten kruisen
subclass of: Restriction
  on property: heeft Functie
  has value: Voorkomen dat stromen elkaar raken

Kruisstuk
definition: Een verbindingsstuk dat vier (drainage) leidingen onder een rechte hoek verbindt
author at start life: Marinus Vonhof
date of start life: 2018-12-06
validity context: 1d
scope note: Cof MDS
scope note: Cof LDR
scope note: Cof REV
scope note: Cof PLI
scope note: Cof HYD
type: Class
subclass of: Verbindingsstuk
subclass of: Restriction
  on property: heeft Functie
  has value: Verbinden van vier leidingen

Lengte
author of change: Marinus Vonhof
date of change: 2025-01-16
date of change: 2015-05-29
definition: In de richting van de langste afstand
definition: [IMBOR] Kenmerk voor de registratie van de langste horizontale dimensie van het beheerobject.
author at start life: Nic Roest (Idoro)
date of start life: 2006-02-17
comment: [is aspect]
scope note: Cof TOP
type: Class
subclass of: Afstand

Vrijverval transportleiding
author of change: Johan Post
author of change: Wouter van Riel
date of change: 2026-05-01
date of change: 2024-04-22
definition: Een transportleiding waarin de materie door de zwaartekracht wordt verplaatst
author at start life: Marinus Vonhof
date of start life: 2015-09-20
validity context: 3f
scope note: Cof TOP
type: Class
subclass of: Transportleiding
subclass of: Restriction
  author of change: Marinus Vonhof
  date of change: 2015-09-20
  author at start life: Marinus Vonhof
  date of start life: 2014-12-02
  validity context: 1t 10t 12t
  on class: Vrijverval transportstelsel
  on property: has as part (inverse)
  qualified cardinality: 1
subclass of: Restriction
  author at start life: Johan Post
  date of start life: 2026-05-01
  on class: Vrijverval rioolstelsel
  on property: has as part (inverse)
  max qualified cardinality: 1
subclass of: Restriction
  on property: heeft Technologie
  has value: Transport door de zwaartekracht

Luik
author of change: Marinus Vonhof
date of change: 2025-01-16
definition: [IMBOR] Een soort poort of deur ter bescherming van een raam of venster of als onderdeel van een kunstwerk of constructie.
author at start life: Marinus Vonhof
date of start life: 2020-04-17
scope note: Cof MDS
scope note: Cof REV
type: Class
subclass of: Afdekking
subclass of: Restriction
  on property: heeft Functie
  has value: Afsluiten
subclass of: Restriction
  on property: heeft Uitvoering
  has value: Scharnierend
subclass of: Restriction
  on property: heeft Functie
  has value: Toegankelijk houden

Vetafscheider
label: Grease separator @en
author of change: Marinus Vonhof
date of change: 2019-05-16
date of change: 2026-07-20
definition: Een toestel waarin ten gevolge van het verschil in dichtheid en het vertragen van de vloeistofstroom het vet door opdrijving grotendeels van het afvalwater wordt gescheiden. Verticale schotten in de afscheider zorgen ervoor dat het geloosde afvalwater in de put tot rust komt. Door bezinken en opdrijven vindt scheiding plaats van de verontreinigingen die niet op het openbare riool mogen worden geloosd
definition: [EN 16323:2014] device to separate grease from wastewater @en
definition: [NEN 3300:1996] Toestel bestemd voor de behandeling van met vet verontreinigd afvalwater, waarin ten gevolge van verschil in dichtheid en het vertragen van de vloeistofstroom, vet door opdrijving grotendeels wordt verwijderd uit het afvalwater
author at start life: Finy Teitsma (Oranjewoud)
date of start life: 2007-10-23
validity context: 10d
comment: 20151014: NEN3300-definitie aangepast
scope note: Cof REV
scope note: Cof BAS
type: Class
subclass of: Constructieonderdeel
subclass of: Restriction
  on property: heeft Functie
  has value: Afscheiden vet
subclass of: Restriction
  on property: heeft Functie
  has value: Reinigen afvalwater
subclass of: Restriction
  on property: heeft Functie
  has value: Verwijderen opgedreven delen

Straatpot
author of change: Marinus Vonhof
date of change: 2018-12-06
definition: Een kokervormige constructie met een deksel om vanaf straatniveau toegang tot ondergrondse voorziening te geven
author at start life: Marinus Vonhof
date of start life: 2014-09-06
scope note: Cof MLD
scope note: Cof REV
scope note: Cof BAS
type: Class
subclass of: Deksel
subclass of: Restriction
  on property: heeft Functie
  has value: Afdekken ondergrondse voorziening

Projectreferentie opdrachtnemer
notation: EBI
author at start life: Marinus Vonhof
date of start life: 2015-10-26
validity context: 3d 6d 14d
comment: [is aspect]
scope note: Cof TOP
type: Class
subclass of: Unieke identificatie
subclass of: Restriction
  author at start life: Marinus Vonhof
  date of start life: 2015-10-26
  validity context: 1t 10t 12t
  on class: Project
  on property: has as aspect (inverse)
  max qualified cardinality: 1

Opening in wand
author of change: Marinus Vonhof
date of change: 2025-01-16
date of change: 2019-05-15
definition: Een opening in een wand zonder afvoerregeling
definition: [IMBOR] Een doorlaat in de vorm van een opening in een wand.
author at start life: Marinus Vonhof
date of start life: 2012-04-24
comment: Als de opening gecombineerd is met bijvoorbeeld een klep of schuif, gebruik dan een subtype van Mechanische Afsluiter als hydraulisch element
scope note: Cof MDS
scope note: Cof REV
scope note: Cof HYD
scope note: Cof DMO
type: Class
subclass of: Doorlaat
subclass of: Restriction
  author of change: Marinus Vonhof
  date of change: 2018-12-12
  author at start life: Marinus Vonhof
  date of start life: 2017-12-07
  on class: Stuwput
  on property: has as part (inverse)
  max qualified cardinality: 1
subclass of: Restriction
  on property: heeft Uitvoering
  has value: Uitsparing in wand

Waarneming
label: Observation @en
author of change: Marinus Vonhof
date of change: 2018-04-06
author at start life: Marinus Vonhof
date of start life: 2013-01-07
validity context: 5d 6d 11d
comment: Was specialisatie van Inspecteren
scope note: Cof TOP
type: Class
subclass of: Activiteit
subclass of: Restriction
  author of change: Marinus Vonhof
  date of change: 2014-08-06
  author at start life: Marinus Vonhof
  date of start life: 2013-01-05
  on class: Opmerking
  on property: has as aspect
  min qualified cardinality: 0

Overstortleiding
author of change: Finy Teitsma (Oranjewoud)
date of change: 2007-11-12
definition: Een gesloten rioolleiding voor het transport van het afvalwater van een overstortput naar het lozingspunt
definition: [NEN 3300:1996] riool bestemd voor de afvoer van afvalwater geloosd via een overstort
author at start life: Finy Teitsma (Oranjewoud)
date of start life: 2007-10-23
alternative label: Overstortriool
scope note: Cof MDS
scope note: Cof REV
scope note: Cof HYD
type: Class
subclass of: Vrijverval rioolleiding
subclass of: Restriction
  on property: heeft Functie
  has value: Transport van overstortend afvalwater

Peilbuisdeksel
author of change: Marinus Vonhof
author of change: Johan Post
date of change: 2025-01-16
date of change: 2026-05-01
definition: [IMBOR] De deksel aan het oppervlak die aanduidt dat het object in de ondergrond een peilbuis is.
author at start life: Marinus Vonhof
date of start life: 2018-12-06
validity context: 14d
scope note: Cof REV
scope note: Cof BAS
type: Class
subclass of: Deksel
subclass of: Restriction
  on property: heeft Functie
  has value: Afdekken van peilbuis

Projectreferentie opdrachtgever
label: Employers job reference @en
definition: [EN13508-2+A1] De opdrachtcode van de opdrachtgever
definition: [EN13508-2+A1] The employer’s job reference code @en
notation: ABJ
notation: CBJ
notation: EBJ
notation: GBJ
notation: JBJ
author at start life: Marinus Vonhof
date of start life: 2011-12-02
validity context: 3d 6d 14d
alternative label: Opdrachtcode opdrachtgever (EN)
comment: [is aspect]
scope note: Cof TOP
type: Class
subclass of: Unieke identificatie
subclass of: Restriction
  author of change: Marinus Vonhof
  date of change: 2015-10-26
  author at start life: Marinus Vonhof
  date of start life: 2011-12-02
  validity context: 1t 10t 12t
  on class: Project
  on property: has as aspect (inverse)
  max qualified cardinality: 1

Putbuis
author of change: Marinus Vonhof
date of change: 2025-01-16
date of change: 2018-12-11
definition: Een inspectieschacht aangebracht op een buis met grote afmeting
author at start life: Marinus Vonhof
date of start life: 2018-12-05
scope note: Cof MDS
scope note: Cof REV
scope note: Cof HYD
type: Class
subclass of: Rioolput
subclass of: Restriction
  on property: heeft Uitvoering
  has value: Inspectieschacht op leiding

Putdeksel - licht verkeer
author of change: Marinus Vonhof
date of change: 2025-01-16
definition: [IMBOR] Een deksel om de opening van een put af te sluiten, die sterk genoeg is om het passeren van voertuigen van gering gewicht te doorstaan.
author at start life: Marinus Vonhof
date of start life: 2018-12-06
scope note: Cof MDS
scope note: Cof REV
type: Class
subclass of: Putdeksel
subclass of: Restriction
  on property: heeft Functie
  has value: Dragen van licht verkeer

Putdeksel - zwaar verkeer
author of change: Marinus Vonhof
date of change: 2025-01-16
definition: [IMBOR] Een deksel om de opening van een put af te sluiten, die sterk genoeg is om het passeren van voertuigen van fors gewicht te doorstaan.
author at start life: Marinus Vonhof
date of start life: 2018-12-06
scope note: Cof MDS
scope note: Cof REV
type: Class
subclass of: Putdeksel
subclass of: Restriction
  on property: heeft Functie
  has value: Dragen van zwaar verkeer

RWS kolk
author of change: Marinus Vonhof
author of change: Johan Post
date of change: 2025-01-16
date of change: 2021-11-17
definition: [IMBOR] Tweedelige trottoirkolk beton/gietijzer, type RWS aansluitend op RWS-bandprofiel met U-vormige omranding.
author at start life: Marinus Vonhof
date of start life: 2021-08-06
scope note: Cof MDS
scope note: Cof RRB
scope note: Cof LDR
scope note: Cof REV
type: Class
subclass of: Kolk
subclass of: Restriction
  on property: heeft Uitvoering
  has value: Heeft U-vormige omranding
subclass of: Restriction
  on property: heeft Toepassing
  has value: Sluit aan op RWS-bandprofiel

Vorm deksel (coll)
comment: [is coll]
scope note: Cof MDS
scope note: Cof REV
type: Class
subclass of: Verzameling soorten
subclass of: Class
  one of: Rond
  one of: Rechthoekig

Vuilvangrooster
author of change: Marinus Vonhof
date of change: 2026-08-20
date of change: 2016-04-13
definition: Een constructie bij een put of leiding voor het opvangen van vuil uit afvalwater
author at start life: Finy Teitsma (Oranjewoud)
date of start life: 2007-10-23
validity context: 10d
scope note: Cof REV
scope note: Cof BAS
type: Class
subclass of: Constructieonderdeel
subclass of: Restriction
  author at start life: Marinus Vonhof
  date of start life: 2026-08-20
  on class: Rioolleiding
  on property: has as part (inverse)
  max qualified cardinality: 1
subclass of: Restriction
  author at start life: Marinus Vonhof
  date of start life: 2026-08-20
  on class: Rioolput
  on property: has as part (inverse)
  max qualified cardinality: 1
subclass of: Restriction
  on property: heeft Functie
  has value: Opvangen vuil
subclass of: Restriction
  on property: heeft Functie
  has value: Reinigen afvalwater

Stankafsluiter
definition: Een constructie om het vrijkomen van gassen uit het riool te voorkomen
author at start life: Marinus Vonhof
date of start life: 2020-05-26
validity context: 1d 3d 10d 12d 14d
scope note: Cof RRB
scope note: Cof REV
scope note: Cof BAS
type: Class
subclass of: Constructieonderdeel
subclass of: Restriction
  on property: heeft Functie
  has value: Voorkomen stank

Wervelventiel
label: Vortex flow control @en
author of change: Marinus Vonhof
date of change: 2017-12-13
definition: [NEN 3300:1996] doorlaat die het debiet regelt
notation: D
author at start life: Nic Roest (Idoro)
date of start life: 2007-11-29
validity context: 1d 3d
scope note: Cof MDS
scope note: Cof REV
scope note: Cof HYD
scope note: Cof DMO
type: Class
subclass of: Doorlaat
subclass of: Restriction
  author at start life: Marinus Vonhof
  date of start life: 2018-12-12
  on class: Stuwput
  on property: has as part (inverse)
  max qualified cardinality: 1
subclass of: Restriction
  on property: heeft Functie
  has value: Afremmen van de stroomsnelheid van het afvalwater

Verbeterd gemengd rioolstelsel
author of change: Marinus Vonhof
date of change: 2015-09-20
definition: [NEN 3300:1996] gemengd rioolstelsel met (rand)voorzieningen die de vuiluitworp richting oppervlaktewater beperken ten opzichte van de traditionele gemengde rioolstelsels
author at start life: Marinus Vonhof
date of start life: 2012-04-29
scope note: Cof TOP
type: Class
subclass of: Gemengd rioolstelsel
subclass of: Restriction
  on property: heeft Doel
  has value: Verminderen vuilbelasting van oppervlaktewater

Verdekte put
author of change: Marinus Vonhof
author of change: Eric van Gorkom
date of change: 2022-09-27
date of change: 2014-12-02
date of change: 2024-08-01
definition: [NEN 3300:1996] rioolput waarvan de bovenzijde niet zichtbaar is
author at start life: Marinus Vonhof
date of start life: 2012-04-29
scope note: Cof REV
scope note: Cof BAS
scope note: Cof HYD
type: Class
subclass of: Put
subclass of: Extra objecttype (rol)
subclass of: Restriction
  on property: heeft Uitvoering
  has value: Bovenzijde niet zichtbaar

Volgeschuimde put
author of change: Marinus Vonhof
date of change: 2025-01-16
definition: [IMBOR] Een put die buiten gebruik is, maar is volgeschuimd om problemen zoals ongedierte, gasvorming, en verzakkingen te voorkomen.
author at start life: Wouter van Riel
date of start life: 2022-09-26
scope note: Cof REV
scope note: Cof BAS
type: Class
subclass of: Loze put
subclass of: Restriction
  on property: heeft Uitvoering
  has value: Volgeschuimd

Volgezande put
definition: Een put die buiten gebruik is, maar vol zand gezet is om problemen zoals ongedierte, gasvorming, en verzakkingen te voorkomen.
author at start life: Johan Post
date of start life: 2026-05-18
scope note: Cof REV
scope note: Cof BAS
type: Class
subclass of: Loze put
subclass of: Restriction
  on property: heeft Uitvoering
  has value: Volgezand

Wervelput
author of change: Marinus Vonhof
date of change: 2017-05-31
definition: [NEN-EN 752:2008] ronde mantoegankelijke put waarin een groot niveauverschil wordt overbrugd doordat het afvalwater tangentiaal wordt ingelaten en spiraalsgewijs afstroomt
author at start life: Marinus Vonhof
date of start life: 2012-04-29
scope note: Cof MDS
scope note: Cof RRB
scope note: Cof LDR
scope note: Cof REV
scope note: Cof HYD
type: Class
subclass of: Rioolput
subclass of: Restriction
  on property: heeft Uitvoering
  has value: Mantoegankelijk
subclass of: Restriction
  on property: heeft Functie
  has value: Overbruggen groot niveauverschil
subclass of: Restriction
  on property: heeft Structuur
  has value: Rond
subclass of: Restriction
  on property: heeft Uitvoering
  has value: Tangentiaal inlaten en spiraalsgewijs laten afstromen

Y-stuk
author of change: Marinus Vonhof
date of change: 2025-01-16
definition: Een verbindingsstuk dat drie leidingen onder een niet-rechte hoek verbindt
definition: [IMBOR] Een verbindingsstuk in de vorm van een Y-splitsing.
author at start life: Marinus Vonhof
date of start life: 2017-05-31
validity context: 1d
scope note: Cof MDS
scope note: Cof LDR
scope note: Cof REV
scope note: Cof PLI
scope note: Cof HYD
type: Class
subclass of: Verbindingsstuk
subclass of: Restriction
  on property: heeft Functie
  has value: Verbinden van drie leidingen

Zinker
author of change: Marinus Vonhof
date of change: 2015-07-09
date of change: 2025-10-06
definition: Een gedeelte van een onder zwaartekracht werkend riool dat lager ligt dan de gedeelten die zich stroomopwaarts en stroomafwaarts bevinden, om onder een obstakel door te gaan..
definition: [NEN 3300:1996] Een verdiept gedeelte van een leiding ter plaatse van een object
definition: [NEN-EN 752:2008] gedeelte van een vrij verval aansluitleiding of riool dat lager ligt dan de gedeelten die zich stroomopwaarts en stroomafwaarts bevinden, om onder een obstakel door te gaan; als gevolg hiervan werkt een zinker onder druk
author at start life: Finy Teitsma (Oranjewoud)
date of start life: 2006-11-29
comment: 20151014: NEN3300-definitie aangepast
scope note: Cof REV
scope note: Cof BAS
type: Class
subclass of: Leiding
subclass of: Extra objecttype (rol)
subclass of: Restriction
  on property: heeft Uitvoering
  has value: Een deel ligt lager dan de delen stroomopwaarts en stroomafwaarts
subclass of: Restriction
  on property: heeft Technologie
  has value: Transport onder overdruk
subclass of: Restriction
  on property: heeft Functie
  has value: Transport van afvalwater onder een obstakel door

Zinkerput
author of change: Marinus Vonhof
date of change: 2017-05-31
definition: [NEN 3300:1996] rioolput waarop een zinker is aangesloten
author at start life: Marinus Vonhof
date of start life: 2012-04-29
validity context: 1d 3d
scope note: Cof MDS
scope note: Cof RRB
scope note: Cof LDR
scope note: Cof REV
scope note: Cof HYD
type: Class
subclass of: Rioolput
subclass of: Restriction
  on property: heeft Functie
  has value: Toegang geven tot zinker

BGT
alternative label: IMGeo of BGT
type: Wijze van inwinning (coll)

GNSS Landmeting
author of change: Johan Post
date of change: 2024-05-01
definition: GNSS staat voor global navigation sattelite system, wat naast GPS ook het Europese Galileo, het Russische Glonass en het Chinese Beidoe omvat.
type: Wijze van inwinning (coll)

GNSS Vanuit wagen
author of change: Johan Post
date of change: 2024-05-01
definition: Bijvoorbeeld tijdens kolkenreinigen
type: Wijze van inwinning (coll)

Inmeting
author of change: Marinus Vonhof
date of change: 2025-01-16
definition: Met waterpastoestel, theodoliet, meetlint
definition: [IMBOR] Het gegeven over het object is ingewonnen door middel van een nader te specificeren meetinstrument dat, bijvoorbeeld, gebruikt is om de exacte omvang of de inhoud van een object op te meten.
type: Wijze van inwinning (coll)

LIDAR 3D
author at start life: Johan Post
date of start life: 2026-05-04
type: Wijze van inwinning (coll)

Objecttype niet kunnen achterhalen
definition: Een poging om het objecttype te achterhalen is niet succesvol geweest
author at start life: Johan Post
date of start life: 2026-08-12
type: Wijze van inwinning (coll)

Waterpassing
definition: Een specificatie van inmeting
author at start life: Marinus Vonhof
date of start life: 2025-10-07
type: Wijze van inwinning (coll)

Door middel van drukverschil
type: Technologie

Transport onder overdruk
type: Technologie

Mechanisch
type: Technologie

Transport onder overdruk of onderdruk
type: Technologie

Statisch
type: Technologie

Transport door de zwaartekracht
type: Technologie

Vorm van een plaat
type: Uitvoering

Afgedopt
type: Uitvoering

Bestaat meestal uit baksteen
type: Uitvoering

Beton
label: Concrete @en
author of change: Marinus Vonhof
date of change: 2025-01-16
definition: [IMBOR] Een kunstmatig, steenachtig materiaal dat veelal is samengesteld uit het bindmiddel cement en uit een of meer toeslagmaterialen zoals zand, grind of steenslag.
notation: BET
notation: AG
notation: BETON
type: Uitvoering
type: Mechanisme
type: Materiaal deksel (coll)
type: Materiaal leiding (coll)
type: Materiaal put (coll)

Betongevuld
type: Uitvoering

Put met speciale voorzieningen
type: Uitvoering

Geen opening aan de bovenzijde
type: Uitvoering

Buis in gebogen vorm
type: Uitvoering

Constructie van enige omvang
type: Uitvoering

Verbonden met de grond
type: Uitvoering

Bovenzijde niet zichtbaar
type: Uitvoering

Doorlatend
type: Uitvoering

Waterdoorlatende wanden
type: Uitvoering

Een deel ligt lager dan de delen stroomopwaarts en stroomafwaarts
type: Uitvoering

Met de inlaat aan de boven- en voorzijde
type: Uitvoering

Gegraven of geboorde kokervormige diepte
type: Uitvoering

Geheel van stelsels
type: Uitvoering

Open en aansluitend aan verharding
type: Uitvoering

Opening aan de bovenzijde
type: Uitvoering

Heeft U-vormige omranding
type: Uitvoering

Verbonden met leiding
type: Uitvoering

Verbonden met rioolput
type: Uitvoering

Toegankelijk voor inspectie- en reinigingsapparatuur
type: Uitvoering

Verwijderbaar deksel
type: Uitvoering

Inspectieschacht op leiding
type: Uitvoering

Metalen beugel
type: Uitvoering

Naar ander rioolstelsel
type: Uitvoering

Scharnierend
type: Uitvoering

Mantoegankelijk
type: Uitvoering

Staal
label: Steel @en
author of change: Marinus Vonhof
date of change: 2025-01-16
definition: [IMBOR] Een legering die bestaat uit ijzer en een geringe hoeveelheid koolstof, zodanig dat dit metaal gekarakteriseerd wordt door de eigenschap van vervormbaarheid bij verhitting.
notation: AP
notation: STAAL
notation: STL
type: Uitvoering
type: Materiaal deksel (coll)
type: Materiaal leiding (coll)
type: Materiaal put (coll)

Met de inlaat aan de bovenzijde
type: Uitvoering

Met de inlaat aan de voorzijde
type: Uitvoering

Natuurlijk of kunstmatig gebied
type: Uitvoering

Netwerk van verbonden knooppunten
type: Uitvoering

Uitsparing in wand
type: Uitvoering

Verticale waterdichte constructie
type: Uitvoering

Stank afsluiten met water
type: Uitvoering

Stank afsluiten met scherm
type: Uitvoering

Verhoging putschacht
type: Uitvoering

Tangentiaal inlaten en spiraalsgewijs laten afstromen
type: Uitvoering

Zonder aansluitingen
type: Uitvoering

Volgeschuimd
type: Uitvoering

Volgezand
type: Uitvoering

Aangehechte afzetting in object
author of change: Marinus Vonhof
date of change: 2025-05-30
author at start life: Marinus Vonhof
date of start life: 2024-09-18
type: Melding meting knooppunt (coll)
type: Melding meting leiding (coll)

Geur waargenomen
author at start life: Marinus Vonhof
date of start life: 2024-09-18
type: Melding meting knooppunt (coll)

Grond in object
author of change: Marinus Vonhof
date of change: 2025-05-30
author at start life: Marinus Vonhof
date of start life: 2024-09-18
type: Melding meting knooppunt (coll)
type: Melding meting leiding (coll)

Scheur in object
author at start life: Marinus Vonhof
date of start life: 2024-09-18
type: Melding meting knooppunt (coll)
type: Melding meting leiding (coll)

Oppervlakteschade in object
author at start life: Marinus Vonhof
date of start life: 2024-09-18
type: Melding meting knooppunt (coll)

Toegang tot object belemmerd
author at start life: Marinus Vonhof
date of start life: 2024-09-18
type: Melding meting knooppunt (coll)

Toegang tot bodem belemmerd
definition: Object wel toegankelijk maar de bodem is niet waarneembaar, bijvoorbeeld vanwege vuil of obstakels.
author at start life: Marinus Vonhof
date of start life: 2025-12-20
type: Melding meting knooppunt (coll)

Vuil in object
author of change: Marinus Vonhof
date of change: 2025-05-30
author at start life: Marinus Vonhof
date of start life: 2024-09-18
type: Melding meting knooppunt (coll)
type: Melding meting leiding (coll)

Wortels in object
author at start life: Marinus Vonhof
date of start life: 2024-09-18
type: Melding meting knooppunt (coll)
type: Melding meting leiding (coll)

Object niet gevonden
author at start life: Marinus Vonhof
date of start life: 2024-09-18
type: Melding meting knooppunt (coll)
type: Melding meting leiding (coll)

Object ontbreekt in opdracht
author at start life: Marinus Vonhof
date of start life: 2024-09-18
type: Melding meting knooppunt (coll)
type: Melding meting leiding (coll)

Ongedierte in object
author at start life: Marinus Vonhof
date of start life: 2024-09-18
type: Melding meting knooppunt (coll)
type: Melding meting leiding (coll)

Afmeting leiding wijkt af bij eindpunt
author at start life: Marinus Vonhof
date of start life: 2024-09-18
type: Melding meting leiding (coll)

Object niet te meten
author at start life: Marinus Vonhof
date of start life: 2024-09-18
type: Melding meting leiding (coll)

Object te diep voor meting
author at start life: Marinus Vonhof
date of start life: 2024-09-18
type: Melding meting leiding (coll)

Aanvoer van afvalwater
type: Functie

Afdekken
type: Functie

Afdekken ondergrondse voorziening
type: Functie

Afdekken put
type: Functie

Afdekken van peilbuis
type: Functie

Afremmen van de stroomsnelheid van het afvalwater
type: Functie

Afscheiden vet
type: Functie

Afschermen
type: Functie

Afsluiten
type: Functie

Beschermen tegen begroeiing
type: Functie

Inzameling van afvalwater
type: Functie

Transport van afvalwater
type: Functie

Afvoer naar kolkaansluitleiding
type: Functie

Afvoeren hemelwater naar de bovengrond
author at start life: Johan Post
date of start life: 2026-05-04
type: Functie

Afvoeren hemelwater naar de ondergrond
type: Functie

Amfibieën en zoogdieren redden
type: Functie

Meten, regelen, controleren en onderhouden
type: Functie

Beluchten of ventileren
type: Functie

Beperken debiet
type: Functie

Bezinken stoffen
type: Functie

Tijdelijke berging van afvalwater
type: Functie

Beschermen tegen vallen
type: Functie

Verbinden van leidingen in een hoek
type: Functie

Geleiden van de afvoer van het afvalwater
type: Functie

Inzameling van hemelwater
type: Functie

Transport van grondwater
type: Functie

Transport van hemelwater
type: Functie

Toegankelijk houden
type: Functie

Dragen van licht verkeer
type: Functie

Dragen van zwaar verkeer
type: Functie

Transport van vuilwater
type: Functie

Verbinding tussen oppervlaktewater
type: Functie

Voorkomen van explosie
type: Functie

Lozen buiten het stelsel
type: Functie

Fixeren putdeksel
type: Functie

Geen functie
type: Functie

Verpompen van water
type: Functie

Inzameling van vuilwater
type: Functie

Inzameling van hemelwater en vuilwater
type: Functie

Tijdelijke berging van hemelwater en vuilwater
type: Functie

Transport van hemelwater en vuilwater
type: Functie

Opvang en afvoer hemelwater
type: Functie

Tijdelijke berging van hemelwater
type: Functie

Verbinden aansluitleiding met rioolput of rioolleiding
type: Functie

Toegang geven tot het rioolstelsel
type: Functie

Toegang verschaffen
type: Functie

Lozen binnen het stelsel
type: Functie

Keren van water
type: Functie

Opvang van afstromend hemelwater
type: Functie

Leiding gescheiden laten kruisen
type: Functie

Voorkomen dat stromen elkaar raken
type: Functie

Verbinden van vier leidingen
type: Functie

Opvangen vuil
type: Functie

Reinigen afvalwater
type: Functie

Voortgeleiding van materie
type: Functie

Leidingen aansluiten
type: Functie

Overtollig afvalwater laten wegstromen
type: Functie

Opslag van water
type: Functie

Overbruggen groot niveauverschil
type: Functie

Transport van overstortend afvalwater
type: Functie

Verplaatsen van water
type: Functie

Verpompen van afvalwater
type: Functie

Rioolleidingen aansluiten
type: Functie

Voorkomen stank
type: Functie

Waterniveau in stelsel regelen
type: Functie

Verbinden van drie leidingen
type: Functie

Tijdelijke berging van vuilwater
type: Functie

Toegang geven tot zinker
type: Functie

Transport van afvalwater onder een obstakel door
type: Functie

Verbinden van leidingen
type: Functie

Verwijderen opgedreven delen
type: Functie

Verminderen vuilbelasting van oppervlaktewater
type: Doel

Putdeksel op maaiveldhoogte brengen
type: Doel

Aansluiting ontbreekt
type: Toepassing

Calamiteit
type: Toepassing

Deel van een op zichzelf staande constructie
type: Toepassing

Drainput
type: Toepassing

Onderdeel van een leiding
type: Toepassing

Sluit aan op RWS-bandprofiel
type: Toepassing

Toegang voor injecteren
type: Toepassing

Gietijzer
label: Cast iron @en
author of change: Marinus Vonhof
date of change: 2025-01-16
definition: [IMBOR] Een in vormen gegoten legering van ijzer, koolstof, mangaan en silicium.
notation: AM
notation: GIJ
type: Materiaal deksel (coll)
type: Materiaal leiding (coll)
type: Materiaal put (coll)

Roestvast staal
label: Stainless steel @en
author of change: Marinus Vonhof
date of change: 2025-01-16
definition: [IMBOR] Afkorting van roestvast staal, een verzamelnaam voor legeringen die hoofdzakelijk uit ijzer bestaan met minimaal 11 tot 12% chroom en maximaal 1,2% koolstof.
notation: C
alternative label: RVS
alternative label: Roestvaststaal
alternative label: Roestvrijstaal
type: Materiaal deksel (coll)
type: Materiaal leiding (coll)

Eivormig
label: Egg shaped @en
author of change: Marinus Vonhof
date of change: 2025-01-16
definition: Met de brede zijde bovenaan
definition: [IMBOR] Elliptisch.
notation: C
notation: EIV
type: Vorm leiding (coll)

Eivormig omgekeerd
definition: Met de brede zijde onderaan
notation: EIG
type: Vorm leiding (coll)

Heul
label: Arch shaped @en
author of change: Marinus Vonhof
date of change: 2025-01-16
definition: [EN13508-2+A1] Circular soffit and flat invert with parallel sides @en
definition: [EN13508-2+A1] Cirkelvormige bovenkant en vlakke bodem met evenwijdige zijden
definition: [IMBOR] Het object is boogvormig en is met een platte onderzijde aan de ondergrond bevestigd.
notation: E
notation: HEU
type: Vorm leiding (coll)

Muil
label: Mouth profile @en
author of change: Marinus Vonhof
date of change: 2025-01-16
definition: [IMBOR] Het object heeft een liggend ellipsprofiel, waarbij de bovenzijde ronder is dan de onderzijde.
notation: MVR
type: Vorm leiding (coll)

Ovaal
label: Oval @en
author of change: Marinus Vonhof
date of change: 2025-01-16
definition: [EN13508-2+A1] Cirkelvormige bodem en bovenkant (met gelijke middellijn) met evenwijdige zijden
definition: [IMBOR] Een afgeplatte of uitgerekte cirkel.
definition: [Wikipedia] Ellips vorm, gevormd door alle punten waarvoor de som van de afstanden tot twee gekozen punten, de brandpunten, een vaste waarde heeft.
notation: F
notation: OVA
comment: Bron afbeelding: nl.wikipedia.org
type: Vorm leiding (coll)

Rechthoekig
label: Rectangular @en
author of change: Marinus Vonhof
date of change: 2025-01-16
date of change: 2025-12-19
definition: [IMBOR] Een vierhoek met louter rechte hoeken.
notation: B
notation: RHK
alternative label: Kokerprofiel
type: Vorm leiding (coll)
type: Vorm opening (coll)
type: Vorm put (coll)
type: Vorm deksel (coll)

Rond
label: Circular @en
author of change: Marinus Vonhof
author of change: Johan Post
date of change: 2025-01-16
date of change: 2022-09-29
date of change: 2024-04-30
date of change: 2025-12-19
date of change: 2024-07-15
date of change: 2024-05-20
definition: [IMBOR] Cirkelvormig en zonder hoeken.
notation: A
notation: RND
type: Vorm leiding (coll)
type: Vorm opening (coll)
type: Vorm put (coll)
type: Structuur
type: Vorm deksel (coll)

Trapezium
author of change: Marinus Vonhof
date of change: 2026-07-13
definition: In het geval van een leidingvorm: Gesloten of open leidingprofiel. Als er geen profiel-geometrie is meegegeven geldt: de breedte leiding = bodembreedte, de hellingshoek aan beide zijden = 45 graden. De hoogte leiding bepaalt dan de bovenbreedte.
definition: Trapeziumvormig
notation: TPZ
type: Vorm leiding (coll)

U-vorm
label: U-shape @en
author of change: Marinus Vonhof
date of change: 2025-01-16
definition: In het geval van een leidingvorm: Omgekeerd heul profiel, cirkelvormige onderkant
definition: [IMBOR] De vorm van de letter U hebbende.
notation: D
notation: UVR
type: Vorm leiding (coll)

Anders (vorm)
author of change: Marinus Vonhof
date of change: 2025-12-19
definition: Als de vorm van het object niet rechthoeking of rond is. Vul bij de afmeting de grootste waarden in.
type: Vorm opening (coll)
type: Vorm put (coll)

Glasvezel versterkte kunststof
label: Fibre reinforced plastics @en
author of change: Marinus Vonhof
date of change: 2025-01-16
definition: [IMBOR] Een kunststof die is versterkt met een haarfijne vezel gemaakt van glas.
notation: AL
notation: GVK
alternative label: GVK
type: Materiaal deksel (coll)
type: Materiaal leiding (coll)
type: Materiaal put (coll)
type: Materiaal lining (coll)

Soort ijzer of staal, niet geïdentificeerd
label: Unidentified type of Iron or steel @en
author of change: Marinus Vonhof
date of change: 2025-10-30
notation: AQ
type: Materiaal deksel (coll)
type: Materiaal leiding (coll)
type: Materiaal put (coll)

Soort kunststof, niet geïdentificeerd
label: Unidentified type of plastics @en
author of change: Marinus Vonhof
date of change: 2025-10-30
notation: AY
type: Materiaal deksel (coll)
type: Materiaal leiding (coll)
type: Materiaal put (coll)

PVC
label: Polyvinyl chloride @en
author of change: Marinus Vonhof
date of change: 2025-01-16
definition: [IMBOR] Een veelvuldig toegepaste thermoplast die ontstaat na polymerisatie van vinylchloride.
notation: AX
notation: PVC
alternative label: PVC-U @en
alternative label: Polyvinylchloride
type: Materiaal deksel (coll)
type: Materiaal leiding (coll)
type: Materiaal put (coll)
type: Materiaal lining (coll)

Polymeerbeton
label: Polymer concrete @en
author of change: Johan Post
date of change: 2026-05-04
definition: [IMBOR] Beton waarbij kunststof is toegevoegd om het sterker en chemisch bestendiger te maken
type: Materiaal deksel (coll)
type: Materiaal leiding (coll)
type: Materiaal lining (coll)

Gres
author of change: Marinus Vonhof
date of change: 2025-01-16
definition: [IMBOR] Een keramisch materiaal dat gemaakt is van een kleisoort die tegen hoge temperaturen bestand is. (Bron: Wikipedia)
notation: GRE
notation: GRES
type: Materiaal leiding (coll)
type: Materiaal put (coll)

Metselwerk
author of change: Marinus Vonhof
date of change: 2025-01-16
definition: [IMBOR] Stenen die met cement of een variant daarop aan elkaar verbonden zijn.
notation: METSELWERK
notation: MSW
author at start life: Marinus Vonhof
author at start life: Johan Post
date of start life: 2022-10-03
date of start life: 2026-05-21
validity context: 1d 3d 10d 12d 14d
type: Materiaal leiding (coll)
type: Materiaal put (coll)

Metselwerk (baksteen)
label: Brickwork @en
author of change: Marinus Vonhof
date of change: 2025-01-16
definition: [IMBOR] Gebakken klinkers die met cement of een variant daarop aan elkaar verbonden zijn.
notation: MSW
notation: AD
type: Materiaal leiding (coll)
type: Materiaal put (coll)

Metselwerk (bepleisterd)
label: Masonry (coursed) @en
author of change: Marinus Vonhof
date of change: 2025-01-16
definition: [IMBOR] Gebakken klinkers die met cement of een variant daarop aan elkaar verbonden zijn en waar een pleisterlaag (een smeerbaar materiaal ten behoeve van de afwerking) op is aangebracht.
notation: MSW
notation: AR
type: Materiaal leiding (coll)
type: Materiaal put (coll)

Metselwerk (onbepleisterd)
label: Masonry (uncoursed) @en
author of change: Marinus Vonhof
date of change: 2025-01-16
definition: [IMBOR] Gebakken klinkers die met cement of een variant daarop aan elkaar verbonden zijn en waar geen pleisterlaag (een smeerbaar materiaal ten behoeve van de afwerking) op is aangebracht.
notation: MSW
notation: AS
type: Materiaal leiding (coll)
type: Materiaal put (coll)

Plaatijzer
author of change: Marinus Vonhof
date of change: 2025-01-16
definition: [IMBOR] IJzer dat in de vorm van een plaat is gedrukt.
notation: PIJ
type: Materiaal leiding (coll)

Betonnen segmenten
label: Concrete segments @en
notation: AJ
alternative label: Betonnen segment
type: Materiaal leiding (coll)
type: Materiaal put (coll)
type: Materiaal lining (coll)

Zwavelbeton
definition: een betonsoort waarbij het aandeel cement en water vervangen is door gemodificeerd zwavel als bindmiddel. Dit geeft een CO2 reductie en maakt het geschikt voor chemisch agressieve omgevingen
author at start life: Johan Post
date of start life: 2026-07-02
type: Materiaal leiding (coll)
type: Materiaal put (coll)

Mergel
definition: [IMBOR] Een sedimentair gesteente dat voor 25-75% uit kalk bestaat en voor het restant uit klei.
author at start life: Johan Post
date of start life: 2026-05-04
type: Materiaal leiding (coll)
type: Materiaal put (coll)

Gesloten
type: Structuur

Geulprofiel
author of change: Johan Post
date of change: 2022-09-29
definition: Halfrondprofiel met banquettes aan beide zijkanten.
type: Bodemprofiel (coll)

Bolle bodem
author of change: Marinus Vonhof
date of change: 2024-05-18
definition: Rond uitgevoerd bodemoppervlak bedoeld voor het geleiden van de afvoer van afvalwater.
author at start life: Johan Post
date of start life: 2024-04-30
type: Bodemprofiel (coll)

Vlakke bodem
definition: Uitvoering zonder voorziening voor het geleiden van de afvoer van afvalwater.
author at start life: Johan Post
date of start life: 2024-04-30
type: Bodemprofiel (coll)

Vlakke bodem met banken
definition: Vlakke bodem met banquettes aan beide zijkanten.
author at start life: Johan Post
date of start life: 2024-04-30
type: Bodemprofiel (coll)

Buiten gebruik
author of change: Marinus Vonhof
date of change: 2025-01-16
definition: [IMBOR] Statusbeschrijving die aangeeft dat een object niet bruikbaar is voor zijn gebruikelijke functie.
type: Status functioneren (coll)

In aanleg
author of change: Marinus Vonhof
date of change: 2025-01-16
definition: [IMBOR] Statusbeschrijving die aangeeft dat een object zich bevindt in het proces van realisatie.
type: Status functioneren (coll)

In gebruik
author of change: Marinus Vonhof
date of change: 2025-01-16
definition: [IMBOR] Het object is een actualiteit in de werkelijkheid.
notation: ACT
type: Status functioneren (coll)

In ontwerp
author of change: Marinus Vonhof
date of change: 2025-01-16
definition: [IMBOR] Het object is planmatig geschapen, maar nog niet gerealiseerd in de werkelijkheid.
notation: ONT
type: Status functioneren (coll)

Deksel boven maaiveld
author at start life: Marinus Vonhof
date of start life: 2024-09-18
type: Melding meting deksel (coll)

Deksel gebroken
author at start life: Marinus Vonhof
date of start life: 2025-05-30
type: Melding meting deksel (coll)

Deksel naast object
author at start life: Marinus Vonhof
date of start life: 2024-09-18
type: Melding meting deksel (coll)

Deksel niet op hart put
definition: De deksel bevindt zich niet in het middelpunt van het object (hart put)
author at start life: Marinus Vonhof
date of start life: 2025-11-11
type: Melding meting deksel (coll)

Deksel onder maaiveld
author at start life: Marinus Vonhof
date of start life: 2024-09-18
type: Melding meting deksel (coll)

Deksel ontbreekt
author at start life: Marinus Vonhof
date of start life: 2024-09-18
type: Melding meting deksel (coll)

Deksel zit vast
type: Melding meting deksel (coll)

Gebroken putrand
author at start life: Marinus Vonhof
date of start life: 2025-05-30
type: Melding meting deksel (coll)