Deelmodel MdsProj, filter collectie_MDSTOP1_v1.7
type: Ontology
version info: Deelmodel MdsProj, filter op CoFs MDS TOP, cfk=1, versie=1.7 (2026-08-26T14:12:23)

has as aspect
type: ObjectProperty

has as output (inverse)
type: ObjectProperty
inverse of: has as output

has as aspect (inverse)
type: ObjectProperty
inverse of: has as aspect

has as reference (qualification)
type: ObjectProperty
type: FunctionalProperty

has as part (inverse)
type: ObjectProperty
inverse of: has as part

has as input
type: ObjectProperty

has as output
type: ObjectProperty

has as part
type: ObjectProperty

is connected to
type: ObjectProperty
type: SymmetricProperty

heeft Functie
type: ObjectProperty
range: Functie

has as input (inverse)
type: ObjectProperty
inverse of: has as input

heeft Doel
validity context: 6d
type: ObjectProperty
range: Doel

is represented by
author of change: Marinus Vonhof
date of change: 2026-07-23
comment: Vanaf versie 1.7.0 is deze relatie niet meer functioneel. Documentatie is representatie ipv kenmerk geworden, daarmee kan een subject meerdere representaties (symbool, revisietekening) hebben.
type: ObjectProperty

heeft Uitvoering
validity context: 6d
type: ObjectProperty
range: Uitvoering

heeft Technologie
validity context: 6d
type: ObjectProperty
range: Technologie

heeft Mechanisme
validity context: 6d
type: ObjectProperty
range: Mechanisme

heeft Toepassing
validity context: 6d
type: ObjectProperty
range: Toepassing

heeft Structuur
validity context: 6d
type: ObjectProperty
range: Structuur

is represented by (inverse)
type: ObjectProperty
inverse of: is represented by

author of change
type: AnnotationProperty
range: string

date of change
type: AnnotationProperty
range: date

author at start life
type: AnnotationProperty
range: string

date of start life
type: AnnotationProperty
range: date

units of measurements
type: AnnotationProperty

validity context
type: AnnotationProperty

has as value
type: FunctionalProperty
type: DatatypeProperty

Aantal woningen (datatype)
type: Datatype
equivalent class: Datatype
  on datatype: integer
  with restrictions:
    min inclusive: 0
  with restrictions:
    max inclusive: 9999

Afvoercoëfficiënt (datatype)
type: Datatype
equivalent class: Datatype
  on datatype: decimal
  with restrictions:
    min inclusive: 0
  with restrictions:
    max inclusive: 99

Breedte bouwwerk (datatype)
type: Datatype
equivalent class: Datatype
  on datatype: integer
  with restrictions:
    min inclusive: 500
  with restrictions:
    max inclusive: 10000

Breedte leiding (datatype)
type: Datatype
equivalent class: Datatype
  on datatype: integer
  with restrictions:
    min inclusive: 63
  with restrictions:
    max inclusive: 4000

Breedte put (datatype)
type: Datatype
equivalent class: Datatype
  on datatype: integer
  with restrictions:
    min inclusive: 300
  with restrictions:
    max inclusive: 4000

Diameter leiding (datatype)
type: Datatype
equivalent class: Datatype
  on datatype: integer
  with restrictions:
    min inclusive: 63
  with restrictions:
    max inclusive: 4000

Diameter put (datatype)
type: Datatype
equivalent class: Datatype
  on datatype: integer
  with restrictions:
    min inclusive: 300
  with restrictions:
    max inclusive: 4000

Hoogte bouwwerk (datatype)
type: Datatype
equivalent class: Datatype
  on datatype: integer
  with restrictions:
    min inclusive: 500
  with restrictions:
    max inclusive: 10000

Hoogte leiding (datatype)
type: Datatype
equivalent class: Datatype
  on datatype: integer
  with restrictions:
    min inclusive: 63
  with restrictions:
    max inclusive: 4000

Hoogte put (datatype)
type: Datatype
equivalent class: Datatype
  on datatype: integer
  with restrictions:
    min inclusive: 500
  with restrictions:
    max inclusive: 4000

Lengte bouwwerk (datatype)
type: Datatype
equivalent class: Datatype
  on datatype: integer
  with restrictions:
    min inclusive: 500
  with restrictions:
    max inclusive: 10000

Lengte leiding (datatype)
type: Datatype
equivalent class: Datatype
  on datatype: decimal
  with restrictions:
    min inclusive: 1
  with restrictions:
    max inclusive: 75

Lengte put (datatype)
type: Datatype
equivalent class: Datatype
  on datatype: integer
  with restrictions:
    min inclusive: 300
  with restrictions:
    max inclusive: 4000

Maximale capaciteit doorlaat (datatype)
type: Datatype
equivalent class: Datatype
  on datatype: decimal
  with restrictions:
    min inclusive: 0
  with restrictions:
    max inclusive: 99999

Porositeit (datatype)
type: Datatype
equivalent class: Datatype
  on datatype: decimal
  with restrictions:
    min inclusive: 0
  with restrictions:
    max inclusive: 99

Z-coördinaat (datatype)
type: Datatype
equivalent class: Datatype
  on datatype: decimal
  with restrictions:
    min inclusive: -20
  with restrictions:
    max inclusive: 325

Visueel inspecteren vrijverval leiding
label: Visual inspection drains and sewers @en
author of change: Marinus Vonhof
date of change: 2018-05-01
author at start life: Marinus Vonhof
date of start life: 2012-08-15
scope note: Cof MDS
scope note: Cof EN
scope note: Cof MTR
type: Class
subclass of: Visueel inspecteren
subclass of: Restriction
  author of change: Marinus Vonhof
  date of change: 2014-09-03
  author at start life: Marinus Vonhof
  date of start life: 2014-04-29
  on class: Inspectieproject riolering
  on property: has as part (inverse)
  qualified cardinality: 1
subclass of: Restriction
  author of change: Marinus Vonhof
  date of change: 2015-10-20
  author at start life: Marinus Vonhof
  date of start life: 2012-08-15
  validity context: *t
  comment: Relatie (kardinaliteit) uitgeschakeld voor CFK's (SHACL-syntax) (20260403) (20260824)
  on class: Vrijverval rioolleiding
  on property: has as output
  max qualified cardinality: 1
subclass of: Restriction
  author of change: Marinus Vonhof
  date of change: 2018-04-06
  author at start life: Marinus Vonhof
  date of start life: 2014-08-29
  on class: Vrijverval rioolleiding
  on property: has as input
  qualified cardinality: 1
subclass of: Restriction
  author of change: Marinus Vonhof
  date of change: 2024-07-29
  author at start life: Marinus Vonhof
  date of start life: 2020-04-20
  on class: Voegmateriaal
  on property: has as output
  min qualified cardinality: 0

Vorm leiding
label: Shape @en
author of change: Marinus Vonhof
date of change: 2015-05-29
definition: [EN13508-2+A1] The shape of the cross-section of the pipeline as follows @en
notation: ACA
notation: GCA
author at start life: Marinus Vonhof
date of start life: 2012-05-01
comment: Intrinsiek aspect
comment: [is aspect]
scope note: Cof TOP
type: Class
subclass of: Vorm
subclass of: Restriction
  author of change: Marinus Vonhof
  date of change: 2015-10-31
  author at start life: Finy Teitsma (Oranjewoud)
  date of start life: 2006-02-25
  validity context: *t
  on class: Leiding
  on property: has as aspect (inverse)
  qualified cardinality: 1
subclass of: Restriction
  author at start life: Marinus Vonhof
  date of start life: 2015-10-30
  on class: Inwinning
  on property: has as aspect
  max qualified cardinality: 1
subclass of: Restriction
  on property: has as reference (qualification)
  all values from: Vorm leiding (coll)

Hoogte leiding
label: Height @en
author of change: Marinus Vonhof
date of change: 2019-01-24
definition: De bij het materiaal gebruikelijke aanduiding van de hoogte van een leiding (zie diameter leiding)
definition: [EN13508-2+A1] The height of the section in millimetres @en
notation: ACB
notation: GCB
author at start life: Marinus Vonhof
date of start life: 2011-12-15
units of measurements: mm
comment: Intrinsiek aspect
comment: [is aspect]
scope note: Cof TOP
type: Class
subclass of: Hoogte
subclass of: Restriction
  author of change: Marinus Vonhof
  date of change: 2014-12-03
  author at start life: Marinus Vonhof
  date of start life: 2011-12-15
  validity context: *t
  on class: Leiding
  on property: has as aspect (inverse)
  qualified cardinality: 1
subclass of: Restriction
  author at start life: Marinus Vonhof
  date of start life: 2024-05-16
  on class: Inwinning
  on property: has as aspect
  max qualified cardinality: 1
subclass of: Restriction
  on property: has as value
  all values from: Hoogte leiding (datatype)

Breedte leiding
label: Width @en
author of change: Marinus Vonhof
date of change: 2019-01-24
definition: De bij het materiaal gebruikelijke aanduiding van de breedte van een leiding (zie diameter leiding)
definition: [EN13508-2+A1] The width of the section in millimetres. (Not required where both dimensions are the same -e.g. circle) @en
notation: ACC
notation: GCC
author at start life: Marinus Vonhof
date of start life: 2013-09-17
units of measurements: mm
comment: Intrinsiek aspect
comment: [is aspect]
scope note: Cof TOP
type: Class
subclass of: Breedte
subclass of: Restriction
  author of change: Marinus Vonhof
  date of change: 2015-05-29
  author at start life: Marinus Vonhof
  date of start life: 2011-12-15
  validity context: *t
  on class: Leiding
  on property: has as aspect (inverse)
  qualified cardinality: 1
subclass of: Restriction
  author at start life: Marinus Vonhof
  date of start life: 2024-05-16
  on class: Inwinning
  on property: has as aspect
  max qualified cardinality: 1
subclass of: Restriction
  on property: has as value
  all values from: Breedte leiding (datatype)

Materiaal leiding
label: Material sewer @en
author of change: Johan Post
date of change: 2022-09-29
definition: De bouwstof van de leiding
definition: [EN13508-2+A1] The material of the fabric of the sewer, in accordance with Table C.4. Where the pipeline has been lined the material recorded is the material of the original pipeline @en
notation: ACD
notation: GCD
author at start life: Marinus Vonhof
date of start life: 2013-09-17
comment: Intrinsiek aspect
alternative label: Leidingmateriaal
comment: [is aspect]
scope note: Cof TOP
type: Class
subclass of: Materiaal
subclass of: Restriction
  author of change: Marinus Vonhof
  date of change: 2015-06-01
  author at start life: Finy Teitsma (Oranjewoud)
  date of start life: 2006-02-25
  validity context: *t
  on class: Leiding
  on property: has as aspect (inverse)
  qualified cardinality: 1
subclass of: Restriction
  on property: has as reference (qualification)
  all values from: Materiaal leiding (coll)
subclass of: Restriction
  on class: Inwinning
  on property: has as aspect
  max qualified cardinality: 1

Materiaal lining
label: Lining material @en
author of change: Marinus Vonhof
definition: [EN13508-2+A1] Het materiaal van de lining in overeenstemming met tabel C.4 @en
notation: ACF
author at start life: Marinus Vonhof
date of start life: 2018-12-13
comment: Intrinsiek aspect
comment: Vanaf GWSW 1.7 is de collectie lining-materialen beperkt t.o.v. de EN13508-2+A1
comment: [is aspect]
scope note: Cof MDS
scope note: Cof EN
scope note: Cof RRB
scope note: Cof MTR
type: Class
subclass of: Materiaal
subclass of: Restriction
  author of change: Marinus Vonhof
  date of change: 2018-12-12
  author at start life: Marinus Vonhof
  date of start life: 2013-09-20
  on class: Lining
  on property: has as aspect (inverse)
  max qualified cardinality: 1
subclass of: Restriction
  on property: has as reference (qualification)
  all values from: Materiaal lining (coll)

Wijze van inwinning (coll)
author of change: Johan Post
date of change: 2022-11-25
comment: [is coll]
scope note: Cof TOP
type: Class
subclass of: Verzameling soorten
subclass of: Class
  one of: Grondradar
  one of: Afgeleid
  one of: Niet kunnen achterhalen
  one of: Objecttype niet kunnen achterhalen
  one of: Basisregistratie Adressen en Gebouwen (BAG)
  one of: Inmeting
  one of: Inspectie
  one of: CBS
  one of: Luchtfoto
  one of: BGT
  one of: GBKN
  one of: AHN
  one of: AHN1
  one of: AHN2
  one of: AHN3
  one of: AHN4
  one of: GNSS Landmeting
  one of: GNSS Vanuit wagen
  one of: LIDAR 3D
  one of: Plan/Ontwerp
  one of: Revisie
  one of: Sensor (inwinning)
  one of: Schatting

Technologie
author of change: Marinus Vonhof
date of change: 2021-01-09
definition: Bij activiteit: werkwijze, eisen
author at start life: Nic Roest (Idoro)
date of start life: 2008-03-11
validity context: 6d
comment: Onderscheidend kenmerk
comment: [is aspect]
scope note: Cof TOP
type: Class
subclass of: Onderscheidend kenmerk

Uitvoering
author of change: Marinus Vonhof
date of change: 2021-01-09
definition: Materiaal, afwerking, vorm
author at start life: Nic Roest (Idoro)
date of start life: 2008-03-11
validity context: 6d
comment: Onderscheidend kenmerk
comment: [is aspect]
scope note: Cof TOP
type: Class
subclass of: Onderscheidend kenmerk

Datum
author of change: Marinus Vonhof
date of change: 2025-01-16
date of change: 2017-11-16
definition: [IMBOR] Aanduiding van een bepaalde dag volgens een kalender.
author at start life: Marinus Vonhof
date of start life: 2015-02-28
units of measurements: yyyy-mm-dd
comment: [is aspect]
scope note: Cof TOP
type: Class
subclass of: Kenmerk
subclass of: Restriction
  on property: has as value
  all values from: date

Afstand
author of change: Marinus Vonhof
date of change: 2015-02-28
author at start life: Nic Roest (Idoro)
date of start life: 2006-03-03
comment: [is aspect]
scope note: Cof TOP
type: Class
subclass of: Kenmerk

Aansluiting
author of change: Marinus Vonhof
date of change: 2018-10-17
definition: Het geheel van overdrachtspunt, leiding en inlaat voor de aanvoer van afvalwater
author at start life: Marinus Vonhof
date of start life: 2015-02-28
validity context: 3d 5d 10f 11d 13d 14f 15d
scope note: Cof TOP
type: Class
subclass of: Fysiek object
subclass of: Restriction
  author of change: Marinus Vonhof
  date of change: 2019-05-15
  author at start life: Finy Teitsma (Oranjewoud)
  date of start life: 2007-11-30
  on class: Inlaat
  on property: has as part
  qualified cardinality: 1
subclass of: Restriction
  author of change: Marinus Vonhof
  date of change: 2016-04-22
  author at start life: Marinus Vonhof
  date of start life: 2014-03-15
  on class: Vrijverval rioolstelsel
  on property: has as part (inverse)
  qualified cardinality: 1
subclass of: Restriction
  author of change: Marinus Vonhof
  date of change: 2021-08-05
  author at start life: Marinus Vonhof
  date of start life: 2018-04-05
  on class: Standpijp
  on property: has as part
  min qualified cardinality: 0
subclass of: Restriction
  author at start life: Marinus Vonhof
  date of start life: 2019-05-15
  on class: Straat
  on property: has as part (inverse)
  max qualified cardinality: 1
subclass of: Restriction
  author at start life: Marinus Vonhof
  date of start life: 2022-10-02
  on class: Ontstoppingsstuk
  on property: has as part
  min qualified cardinality: 0
subclass of: Restriction
  author at start life: Marinus Vonhof
  date of start life: 2022-10-02
  on class: Verbindingsstuk
  on property: has as part
  min qualified cardinality: 0
subclass of: Restriction
  author at start life: Marinus Vonhof
  date of start life: 2024-07-16
  on class: Maaiveldoriëntatie
  on property: is connected to
  max qualified cardinality: 1
subclass of: Restriction
  on property: heeft Functie
  has value: Aanvoer van afvalwater

Maatregel
author of change: Marinus Vonhof
date of change: 2018-12-10
definition: [IRIS-RIOKEN:2012] Activiteiten die worden uitgevoerd ter verbetering van werken
author at start life: Marinus Vonhof
date of start life: 2013-03-26
validity context: 1f 3f 5d 10f 11d 12f 14f
comment: [cfk fout]
scope note: Cof TOP
type: Class
subclass of: Activiteit
subclass of: Restriction
  author of change: Marinus Vonhof
  date of change: 2018-05-01
  author at start life: Marinus Vonhof
  date of start life: 2013-03-26
  validity context: 1t 3t 12t
  on class: Datum maatregel
  on property: has as aspect
  qualified cardinality: 1

Kenmerk
author of change: Marinus Vonhof
author of change: Wouter van Riel
date of change: 2024-04-22
date of change: 2017-11-16
definition: Eigenschap van iets
definition: [Gellish] Is an individual object that is a phenomenon that is possessed by a totality and cannot exist without the existence of its possessor. It is an intrinsic, non-separable facet of its possessor @en
author at start life: Marinus Vonhof
date of start life: 2013-09-03
validity context: *f
comment: [cfk fout]
scope note: Cof TOP
type: Class

Verzameling soorten
author of change: Marinus Vonhof
date of change: 2017-11-16
author at start life: Marinus Vonhof
date of start life: 2014-07-11
comment: collection of qualitative aspects is specialisatie van collection of classes
alternative label: Collectie kenmerkwaarden
alternative label: Domeinwaarden
alternative label: Verzameling kenmerkwaarden
scope note: Cof TOP
type: Class

Activiteit
author of change: Marinus Vonhof
date of change: 2025-01-16
date of change: 2016-09-16
definition: [Gellish] Is a deed (a performance by changing a state of affairs) by carrying out an action or pattern of behavior. @en
definition: [IMBOR] Iets dat mogelijk of daadwerkelijke gebeurt in ruimte en tijd.
author at start life: Marinus Vonhof
date of start life: 2011-12-02
validity context: 1f 3f 5d 6d 10f 11d 12f 14f 15d
comment: [cfk fout]
scope note: Cof TOP
type: Class

Functie
author of change: Marinus Vonhof
date of change: 2025-01-16
date of change: 2021-01-09
definition: Wat doet het
definition: [IMBOR] Een activiteit die het externe gedrag beschrijft van het object die de activiteit uitvoert.
author at start life: Marinus Vonhof
date of start life: 2013-09-03
comment: Onderscheidend kenmerk
comment: [is aspect]
scope note: Cof TOP
type: Class
subclass of: Onderscheidend kenmerk

Doel
author of change: Marinus Vonhof
date of change: 2021-01-09
definition: Bij activiteit: wat te bereiken
author at start life: Marinus Vonhof
date of start life: 2014-04-29
validity context: 6d
comment: Onderscheidend kenmerk
comment: [is aspect]
scope note: Cof TOP
type: Class
subclass of: Onderscheidend kenmerk

Aanslagniveau
author of change: Marinus Vonhof
date of change: 2018-05-03
definition: [NEN 3300:1996] Peil waarop een pomp in werking treedt
author at start life: Nic Roest (Idoro)
date of start life: 2006-02-21
units of measurements: m
see also: [IRIS-RIOKEN:2012] Ingesteld peil in de pompkelder van rioolgemaal. Als de pompkelder tot aan het inslagpeil is gevuld, wordt een pomp gestart om de kelder weer leeg te pompen.
alternative label: Inslagpeil
comment: [is aspect]
scope note: Cof MDS
scope note: Cof HYD
scope note: Cof RGM
type: Class
subclass of: Hoogte t.o.v. NAP
subclass of: Restriction
  on property: has as value
  all values from: decimal

Hoogte t.o.v. NAP
author of change: Marinus Vonhof
author of change: Eric van Gorkom
date of change: 2015-05-29
date of change: 2024-05-13
date of change: 2024-05-20
date of change: 2024-07-12
definition: Conform coordinatenstelsel EPSG:5709
definition: Hoogte aangegeven t.o.v. NAP
author at start life: Nic Roest (Idoro)
date of start life: 2006-02-21
units of measurements: m
alternative label: Normaal Amsterdams Peil
comment: [is aspect]
scope note: Cof TOP
type: Class
subclass of: Kenmerk
subclass of: Restriction
  on property: has as value
  all values from: Z-coördinaat (datatype)

Toepassing
author of change: Marinus Vonhof
date of change: 2021-01-09
definition: Proces waarin iets gebruikt wordt, waarom
author at start life: Nic Roest (Idoro)
date of start life: 2008-03-11
validity context: 6d
comment: Onderscheidend kenmerk
comment: [is aspect]
scope note: Cof TOP
type: Class
subclass of: Onderscheidend kenmerk

Fysiek object
label: Physical object @en
author of change: Eric van Gorkom
date of change: 2021-10-01
definition: [Gellish] That is a distribution of matter or energy in time and space that satisfies the laws of physics. All kinds of physical objects are subtypes of this class. It is the top of the hierarchical network of specializations of kinds of physical objects. @en
definition: [NEN 2660] Een object dat bestaat of kan bestaan binnen de fysieke 4D ruimte-tijd. Het vormt een manifestatie en een afbakening van materie en/of energie, en is (in)direct waarneembaar door de zintuigen.
author at start life: Marinus Vonhof
date of start life: 2013-09-03
validity context: *f
comment: [cfk fout]
scope note: Cof TOP
type: Class
subclass of: Restriction
  author at start life: Marinus Vonhof
  date of start life: 2013-09-28
  validity context: 14t 15t
  on class: Begindatum
  on property: has as aspect
  max qualified cardinality: 1
subclass of: Restriction
  author at start life: Marinus Vonhof
  date of start life: 2013-09-28
  on class: Einddatum
  on property: has as aspect
  max qualified cardinality: 1
subclass of: Restriction
  on property: has as part
  all values from: Class
    union of: Ruimte
    union of: Fysiek object
disjoint with: Ruimte

Inlaat
author of change: JohanPost
date of change: 2021-10-01
definition: Een fysieke constructie met een of meerdere aftakkingen bestemd voor het aansluiten van aansluitleidingen op het riool.
definition: [NEN 3300:1996] Punt waar aanvoer van afvalwater in een rioolstelsel mogelijk is
author at start life: Marinus Vonhof
date of start life: 2019-05-15
comment: 20151014: NEN3300-definitie aangepast
alternative label: Inlaatconstructie
alternative label: Spruitstuk
scope note: Cof MDS
scope note: Cof LDR
scope note: Cof REV
scope note: Cof MTR
type: Class
subclass of: Hulpstuk
subclass of: Restriction
  author at start life: Marinus Vonhof
  date of start life: 2022-10-02
  on class: Aansluiting
  on property: has as part (inverse)
  max qualified cardinality: 1
subclass of: Restriction
  author at start life: Wouter van Riel
  date of start life: 2021-09-23
  on class: Zadel
  on property: has as part
  max qualified cardinality: 1
subclass of: Restriction
  on property: heeft Functie
  has value: Verbinden aansluitleiding met rioolput of rioolleiding

Vrijverval rioolstelsel
label: Name of sewer system @en
author of change: Marinus Vonhof
author of change: Johan Post
author of change: Eric van Gorkom
author of change: Wouter van Riel
date of change: 2026-05-01
date of change: 2024-04-22
date of change: 2026-07-17
date of change: 2024-05-13
definition: Een rioolstelsel waarbij het transport door middel van de zwaartekracht plaatsvindt
definition: [EN13508-2+A1] The name of the sewer system, or a sewer system reference as specified by the employing authority @en
definition: [NEN-EN 752:2008] systeem van aansluitleidingen of een buitenriolering waarin het afvalwater door de zwaartekracht wordt getransporteerd en waar de leiding is ontworpen om onder normale omstandigheden deels gevuld te zijn [EN 1085:2007, definitie 2260]
notation: AAP
notation: CAP
notation: GAP
notation: JAP
author at start life: Finy Teitsma (Oranjewoud)
date of start life: 2006-02-17
validity context: *f
comment: 20151014: NEN3300-definitie aangepast
alternative label: Stelsel onder vrij verval
comment: [cfk fout]
scope note: Cof TOP
type: Class
subclass of: Rioolstelsel
subclass of: Restriction
  author of change: Marinus Vonhof
  date of change: 2016-04-22
  author at start life: Marinus Vonhof
  date of start life: 2014-03-15
  comment: 20160415: Inverse = optioneel, niet elke specialisatie zit in vv stelsel
  on class: Aansluiting
  on property: has as part
  min qualified cardinality: 1
subclass of: Restriction
  author at start life: Johan Post
  date of start life: 2026-05-01
  on class: Vrijverval transportleiding
  on property: has as part
  min qualified cardinality: 0
subclass of: Restriction
  author at start life: Marinus Vonhof
  date of start life: 2023-01-13
  on class: Doorspoelput
  on property: has as part
  min qualified cardinality: 0
subclass of: Restriction
  on property: heeft Functie
  has value: Tijdelijke berging van afvalwater
subclass of: Restriction
  on property: heeft Technologie
  has value: Transport door de zwaartekracht

Standpijp
author of change: Marinus Vonhof
date of change: 2025-01-16
date of change: 2022-09-30
date of change: 2019-03-20
definition: [NEN 3300:1996] Het verticale deel van een aansluitleiding dat is geplaatst in de inlaat van een riool
author at start life: Marinus Vonhof
date of start life: 2018-03-20
see also: [NPR 3218] Een loodrecht verticaal geplaatse buis om hoogteverschil tussen aansluitleiding en riool te overbruggen
alternative label: Standleiding
scope note: Cof MDS
scope note: Cof LDR
type: Class
subclass of: Aansluitleiding
subclass of: Restriction
  author of change: Marinus Vonhof
  date of change: 2021-08-05
  author at start life: Marinus Vonhof
  date of start life: 2018-04-05
  on class: Aansluiting
  on property: has as part (inverse)
  max qualified cardinality: 1
subclass of: Restriction
  on property: heeft Functie
  has value: Overbruggen hoogteverschil
subclass of: Restriction
  on property: heeft Uitvoering
  has value: Verticaal deel aansluitend op inlaat

Straat
author of change: Marinus Vonhof
author of change: Johan Post
date of change: 2025-01-16
date of change: 2018-12-05
date of change: 2026-04-30
date of change: 2024-11-26
definition: [IMBOR] Deze wegverbinding is al dan niet een openbare weg.
author at start life: Marinus Vonhof
date of start life: 2013-03-26
comment: Ruimte Straat bevat leiding,put, op die manier koppelen aan leiding enz
alternative label: Openbare weg
scope note: Cof TOP
type: Class
subclass of: Bovengrond
subclass of: Restriction
  author of change: Marinus Vonhof
  date of change: 2015-10-31
  author at start life: Marinus Vonhof
  date of start life: 2013-03-26
  on class: Verhardingstype
  on property: has as aspect
  max qualified cardinality: 1
subclass of: Restriction
  author of change: Marinus Vonhof
  date of change: 2017-08-31
  author at start life: Marinus Vonhof
  date of start life: 2013-03-26
  on class: Straatnaam
  on property: has as aspect
  qualified cardinality: 1
subclass of: Restriction
  author of change: Marinus Vonhof
  date of change: 2018-12-05
  author at start life: Marinus Vonhof
  date of start life: 2018-09-03
  on class: Bouwwerk
  on property: has as part
  min qualified cardinality: 0
subclass of: Restriction
  author at start life: Marinus Vonhof
  date of start life: 2019-05-15
  on class: Aansluiting
  on property: has as part
  min qualified cardinality: 0

Ontstoppingsstuk
author of change: Johan Post
date of change: 2021-10-01
definition: Een hulpstuk waarin een met een deksel afsluitbare opening is aangebracht bestemd voor het ontstoppen van een leiding. / Variant: Hulpstuk bestemd voor het inspecteren van, ontstoppen van en/of het bieden van toegang tot de aangesloten leidingen
definition: [NEN 3300:1996] Hulpstuk waarin een met een deksel afsluitbare opening is aangebracht en bedoeld voor inspectie en onderhoud in geval van verstopping
definition: [NEN-EN 752:2008] niet-mantoegankelijk hulpstuk met kleine middellijn op een aansluitleiding of riool voor reiniging of inspectie
author at start life: Finy Teitsma (Oranjewoud)
date of start life: 2006-05-23
comment: 20151014: NEN3300-definitie aangepast
scope note: Cof MDS
type: Class
subclass of: Hulpstuk
subclass of: Restriction
  author at start life: Marinus Vonhof
  date of start life: 2013-09-29
  on class: Deksel
  on property: has as part
  qualified cardinality: 1
subclass of: Restriction
  author at start life: Marinus Vonhof
  date of start life: 2022-10-02
  on class: Aansluiting
  on property: has as part (inverse)
  max qualified cardinality: 1
subclass of: Restriction
  on property: heeft Doel
  has value: Ontstoppen
subclass of: Restriction
  on property: heeft Functie
  has value: Toegang geven tot aansluitleiding

Verbindingsstuk
author of change: Marinus Vonhof
author of change: Johan Post
date of change: 2018-10-17
date of change: 2024-05-02
definition: Een hulpstuk bestemd voor het verbinden van leidingen.
author at start life: Marinus Vonhof
author at start life: Finy Teitsma (Oranjewoud)
date of start life: 2006-11-29
scope note: Cof MDS
scope note: Cof LDR
scope note: Cof REV
scope note: Cof PLI
scope note: Cof HYD
type: Class
subclass of: Hulpstuk
subclass of: Restriction
  author at start life: Marinus Vonhof
  date of start life: 2022-10-02
  on class: Transportleiding
  on property: has as part (inverse)
  max qualified cardinality: 1
subclass of: Restriction
  on property: heeft Functie
  has value: Verbinden van leidingen
subclass of: Restriction
  on class: Aansluiting
  on property: has as part (inverse)
  max qualified cardinality: 1

Maaiveldoriëntatie
author of change: Marinus Vonhof
date of change: 2018-12-05
definition: Een topologisch element dat het punt (vertex) op het maaiveld beschrijft
author at start life: Marinus Vonhof
date of start life: 2012-04-22
scope note: Cof TOP
type: Class
subclass of: Vertex
subclass of: Restriction
  author of change: Marinus Vonhof
  date of change: 2017-08-21
  author at start life: Marinus Vonhof
  date of start life: 2017-08-19
  on class: Bouwwerkoriëntatie
  on property: is connected to
  max qualified cardinality: 1
subclass of: Restriction
  author of change: Marinus Vonhof
  date of change: 2017-12-12
  author at start life: Marinus Vonhof
  date of start life: 2015-11-07
  validity context: 5t 11t
  on class: Putoriëntatie
  on property: is connected to
  max qualified cardinality: 1
subclass of: Restriction
  author of change: Marinus Vonhof
  date of change: 2018-12-12
  author at start life: Marinus Vonhof
  date of start life: 2012-04-22
  comment: Temporeel kenmerk, met kenmerk Inwinning
  on class: Maaiveldhoogte
  on property: has as aspect
  min qualified cardinality: 1
subclass of: Restriction
  author of change: Marinus Vonhof
  date of change: 2020-04-18
  author at start life: Marinus Vonhof
  date of start life: 2018-12-12
  comment: Temporeel kenmerk, met kenmerk Inwinning
  on class: Punt
  on property: has as aspect
  max qualified cardinality: 1
subclass of: Restriction
  author at start life: Marinus Vonhof
  date of start life: 2017-05-30
  on class: Hulpstukoriëntatie
  on property: is connected to
  max qualified cardinality: 1

Kolk
author of change: Marinus Vonhof
date of change: 2019-04-04
definition: Een reservoir bestemd voor de opvang van hemelwater afkomstig van erop aangesloten oppervlakken, het laten bezinken van in dit water meegevoerde bezinkbare stoffen en de afvoer van dit water naar een rioolstelsel of naar de ondergrond
definition: [NEN 3300:1996] ingegraven bak voor de opvang van neerslag afkomstig van erop aangesloten oppervlakken, voor het laten bezinken van in dit water meegevoerde bezinkbare stoffen en voor de afvoer van dit water naar de riolering
notation: EAA
author at start life: Nic Roest (Idoro)
date of start life: 2006-03-23
validity context: 5d 11d 13d 15d
see also: Vervallen link: https://imgeo.geostandaarden.nl/def/imgeo-object/put/kolk-niet-bgt
see also: [IMGeo:1.0/2007] Open hemelwater afvoer, aangesloten op het transportnet van hemelwater.
alternative label: Afvoerput
scope note: Cof TOP
type: Class
subclass of: Put
subclass of: Restriction
  author of change: Marinus Vonhof
  date of change: 2013-10-18
  author at start life: Marinus Vonhof
  date of start life: 2013-07-19
  on class: Reinigen en inspecteren kolk
  on property: has as output (inverse)
  qualified cardinality: 1
subclass of: Restriction
  author of change: Marinus Vonhof
  date of change: 2019-04-04
  author at start life: Marinus Vonhof
  date of start life: 2014-04-29
  on class: Reinigen en inspecteren kolk
  on property: has as input (inverse)
  qualified cardinality: 1
subclass of: Restriction
  author of change: Marinus Vonhof
  date of change: 2021-08-06
  author at start life: Marinus Vonhof
  date of start life: 2020-04-18
  on class: Deksel
  on property: has as part
  qualified cardinality: 1
subclass of: Restriction
  author at start life: Marinus Vonhof
  date of start life: 2026-07-24
  on class: Infiltratievoorziening
  on property: has as part (inverse)
  max qualified cardinality: 1
subclass of: Restriction
  on property: heeft Functie
  has value: Bezinken stoffen
subclass of: Restriction
  on property: heeft Functie
  has value: Opvang van afstromend hemelwater

Spuikolk
definition: Een bovengrondse uitstroomvoorziening die hemelwater vanuit een ondergrondse leiding aan het maaiveld aanbiedt.
notation: EAA
author at start life: Johan Post
date of start life: 2026-05-04
alternative label: Hemelwaterbrievenbus
scope note: Cof TOP
type: Class
subclass of: Put
subclass of: Restriction
  author of change: Marinus Vonhof
  date of change: 2021-08-06
  author at start life: Finy Teitsma (Oranjewoud)
  date of start life: 2007-11-30
  on class: Perceelaansluiting
  on property: has as part (inverse)
  qualified cardinality: 1
subclass of: Restriction
  author of change: Marinus Vonhof
  date of change: 2021-08-06
  author at start life: Marinus Vonhof
  date of start life: 2020-04-18
  on class: Deksel
  on property: has as part
  max qualified cardinality: 1
subclass of: Restriction
  on property: heeft Functie
  has value: Afvoeren hemelwater naar de bovengrond

Aansluitleiding
label: Drain (EN) @en
author of change: Marinus Vonhof
date of change: 2019-03-20
definition: Een leiding voor de aanvoer van afvalwater.
definition: [EN 16323:2014] pipeline, usually underground, designed to carry wastewater from a source to a sewer @en
definition: [NEN 3300:1996] Leiding tussen een gebouw of een kolk en een knooppunt of leiding
definition: [NEN-EN 752:2008] gewoonlijk ondergrondse leiding die afvalwater van een gebouw of een kolk naar een riool voert [EN 1085:2007, definitie 2250]
author at start life: Finy Teitsma (Oranjewoud)
date of start life: 2006-02-20
validity context: 5d 11d 13d 14f 15d
comment: 20151014: NEN3300-definitie aangepast
scope note: Cof TOP
type: Class
subclass of: Leiding
subclass of: Restriction
  on property: heeft Functie
  has value: Aanvoer van afvalwater

Leiding
author of change: Johan Post
author of change: Eric van Gorkom
author of change: Wouter van Riel
date of change: 2024-05-01
date of change: 2026-05-01
date of change: 2021-11-23
date of change: 2024-04-23
date of change: 2026-05-13
date of change: 2026-04-30
definition: Een geheel van geleiders welke voorzien zijn van 1 ommanteling en bestemd is voor transport van materie
author at start life: Finy Teitsma (Oranjewoud)
date of start life: 2006-02-24
validity context: *f
see also: [IMKL:1.1/2008] Holle leiding voor het doorstromen van gassen, vloeistoffen of capsules, bestemd om hetzij gas, een vloeistof of capsules te transporteren, hetzij een vloeistof als intermediair te gebruiken voor het transport van warmte of een opgeloste of verpulverde stof.
see also: [NEN 3610:2010] (Ongeldig) Buis of kabel bestemd voor de voortgeleiding van energie of materie.
alternative label: Buis
alternative label: Pijp
comment: [cfk fout]
scope note: Cof TOP
type: Class
subclass of: Fysiek object
subclass of: Restriction
  author of change: Marinus Vonhof
  author of change: Johan Post
  date of change: 2018-12-05
  date of change: 2026-04-30
  author at start life: Marinus Vonhof
  date of start life: 2018-09-03
  on class: Bovengrond
  on property: has as part (inverse)
  max qualified cardinality: 1
subclass of: Restriction
  author of change: Marinus Vonhof
  date of change: 2015-06-01
  author at start life: Finy Teitsma (Oranjewoud)
  date of start life: 2006-02-25
  validity context: *t
  on class: Materiaal leiding
  on property: has as aspect
  qualified cardinality: 1
subclass of: Restriction
  author of change: Marinus Vonhof
  date of change: 2015-08-24
  author at start life: Finy Teitsma (Oranjewoud)
  date of start life: 2006-02-25
  validity context: *t
  on class: Lengte leiding
  on property: has as aspect
  qualified cardinality: 1
subclass of: Restriction
  author of change: Marinus Vonhof
  date of change: 2015-10-31
  author at start life: Finy Teitsma (Oranjewoud)
  date of start life: 2006-02-25
  validity context: *t
  on class: Vorm leiding
  on property: has as aspect
  qualified cardinality: 1
subclass of: Restriction
  author of change: Marinus Vonhof
  date of change: 2018-12-05
  author at start life: Finy Teitsma (Oranjewoud)
  date of start life: 2006-02-25
  on class: Verbindingstype
  on property: has as aspect
  max qualified cardinality: 1
subclass of: Restriction
  author of change: Marinus Vonhof
  date of change: 2019-09-02
  author at start life: Finy Teitsma (Oranjewoud)
  date of start life: 2006-02-25
  on class: Wanddikte
  on property: has as aspect
  max qualified cardinality: 1
subclass of: Restriction
  author of change: Marinus Vonhof
  date of change: 2014-12-03
  author at start life: Marinus Vonhof
  date of start life: 2011-12-15
  validity context: *t
  on class: Hoogte leiding
  on property: has as aspect
  qualified cardinality: 1
subclass of: Restriction
  author of change: Marinus Vonhof
  date of change: 2015-05-29
  author at start life: Marinus Vonhof
  date of start life: 2011-12-15
  validity context: *t
  on class: Breedte leiding
  on property: has as aspect
  qualified cardinality: 1
subclass of: Restriction
  author of change: Marinus Vonhof
  date of change: 2015-09-20
  author at start life: Marinus Vonhof
  date of start life: 2013-10-01
  on class: Diameter leiding
  on property: has as aspect
  max qualified cardinality: 1
subclass of: Restriction
  author at start life: Finy Teitsma (Oranjewoud)
  date of start life: 2006-02-25
  on property: has as aspect
  some values from: Lengte leiding
subclass of: Restriction
  author at start life: Finy Teitsma (Oranjewoud)
  date of start life: 2006-02-25
  on property: has as aspect
  some values from: Materiaal leiding
subclass of: Restriction
  author at start life: Finy Teitsma (Oranjewoud)
  date of start life: 2006-02-25
  on property: has as aspect
  some values from: Vorm leiding
subclass of: Restriction
  author at start life: Johan Post
  date of start life: 2026-05-13
  on class: Inwinning
  on property: has as aspect
  max qualified cardinality: 1
subclass of: Restriction
  author at start life: Marinus Vonhof
  date of start life: 2011-12-15
  on property: has as aspect
  some values from: Breedte leiding
subclass of: Restriction
  author at start life: Marinus Vonhof
  date of start life: 2011-12-15
  on property: has as aspect
  some values from: Hoogte leiding
subclass of: Restriction
  author at start life: Marinus Vonhof
  date of start life: 2012-04-22
  validity context: *t
  on class: Leidingoriëntatie
  on property: has as aspect
  qualified cardinality: 1
subclass of: Restriction
  author at start life: Marinus Vonhof
  date of start life: 2013-10-01
  on property: has as aspect
  some values from: Diameter leiding
subclass of: Restriction
  author at start life: Marinus Vonhof
  date of start life: 2018-12-05
  on class: Voegmateriaal
  on property: has as aspect
  max qualified cardinality: 1
subclass of: Restriction
  author at start life: Marinus Vonhof
  date of start life: 2020-04-17
  on class: WIBON thema
  on property: has as aspect
  max qualified cardinality: 1
subclass of: Restriction
  on property: heeft Functie
  has value: Voortgeleiding van materie

Aansluitpunt
definition: Een topologisch element (knooppunt) met de aansluitlocatie tussen leidingen, putten en open water. Een aansluitpunt kan ook de koppeling vormen tussen een leiding en een hydraulisch element (zoals een klep), het is dan het knooppunt tussen twee verbindingen.
author at start life: Marinus Vonhof
date of start life: 2017-12-12
scope note: Cof TOP
type: Class
subclass of: Knooppunt
subclass of: Restriction
  on property: heeft Functie
  has value: Aanvoer van afvalwater

Knooppunt
label: Node @en
author of change: Marinus Vonhof
author of change: Wouter van Riel
date of change: 2024-04-22
date of change: 2022-10-01
date of change: 2020-11-24
definition: De knoop binnen de netwerkdefinitie, waar verbindingen bij elkaar komen
definition: [NEN 3300:1996] Begin- of eindpunt van 1 of meer leidingen, meestal gevormd door een fysieke constructie
author at start life: Marinus Vonhof
date of start life: 2013-09-03
see also: [GFO/RIO2] Begin- of eindpunt van 1 of meer leidingen, meestal gevormd door een fysieke constructie
alternative label: Knoop
scope note: Cof TOP
type: Class
subclass of: Vertex
subclass of: Restriction
  author of change: Marinus Vonhof
  date of change: 2022-10-01
  author at start life: Marinus Vonhof
  date of start life: 2011-12-02
  on class: Beginpunt leiding
  on property: is connected to
  min qualified cardinality: 0
subclass of: Restriction
  author of change: Marinus Vonhof
  date of change: 2022-10-01
  author at start life: Marinus Vonhof
  date of start life: 2011-12-02
  on class: Eindpunt leiding
  on property: is connected to
  min qualified cardinality: 0
subclass of: Restriction
  author of change: Marinus Vonhof
  date of change: 2022-10-01
  author at start life: Marinus Vonhof
  date of start life: 2017-12-12
  on class: Beginpunt onderdeel
  on property: is connected to
  min qualified cardinality: 0
subclass of: Restriction
  author of change: Marinus Vonhof
  date of change: 2022-10-01
  author at start life: Marinus Vonhof
  date of start life: 2017-12-12
  on class: Eindpunt onderdeel
  on property: is connected to
  min qualified cardinality: 0
subclass of: Restriction
  author at start life: Wouter van Riel
  date of start life: 2022-05-04
  on class: Punt
  on property: has as aspect
  max qualified cardinality: 1

Put
author of change: Johan Post
author of change: Eric van Gorkom
date of change: 2022-09-27
date of change: 2024-05-01
date of change: 2026-05-01
date of change: 2024-05-13
date of change: 2026-04-30
date of change: 20262-05-13
author at start life: Marinus Vonhof
date of start life: 2013-07-18
validity context: *f
see also: Vervallen link: https://imgeo.geostandaarden.nl/def/imgeo-object/put
see also: [IMGeo:1.0/2007] Gegraven of geboorde kokervormige diepte waarin zich (vloei)stoffen bevinden.
comment: [cfk fout]
scope note: Cof TOP
type: Class
subclass of: Fysiek object
subclass of: Restriction
  author of change: Johan Post
  date of change: 2018-12-05
  date of change: 2026-04-30
  author at start life: Marinus Vonhof
  date of start life: 2018-09-03
  on class: Bovengrond
  on property: has as part (inverse)
  max qualified cardinality: 1
subclass of: Restriction
  author of change: Marinus Vonhof
  date of change: 2014-08-01
  author at start life: Finy Teitsma (Oranjewoud)
  date of start life: 2006-02-25
  validity context: *t
  on class: Breedte put
  on property: has as aspect
  qualified cardinality: 1
subclass of: Restriction
  author of change: Marinus Vonhof
  date of change: 2014-08-01
  author at start life: Finy Teitsma (Oranjewoud)
  date of start life: 2006-02-25
  validity context: *t
  on class: Hoogte put
  on property: has as aspect
  qualified cardinality: 1
subclass of: Restriction
  author of change: Marinus Vonhof
  date of change: 2014-08-01
  author at start life: Finy Teitsma (Oranjewoud)
  date of start life: 2006-02-25
  validity context: *t
  on class: Lengte put
  on property: has as aspect
  qualified cardinality: 1
subclass of: Restriction
  author of change: Marinus Vonhof
  date of change: 2015-06-01
  author at start life: Finy Teitsma (Oranjewoud)
  date of start life: 2007-10-24
  validity context: 5t 10t 12t 14t
  on class: Materiaal put
  on property: has as aspect
  max qualified cardinality: 1
subclass of: Restriction
  author of change: Marinus Vonhof
  date of change: 2021-08-06
  author at start life: Finy Teitsma (Oranjewoud)
  date of start life: 2006-02-25
  validity context: *t
  on class: Vorm put
  on property: has as aspect
  qualified cardinality: 1
subclass of: Restriction
  author of change: Marinus Vonhof
  date of change: 2015-08-24
  author at start life: Marinus Vonhof
  date of start life: 2013-10-01
  on class: Diameter put
  on property: has as aspect
  max qualified cardinality: 1
subclass of: Restriction
  author at start life: Finy Teitsma (Oranjewoud)
  date of start life: 2006-02-25
  on property: has as aspect
  some values from: Breedte put
subclass of: Restriction
  author at start life: Finy Teitsma (Oranjewoud)
  date of start life: 2006-02-25
  on property: has as aspect
  some values from: Hoogte put
subclass of: Restriction
  author at start life: Finy Teitsma (Oranjewoud)
  date of start life: 2006-02-25
  on property: has as aspect
  some values from: Lengte put
subclass of: Restriction
  author at start life: Finy Teitsma (Oranjewoud)
  date of start life: 2006-02-25
  on property: has as aspect
  some values from: Vorm put
subclass of: Restriction
  author at start life: Finy Teitsma (Oranjewoud)
  date of start life: 2007-10-24
  on property: has as aspect
  some values from: Materiaal put
subclass of: Restriction
  author at start life: Johan Post
  date of start life: 2026-05-13
  on class: Inwinning
  on property: has as aspect
  max qualified cardinality: 1
subclass of: Restriction
  author at start life: Marinus Vonhof
  date of start life: 2012-04-22
  validity context: *t
  on class: Putoriëntatie
  on property: has as aspect
  qualified cardinality: 1
subclass of: Restriction
  author at start life: Marinus Vonhof
  date of start life: 2013-10-01
  on property: has as aspect
  some values from: Diameter put
subclass of: Restriction
  author at start life: Marinus Vonhof
  date of start life: 2015-10-21
  on class: Wanddikte
  on property: has as aspect
  max qualified cardinality: 1
subclass of: Restriction
  author at start life: Marinus Vonhof
  date of start life: 2020-04-17
  on class: WIBON thema
  on property: has as aspect
  max qualified cardinality: 1
subclass of: Restriction
  author at start life: Marinus Vonhof
  date of start life: 2020-05-28
  on class: Adresgegevens
  on property: has as aspect
  max qualified cardinality: 1
subclass of: Restriction
  on property: heeft Uitvoering
  has value: Gegraven of geboorde kokervormige diepte

Inwinning
author of change: Johan Post
date of change: 2022-11-25
date of change: 2024-05-02
definition: Informatie over het verzamelen van gegevens
author at start life: Marinus Vonhof
date of start life: 2015-10-29
comment: Kenmerken van kenmerk
alternative label: Inwinning-informatie
comment: [is aspect]
scope note: Cof TOP
type: Class
subclass of: Kenmerk
subclass of: Restriction
  author of change: Marinus Vonhof
  date of change: 2015-11-03
  author at start life: Marinus Vonhof
  date of start life: 2013-03-29
  on class: Lengte leiding
  on property: has as aspect (inverse)
  max qualified cardinality: 1
subclass of: Restriction
  author of change: Marinus Vonhof
  date of change: 2017-05-17
  author at start life: Marinus Vonhof
  date of start life: 2015-10-29
  on class: B.o.b. beginpunt leiding
  on property: has as aspect (inverse)
  max qualified cardinality: 1
subclass of: Restriction
  author of change: Marinus Vonhof
  date of change: 2017-05-17
  author at start life: Marinus Vonhof
  date of start life: 2015-10-30
  on class: Putdekselniveau
  on property: has as aspect (inverse)
  max qualified cardinality: 1
subclass of: Restriction
  author of change: Marinus Vonhof
  date of change: 2017-05-17
  author at start life: Marinus Vonhof
  date of start life: 2015-10-30
  on class: Vorm put
  on property: has as aspect (inverse)
  max qualified cardinality: 1
subclass of: Restriction
  author of change: Marinus Vonhof
  date of change: 2019-04-25
  author at start life: Marinus Vonhof
  date of start life: 2015-10-29
  on class: Datum inwinning
  on property: has as aspect
  max qualified cardinality: 1
subclass of: Restriction
  author of change: Marinus Vonhof
  date of change: 2019-04-25
  author at start life: Marinus Vonhof
  date of start life: 2015-10-29
  on class: Wijze van inwinning
  on property: has as aspect
  max qualified cardinality: 1
subclass of: Restriction
  author of change: Marinus Vonhof
  date of change: 2019-04-25
  author at start life: Marinus Vonhof
  date of start life: 2015-11-03
  on class: Capaciteit
  on property: has as aspect (inverse)
  max qualified cardinality: 1
subclass of: Restriction
  author at start life: Marinus Vonhof
  date of start life: 2015-10-29
  on class: B.o.b. eindpunt leiding
  on property: has as aspect (inverse)
  max qualified cardinality: 1
subclass of: Restriction
  author at start life: Marinus Vonhof
  date of start life: 2015-10-30
  on class: Drempelniveau
  on property: has as aspect (inverse)
  max qualified cardinality: 1
subclass of: Restriction
  author at start life: Marinus Vonhof
  date of start life: 2015-10-30
  on class: Vorm leiding
  on property: has as aspect (inverse)
  max qualified cardinality: 1
subclass of: Restriction
  author at start life: Marinus Vonhof
  date of start life: 2015-11-07
  on class: Maaiveldhoogte
  on property: has as aspect (inverse)
  max qualified cardinality: 1
subclass of: Restriction
  author at start life: Marinus Vonhof
  date of start life: 2016-11-09
  on class: Geometrie
  on property: has as aspect (inverse)
  max qualified cardinality: 1
subclass of: Restriction
  author at start life: Marinus Vonhof
  date of start life: 2018-12-06
  on class: Waterpeil
  on property: has as aspect (inverse)
  max qualified cardinality: 1
subclass of: Restriction
  author at start life: Marinus Vonhof
  date of start life: 2024-05-16
  on class: Breedte leiding
  on property: has as aspect (inverse)
  max qualified cardinality: 1
subclass of: Restriction
  author at start life: Marinus Vonhof
  date of start life: 2024-05-16
  on class: Diameter leiding
  on property: has as aspect (inverse)
  max qualified cardinality: 1
subclass of: Restriction
  author at start life: Marinus Vonhof
  date of start life: 2024-05-16
  on class: Drempelbreedte
  on property: has as aspect (inverse)
  max qualified cardinality: 1
subclass of: Restriction
  author at start life: Marinus Vonhof
  date of start life: 2024-05-16
  on class: Hoogte leiding
  on property: has as aspect (inverse)
  max qualified cardinality: 1
subclass of: Restriction
  author at start life: Marinus Vonhof
  date of start life: 2026-07-26
  on class: Bergend oppervlak
  on property: has as aspect (inverse)
  max qualified cardinality: 1
subclass of: Restriction
  author at start life: Marinus Vonhof
  date of start life: 2026-07-26
  on class: Bergend vermogen
  on property: has as aspect (inverse)
  max qualified cardinality: 1
subclass of: Restriction
  author at start life: Marinus Vonhof
  date of start life: 2026-07-26
  on class: Doorlaatbaarheid
  on property: has as aspect (inverse)
  max qualified cardinality: 1
subclass of: Restriction
  author at start life: Marinus Vonhof
  date of start life: 2026-07-26
  on class: Porositeit
  on property: has as aspect (inverse)
  max qualified cardinality: 1
subclass of: Restriction
  on class: Aantal woningen
  on property: has as aspect (inverse)
  max qualified cardinality: 1
subclass of: Restriction
  on class: Leiding
  on property: has as aspect (inverse)
  max qualified cardinality: 1
subclass of: Restriction
  on class: Materiaal leiding
  on property: has as aspect (inverse)
  max qualified cardinality: 1
subclass of: Restriction
  on class: Put
  on property: has as aspect (inverse)
  max qualified cardinality: 1

Aantal woningen
author of change: Marinus Vonhof
date of change: 2021-05-10
definition: Het aantal aangesloten wooneenheden
author at start life: Marinus Vonhof
date of start life: 2011-12-15
units of measurements: pcs
validity context: 15d
comment: [is aspect]
scope note: Cof MDS
scope note: Cof HYD
type: Class
subclass of: Kenmerk
subclass of: Restriction
  author of change: Johan Post
  date of change: 2022-11-25
  on class: Inwinning
  on property: has as aspect
  max qualified cardinality: 1
subclass of: Restriction
  author of change: Marinus Vonhof
  date of change: 2016-04-24
  author at start life: Marinus Vonhof
  date of start life: 2015-03-01
  on class: Hemelwaterriool
  on property: has as aspect (inverse)
  max qualified cardinality: 1
subclass of: Restriction
  author of change: Marinus Vonhof
  date of change: 2016-04-24
  author at start life: Marinus Vonhof
  date of start life: 2015-03-01
  on class: Vuilwaterriool
  on property: has as aspect (inverse)
  max qualified cardinality: 1
subclass of: Restriction
  author of change: Marinus Vonhof
  date of change: 2018-05-03
  author at start life: Marinus Vonhof
  date of start life: 2011-12-15
  on class: Rioolput
  on property: has as aspect (inverse)
  max qualified cardinality: 1
subclass of: Restriction
  author of change: Marinus Vonhof
  date of change: 2021-03-10
  author at start life: Marinus Vonhof
  date of start life: 2011-12-15
  on class: Gemengd riool
  on property: has as aspect (inverse)
  max qualified cardinality: 1
subclass of: Restriction
  on property: has as value
  all values from: Aantal woningen (datatype)

Hemelwaterriool
author of change: Johan Post
date of change: 2026-05-18
definition: [NEN 3300:1996] (Regenwaterriool) Riool alleen bestemd voor de inzameling en het transport van neerslag
author at start life: Marinus Vonhof
date of start life: 2012-04-29
alternative label: Regenwaterriool
alternative label: Rwa-riool
scope note: Cof MDS
scope note: Cof REV
scope note: Cof HYD
type: Class
subclass of: Vrijverval rioolleiding
subclass of: Restriction
  author of change: Marinus Vonhof
  date of change: 2014-04-30
  author at start life: Finy Teitsma (Oranjewoud)
  date of start life: 2007-10-24
  on class: Hemelwaterstelsel
  on property: has as part (inverse)
  max qualified cardinality: 1
subclass of: Restriction
  author of change: Marinus Vonhof
  date of change: 2016-04-24
  author at start life: Marinus Vonhof
  date of start life: 2015-03-01
  on class: Aantal woningen
  on property: has as aspect
  max qualified cardinality: 1
subclass of: Restriction
  author at start life: Marinus Vonhof
  date of start life: 2020-05-26
  on class: Gemengd rioolstelsel
  on property: has as part (inverse)
  max qualified cardinality: 1
subclass of: Restriction
  author at start life: Marinus Vonhof
  date of start life: 2026-07-24
  on class: Infiltratievoorziening
  on property: has as part (inverse)
  max qualified cardinality: 1
subclass of: Restriction
  author at start life: Marinus Vonhof
  date of start life: 2026-08-04
  on class: Vuilwaterstelsel
  on property: has as part (inverse)
  max qualified cardinality: 1
subclass of: Restriction
  on property: heeft Functie
  has value: Inzameling van hemelwater
subclass of: Restriction
  on property: heeft Functie
  has value: Transport van hemelwater

Vuilwaterriool
author of change: Marinus Vonhof
date of change: 2021-08-05
definition: [NEN 3300:1996] Dwa-riool is synoniem van vuilwaterriool
definition: [NEN 3300:1996] riool alleen bestemd voor de inzameling en het transport van huishoudelijk- en bedrijfsafvalwater, niet zijnde neerslag
author at start life: Marinus Vonhof
date of start life: 2012-04-29
alternative label: Dwa-riool
scope note: Cof MDS
scope note: Cof REV
scope note: Cof HYD
type: Class
subclass of: Vrijverval rioolleiding
subclass of: Restriction
  author of change: Marinus Vonhof
  date of change: 2016-04-24
  author at start life: Marinus Vonhof
  date of start life: 2015-03-01
  on class: Aantal woningen
  on property: has as aspect
  max qualified cardinality: 1
subclass of: Restriction
  author at start life: Marinus Vonhof
  date of start life: 2020-05-26
  on class: Gemengd rioolstelsel
  on property: has as part (inverse)
  max qualified cardinality: 1
subclass of: Restriction
  author at start life: Marinus Vonhof
  date of start life: 2020-05-26
  on class: Vuilwaterstelsel
  on property: has as part (inverse)
  max qualified cardinality: 1
subclass of: Restriction
  on property: heeft Functie
  has value: Inzameling van vuilwater
subclass of: Restriction
  on property: heeft Functie
  has value: Transport van vuilwater

Rioolput
author of change: Marinus Vonhof
author of change: Johan Post
author of change: Wouter van Riel
date of change: 2016-08-26
date of change: 2026-05-01
date of change: 2022-12-19
date of change: 2024-04-22
definition: Een put met een verwijderbare deksel, dat toegang geeft tot de aangesloten rioolleidingen
definition: [EN13508-2+A1] The node reference of the manhole or inspection chamber as specified by the employing authority. @en
definition: [NEN 3300:1996] constructie toegang gevend tot het rioolstelsel
notation: CAA
notation: JAA
author at start life: Marinus Vonhof
date of start life: 2013-03-31
validity context: *f
alternative label: Node reference @en
comment: [cfk fout]
scope note: Cof MLD
scope note: Cof TOP
type: Class
subclass of: Put
subclass of: Restriction
  author of change: Marinus Vonhof
  date of change: 2015-08-26
  author at start life: Marinus Vonhof
  date of start life: 2013-07-19
  validity context: *t
  comment: Relatie (kardinaliteit) uitgeschakeld voor CFK's (SHACL-syntax) (20260403) (20260824)
  on class: Visueel inspecteren rioolput
  on property: has as output (inverse)
  max qualified cardinality: 1
subclass of: Restriction
  author of change: Marinus Vonhof
  date of change: 2017-03-06
  author at start life: Marinus Vonhof
  date of start life: 2014-04-29
  validity context: *t
  on class: Vrijverval rioolleiding
  on property: is connected to
  min qualified cardinality: 0
subclass of: Restriction
  author of change: Marinus Vonhof
  date of change: 2018-05-03
  author at start life: Marinus Vonhof
  date of start life: 2011-12-15
  validity context: 5t 11t 14t
  on class: Bergend oppervlak
  on property: has as aspect
  max qualified cardinality: 1
subclass of: Restriction
  author of change: Marinus Vonhof
  date of change: 2018-05-03
  author at start life: Marinus Vonhof
  date of start life: 2011-12-15
  on class: Aantal woningen
  on property: has as aspect
  max qualified cardinality: 1
subclass of: Restriction
  author of change: Marinus Vonhof
  date of change: 2019-04-04
  author at start life: Marinus Vonhof
  date of start life: 2014-08-29
  on class: Visueel inspecteren rioolput
  on property: has as input (inverse)
  qualified cardinality: 1
subclass of: Restriction
  author of change: Marinus Vonhof
  date of change: 2019-04-04
  author at start life: Marinus Vonhof
  date of start life: 2014-12-23
  on class: Reinigen rioolput
  on property: has as input (inverse)
  qualified cardinality: 1
subclass of: Restriction
  author of change: Marinus Vonhof
  date of change: 2020-04-17
  author at start life: Marinus Vonhof
  date of start life: 2013-02-05
  on class: Rioolafsluiter
  on property: has as part
  min qualified cardinality: 0
subclass of: Restriction
  author of change: Wouter van Riel
  date of change: 2024-04-22
  author at start life: Marinus Vonhof
  date of start life: 2011-12-02
  on class: Putdeksel
  on property: has as part
  min qualified cardinality: 0
subclass of: Restriction
  author at start life: Johan Post
  date of start life: 2026-05-01
  on class: Lining
  on property: has as part
  max qualified cardinality: 1
subclass of: Restriction
  author at start life: Marinus Vonhof
  date of start life: 2014-12-23
  validity context: *t
  comment: Relatie (kardinaliteit) uitgeschakeld voor CFK's (SHACL-syntax) (20260403) (20260824)
  on class: Reinigen rioolput
  on property: has as output (inverse)
  max qualified cardinality: 1
subclass of: Restriction
  on property: heeft Functie
  has value: Leidingen aansluiten
subclass of: Restriction
  on property: heeft Functie
  has value: Rioolleidingen aansluiten
subclass of: Restriction
  on property: heeft Uitvoering
  has value: Verticale waterdichte constructie

Gemengd riool
author of change: Marinus Vonhof
date of change: 2019-03-20
definition: Vrijverval rioolleiding ontworpen om zowel verontreinigd afvalwater als afgestroomd hemelwater binnen een stelsel te transporteren
author at start life: Marinus Vonhof
date of start life: 2013-10-02
scope note: Cof MDS
scope note: Cof REV
scope note: Cof HYD
type: Class
subclass of: Vrijverval rioolleiding
subclass of: Restriction
  author of change: Marinus Vonhof
  date of change: 2021-03-10
  author at start life: Marinus Vonhof
  date of start life: 2011-12-15
  on class: Aantal woningen
  on property: has as aspect
  max qualified cardinality: 1
subclass of: Restriction
  author at start life: Marinus Vonhof
  date of start life: 2020-05-26
  validity context: *t
  on class: Gemengd rioolstelsel
  on property: has as part (inverse)
  max qualified cardinality: 1
subclass of: Restriction
  author at start life: Marinus Vonhof
  date of start life: 2026-08-04
  on class: Vuilwaterstelsel
  on property: has as part (inverse)
  max qualified cardinality: 1
subclass of: Restriction
  on property: heeft Functie
  has value: Inzameling van hemelwater
subclass of: Restriction
  on property: heeft Functie
  has value: Inzameling van vuilwater
subclass of: Restriction
  on property: heeft Functie
  has value: Transport van hemelwater
subclass of: Restriction
  on property: heeft Functie
  has value: Transport van vuilwater

Absoluut rioolstelsel
author of change: Johan Post
date of change: 2021-10-01
definition: [NEN 3300:1996] een gemengd rioolstelsel zonder overstort, eventueel voorzien van een nooduitlaat
author at start life: Marinus Vonhof
date of start life: 2012-04-29
scope note: Cof MDS
scope note: Cof REV
scope note: Cof HYD
scope note: Cof DMO
type: Class
subclass of: Gemengd rioolstelsel
subclass of: Restriction
  on property: heeft Doel
  has value: Verminderen vuilbelasting van oppervlaktewater

Gemengd rioolstelsel
author of change: Marinus Vonhof
author of change: Johan Post
author of change: Eric van Gorkom
date of change: 2024-05-16
date of change: 2021-10-01
date of change: 2024-05-13
definition: Een vrijverval rioolstelsel bestemd voor de inzameling, het transport en de tijdelijke berging van afvalwater.
definition: [NEN 3300:1996] Rioolstelsel, waarbij afvalwater door 1 leidingstelsel wordt getransporteerd
definition: [NEN-EN 752:2008] riolering ontworpen om zowel verontreinigd afvalwater als afgestroomd hemelwater in 1 leidingstelsel te transporteren [EN 1085:2007, definitie 2110]
author at start life: Finy Teitsma (Oranjewoud)
date of start life: 2007-10-23
comment: 20151014: NEN3300-definitie aangepast
alternative label: GWA stelsel
alternative label: Gemengd stelsel
scope note: Cof TOP
type: Class
subclass of: Vrijverval rioolstelsel
subclass of: Restriction
  author of change: Marinus Vonhof
  date of change: 2016-04-22
  author at start life: Finy Teitsma (Oranjewoud)
  date of start life: 2007-10-24
  validity context: 5t 11t
  on class: Lozingspunt
  on property: has as part
  min qualified cardinality: 1
subclass of: Restriction
  author of change: Marinus Vonhof
  date of change: 2016-04-24
  author at start life: Finy Teitsma (Oranjewoud)
  date of start life: 2007-10-23
  on class: Bezinkbassin
  on property: has as part
  min qualified cardinality: 0
subclass of: Restriction
  author of change: Marinus Vonhof
  date of change: 2016-04-24
  author at start life: Marinus Vonhof
  date of start life: 2013-10-01
  on class: Bergbezinkbassin
  on property: has as part
  min qualified cardinality: 0
subclass of: Restriction
  author of change: Marinus Vonhof
  date of change: 2016-04-24
  author at start life: Marinus Vonhof
  date of start life: 2014-04-30
  on class: Bergingsbassin
  on property: has as part
  min qualified cardinality: 0
subclass of: Restriction
  author of change: Marinus Vonhof
  date of change: 2016-04-24
  author at start life: Marinus Vonhof
  date of start life: 2016-04-22
  on class: Bergingsvijver
  on property: has as part
  min qualified cardinality: 0
subclass of: Restriction
  author at start life: Marinus Vonhof
  date of start life: 2020-05-26
  validity context: *t
  on class: Gemengd riool
  on property: has as part
  min qualified cardinality: 0
subclass of: Restriction
  author at start life: Marinus Vonhof
  date of start life: 2020-05-26
  on class: Hemelwaterriool
  on property: has as part
  min qualified cardinality: 0
subclass of: Restriction
  author at start life: Marinus Vonhof
  date of start life: 2020-05-26
  on class: Rioolgemaal
  on property: has as part
  min qualified cardinality: 0
subclass of: Restriction
  author at start life: Marinus Vonhof
  date of start life: 2020-05-26
  on class: Vuilwaterriool
  on property: has as part
  min qualified cardinality: 0
subclass of: Restriction
  author at start life: Marinus Vonhof
  date of start life: 2024-05-16
  on class: Externe overstortput
  on property: has as part
  min qualified cardinality: 0
subclass of: Restriction
  on property: heeft Functie
  has value: Inzameling van hemelwater en vuilwater
subclass of: Restriction
  on property: heeft Functie
  has value: Tijdelijke berging van hemelwater en vuilwater
subclass of: Restriction
  on property: heeft Functie
  has value: Transport van hemelwater en vuilwater

Levensvorm
author of change: Marinus Vonhof
date of change: 2016-04-24
definition: Iets dat in staat is tot leven
author at start life: Marinus Vonhof
date of start life: 2014-11-29
validity context: *f 15d
comment: [cfk fout]
scope note: Cof TOP
type: Class

Adresgegevens
author of change: Marinus Vonhof
author of change: Johan Post
date of change: 2018-12-05
date of change: 2026-05-01
author at start life: Marinus Vonhof
date of start life: 2013-03-29
validity context: 5d 11d 15d 16d
comment: BAG / StUF-berichten - ADR Adres
see also: [NEN 5826:2002] de verzameling van gegevens voor de aanduiding van een individuele woon- of bedrijfseenheid dan wel de aanduiding van een bestemming
alternative label: Adres-informatie
comment: [is aspect]
scope note: Cof TOP
type: Class
subclass of: Kenmerk
subclass of: Restriction
  author of change: Marinus Vonhof
  date of change: 2018-12-05
  author at start life: Marinus Vonhof
  date of start life: 2014-08-01
  on class: EAN Code
  on property: has as aspect
  max qualified cardinality: 1
subclass of: Restriction
  author at start life: Eric van Gorkom
  date of start life: 2021-11-23
  on class: Gemaal
  on property: has as aspect (inverse)
  max qualified cardinality: 1
subclass of: Restriction
  author at start life: Marinus Vonhof
  date of start life: 2014-08-01
  on class: Telecomadres
  on property: has as aspect
  max qualified cardinality: 1
subclass of: Restriction
  author at start life: Marinus Vonhof
  date of start life: 2018-12-05
  on class: BAG Code
  on property: has as aspect
  max qualified cardinality: 1
subclass of: Restriction
  author at start life: Marinus Vonhof
  date of start life: 2020-05-28
  on class: Put
  on property: has as aspect (inverse)
  max qualified cardinality: 1

EAN Code
author of change: Marinus Vonhof
date of change: 2018-12-05
definition: Aansluiting identificatie code (eancode), op electriciteitsnet en gasnet
author at start life: Marinus Vonhof
date of start life: 2014-08-01
comment: Identificatie bij energieleverancier
see also: [DIV model] Identificatie van het object bij netwerkbedrijf elektriciteit
comment: [is aspect]
scope note: Cof MDS
scope note: Cof RGM
type: Class
subclass of: Unieke identificatie
subclass of: Restriction
  author of change: Marinus Vonhof
  date of change: 2018-12-05
  author at start life: Marinus Vonhof
  date of start life: 2014-08-01
  on class: Adresgegevens
  on property: has as aspect (inverse)
  max qualified cardinality: 1

Gemaal
label: Pumping station @en
author of change: Johan Post
author of change: Eric van Gorkom
date of change: 2021-11-23
date of change: 2026-05-18
definition: Een constructie ten behoeve van het verplaatsen van water
definition: [EN 16323:2014] buildings, structures and equipment used to transfer wastewater through a rising main or otherwise to raise the wastewater @en
author at start life: Marinus Vonhof
date of start life: 2014-03-18
validity context: *f
comment: [cfk fout]
scope note: Cof TOP
type: Class
subclass of: Bouwwerk
subclass of: Restriction
  author at start life: Eric van Gorkom
  date of start life: 2021-11-23
  on class: Adresgegevens
  on property: has as aspect
  max qualified cardinality: 1
subclass of: Restriction
  on property: heeft Functie
  has value: Verpompen van water

Telecomadres
author of change: Eric van Gorkom
date of change: 2024-05-13
author at start life: Marinus Vonhof
date of start life: 2014-08-01
comment: Telefoonnummer/IP-adres
see also: [DIV model] Identificatie van het object bij de telecommunicatieaanbieder
comment: [is aspect]
scope note: Cof MDS
scope note: Cof RGM
type: Class
subclass of: Unieke identificatie
subclass of: Restriction
  author at start life: Marinus Vonhof
  date of start life: 2014-08-01
  on class: Adresgegevens
  on property: has as aspect (inverse)
  max qualified cardinality: 1

BAG Code
author of change: Marinus Vonhof
date of change: 2020-05-28
definition: Code binnen de Basisregistratie Adressen en Gebouwen (bevat gemeentelijke basisgegevens van alle adressen en gebouwen in een gemeente)
author at start life: Marinus Vonhof
date of start life: 2014-08-01
see also: [DIV model] Identificatie van het object binnen de basisregistratie
alternative label: BAG-identificatie
comment: [is aspect]
scope note: Cof MDS
scope note: Cof RGM
type: Class
subclass of: Unieke identificatie
subclass of: Restriction
  author at start life: Marinus Vonhof
  date of start life: 2018-12-05
  on class: Adresgegevens
  on property: has as aspect (inverse)
  max qualified cardinality: 1

Afdekking
author of change: Eric van Gorkom
date of change: 2022-09-27
author at start life: Marinus Vonhof
date of start life: 2016-04-15
validity context: 5d 10d 11d 12f 13d 14f
scope note: Cof TOP
type: Class
subclass of: Constructieonderdeel
subclass of: Restriction
  author of change: Marinus Vonhof
  date of change: 2015-10-31
  author at start life: Finy Teitsma (Oranjewoud)
  date of start life: 2006-02-25
  on class: Breedte afdekking
  on property: has as aspect
  max qualified cardinality: 1
subclass of: Restriction
  author of change: Marinus Vonhof
  date of change: 2021-08-05
  author at start life: Finy Teitsma (Oranjewoud)
  date of start life: 2006-02-25
  on class: Vorm afdekking
  on property: has as aspect
  max qualified cardinality: 1
subclass of: Restriction
  author of change: Marinus Vonhof
  date of change: 2015-10-31
  author at start life: Marinus Vonhof
  date of start life: 2014-08-01
  on class: Hoogte afdekking
  on property: has as aspect
  max qualified cardinality: 1
subclass of: Restriction
  author of change: Marinus Vonhof
  date of change: 2015-10-31
  author at start life: Marinus Vonhof
  date of start life: 2014-11-16
  on class: Lengte afdekking
  on property: has as aspect
  max qualified cardinality: 1
subclass of: Restriction
  author of change: Marinus Vonhof
  date of change: 2017-03-28
  author at start life: Marinus Vonhof
  date of start life: 2013-10-01
  on class: Diameter afdekking
  on property: has as aspect
  max qualified cardinality: 1
subclass of: Restriction
  author of change: Marinus Vonhof
  date of change: 2021-08-06
  author at start life: Marinus Vonhof
  date of start life: 2013-10-26
  validity context: 12t 14t
  on class: Dekseloriëntatie
  on property: has as aspect
  max qualified cardinality: 1
subclass of: Restriction
  author at start life: Finy Teitsma (Oranjewoud)
  date of start life: 2006-02-25
  on property: has as aspect
  some values from: Breedte afdekking
subclass of: Restriction
  author at start life: Finy Teitsma (Oranjewoud)
  date of start life: 2006-02-25
  on property: has as aspect
  some values from: Materiaal afdekking
subclass of: Restriction
  author at start life: Finy Teitsma (Oranjewoud)
  date of start life: 2006-02-25
  on property: has as aspect
  some values from: Vorm afdekking
subclass of: Restriction
  author at start life: Marinus Vonhof
  date of start life: 2013-10-01
  on property: has as aspect
  some values from: Diameter afdekking
subclass of: Restriction
  validity context: 12t 14t
  on class: Materiaal afdekking
  on property: has as aspect
  max qualified cardinality: 1
subclass of: Restriction
  on property: heeft Functie
  has value: Afdekken

Constructieonderdeel
author of change: Marinus Vonhof
author of change: Johan Post
date of change: 2025-01-16
date of change: 2015-10-22
date of change: 2024-05-01
definition: [IMBOR] Een onderdeel van een objecttype dat als zelfstandig objecttype beheerd kan worden.
author at start life: Marinus Vonhof
date of start life: 2013-09-28
validity context: *f 15d
comment: [cfk fout]
scope note: Cof TOP
type: Class
subclass of: Fysiek object
subclass of: Restriction
  on property: heeft Toepassing
  has value: Deel van een op zichzelf staande constructie

Breedte afdekking
label: Breadth of cover @en
author of change: Marinus Vonhof
date of change: 2016-04-20
date of change: 2026-07-16
definition: [EN13508-2+A1] The breadth of the cover in millimetres (Not used for circular access) @en
notation: CCR
notation: JCR
author at start life: Nic Roest (Idoro)
date of start life: 2006-03-23
units of measurements: mm
comment: Intrinsiek aspect
comment: [is aspect]
scope note: Cof MDS
scope note: Cof EN
scope note: Cof RRB
scope note: Cof REV
type: Class
subclass of: Breedte
subclass of: Restriction
  author of change: Marinus Vonhof
  date of change: 2015-10-31
  author at start life: Finy Teitsma (Oranjewoud)
  date of start life: 2006-02-25
  on class: Afdekking
  on property: has as aspect (inverse)
  max qualified cardinality: 1
subclass of: Restriction
  author at start life: Marinus Vonhof
  date of start life: 2020-04-20
  on class: Visueel inspecteren rioolput
  on property: has as output (inverse)
  max qualified cardinality: 1
subclass of: Restriction
  on property: has as value
  all values from: integer

Vorm afdekking
label: Shape of cover @en
author of change: Marinus Vonhof
date of change: 2021-08-05
date of change: 2026-07-16
definition: [EN13508-2+A1] The shape of the cover @en
notation: CCO
notation: JCO
author at start life: Nic Roest (Idoro)
date of start life: 2006-03-23
comment: Intrinsiek aspect
comment: [is aspect]
scope note: Cof MDS
scope note: Cof REV
type: Class
subclass of: Vorm
subclass of: Restriction
  author of change: Marinus Vonhof
  date of change: 2021-08-05
  author at start life: Finy Teitsma (Oranjewoud)
  date of start life: 2006-02-25
  on class: Afdekking
  on property: has as aspect (inverse)
  max qualified cardinality: 1
subclass of: Restriction
  on property: has as reference (qualification)
  all values from: Vorm deksel (coll)

Hoogte afdekking
author of change: Marinus Vonhof
date of change: 2022-10-03
date of change: 2026-07-16
author at start life: Marinus Vonhof
date of start life: 2014-08-01
units of measurements: mm
validity context: 10d
comment: Intrinsiek aspect
alternative label: Dikte deksel
comment: [is aspect]
scope note: Cof MDS
type: Class
subclass of: Hoogte
subclass of: Restriction
  author of change: Marinus Vonhof
  date of change: 2015-10-31
  author at start life: Marinus Vonhof
  date of start life: 2014-08-01
  on class: Afdekking
  on property: has as aspect (inverse)
  max qualified cardinality: 1
subclass of: Restriction
  on property: has as value
  all values from: integer

Lengte afdekking
label: Width of cover @en
author of change: Marinus Vonhof
author of change: Nic Roest (Idoro)
date of change: 2026-07-16
date of change: 2006-11-23
definition: [EN13508-2+A1] The width (or diameter if circular) of the cover in millimetres @en
notation: CCQ
notation: JCQ
author at start life: Nic Roest (Idoro)
date of start life: 2006-03-23
units of measurements: mm
comment: Intrinsiek aspect
comment: [is aspect]
scope note: Cof MDS
scope note: Cof EN
scope note: Cof RRB
scope note: Cof REV
type: Class
subclass of: Lengte
subclass of: Restriction
  author of change: Marinus Vonhof
  date of change: 2015-10-31
  author at start life: Marinus Vonhof
  date of start life: 2014-11-16
  on class: Afdekking
  on property: has as aspect (inverse)
  max qualified cardinality: 1
subclass of: Restriction
  author at start life: Marinus Vonhof
  date of start life: 2020-04-20
  on class: Visueel inspecteren rioolput
  on property: has as output (inverse)
  max qualified cardinality: 1
subclass of: Restriction
  on property: has as value
  all values from: integer

Diameter afdekking
author of change: Marinus Vonhof
date of change: 2026-07-16
date of change: 2021-08-10
definition: De diameter van de afdekking (deksel, luik)
author at start life: Marinus Vonhof
date of start life: 2013-10-01
units of measurements: mm
comment: Intrinsiek aspect
comment: [is aspect]
scope note: Cof MDS
type: Class
subclass of: Diameter
subclass of: Restriction
  author of change: Marinus Vonhof
  date of change: 2017-03-28
  author at start life: Marinus Vonhof
  date of start life: 2013-10-01
  on class: Afdekking
  on property: has as aspect (inverse)
  max qualified cardinality: 1
subclass of: Restriction
  on property: has as value
  all values from: integer

Dekseloriëntatie
author of change: Marinus Vonhof
date of change: 2018-12-05
definition: Een topologisch element dat het zwaartepunt (vertex) van de bovenkant deksel beschrijft
author at start life: Marinus Vonhof
date of start life: 2013-10-26
scope note: Cof MDS
scope note: Cof EN
scope note: Cof RRB
scope note: Cof REV
type: Class
subclass of: Representatie fysiek object
subclass of: Restriction
  author of change: Marinus Vonhof
  date of change: 2020-04-18
  author at start life: Marinus Vonhof
  date of start life: 2016-11-09
  comment: Temporeel kenmerk, met kenmerk Inwinning
  on class: Punt
  on property: has as aspect
  max qualified cardinality: 1
subclass of: Restriction
  author of change: Marinus Vonhof
  date of change: 2021-08-06
  author at start life: Marinus Vonhof
  date of start life: 2013-10-26
  on class: Afdekking
  on property: has as aspect (inverse)
  max qualified cardinality: 1
subclass of: Restriction
  author at start life: Marinus Vonhof
  date of start life: 2018-12-12
  comment: Temporeel kenmerk, met kenmerk Inwinning
  on class: Putdekselniveau
  on property: has as aspect
  min qualified cardinality: 1

Materiaal afdekking
label: Material of cover @en
author of change: Marinus Vonhof
author of change: Eric van Gorkom
date of change: 2016-04-23
date of change: 2022-09-27
definition: [EN13508-2+A1] The material in accordance with Table C.4 @en
notation: CCP
notation: JCP
author at start life: Marinus Vonhof
date of start life: 2014-09-16
comment: Intrinsiek aspect
comment: [is aspect]
scope note: Cof TOP
type: Class
subclass of: Materiaal
subclass of: Restriction
  author of change: Marinus Vonhof
  date of change: 2015-02-22
  author at start life: Finy Teitsma (Oranjewoud)
  date of start life: 2006-02-25
  on class: Afdekking
  on property: has as aspect (inverse)
  max qualified cardinality: 1
subclass of: Restriction
  author at start life: Marinus Vonhof
  date of start life: 2020-04-20
  on class: Visueel inspecteren rioolput
  on property: has as output (inverse)
  max qualified cardinality: 1
subclass of: Restriction
  on property: has as reference (qualification)
  all values from: Materiaal deksel (coll)

Vrijverval rioolleiding
author of change: Johan Post
author of change: Eric van Gorkom
author of change: Wouter van Riel
date of change: 2021-11-23
date of change: 2024-04-23
date of change: 2024-10-21
definition: Een gesloten rioolleiding waarin het afvalwater door de zwaartekracht wordt getransporteerd.
definition: [NEN 3300:1996] riool waardoor afvalwater door middel van de zwaartekracht wordt getransporteerd
definition: [NEN-EN 752:2008] leiding of andere constructie, gewoonlijk ondergronds, die afvalwater vanuit meer één dan lozingspunt transporteert [EN 1085:2007, definitie 2270]
notation: AAA
notation: GAA
author at start life: Finy Teitsma (Oranjewoud)
date of start life: 2006-11-29
validity context: *f 13d
see also: [IMKL:1.1/2008] Riool waardoor afvalwater door de zwaartekracht wordt getransporteerd (uit NEN 3300, Buitenriolering).
see also: [NEN 3398:2004] verzameling buizen tussen twee putten
alternative label: Inzamelleiding
alternative label: Vrijvervalriool
comment: [cfk fout]
scope note: Cof TOP
type: Class
subclass of: Rioolleiding
subclass of: Restriction
  author of change: Marinus Vonhof
  date of change: 2018-09-03
  author at start life: Finy Teitsma (Oranjewoud)
  date of start life: 2006-02-25
  on class: Lining
  on property: has as part
  max qualified cardinality: 1
subclass of: Restriction
  author of change: Marinus Vonhof
  date of change: 2019-05-15
  author at start life: Finy Teitsma (Oranjewoud)
  date of start life: 2006-07-12
  on class: Inlaat leiding
  on property: has as part
  min qualified cardinality: 0
subclass of: Restriction
  author of change: Marinus Vonhof
  date of change: 2015-10-20
  author at start life: Marinus Vonhof
  date of start life: 2012-08-15
  validity context: *t
  comment: Relatie (kardinaliteit) uitgeschakeld voor CFK's (SHACL-syntax) (20260403) (20260824)
  on class: Visueel inspecteren vrijverval leiding
  on property: has as output (inverse)
  max qualified cardinality: 1
subclass of: Restriction
  author of change: Marinus Vonhof
  date of change: 2017-03-06
  author at start life: Marinus Vonhof
  date of start life: 2014-04-29
  validity context: *t
  on class: Rioolput
  on property: is connected to
  min qualified cardinality: 0
subclass of: Restriction
  author of change: Marinus Vonhof
  date of change: 2017-03-06
  author at start life: Marinus Vonhof
  date of start life: 2014-04-29
  on class: Rioolput
  on property: is connected to
  max qualified cardinality: 2
subclass of: Restriction
  author of change: Marinus Vonhof
  date of change: 2018-04-06
  author at start life: Marinus Vonhof
  date of start life: 2014-08-29
  on class: Visueel inspecteren vrijverval leiding
  on property: has as input (inverse)
  qualified cardinality: 1
subclass of: Restriction
  author of change: Marinus Vonhof
  date of change: 2019-04-04
  author at start life: Marinus Vonhof
  date of start life: 2014-12-23
  validity context: 2t
  on class: Reinigen vrijverval leiding
  on property: has as input (inverse)
  qualified cardinality: 1
subclass of: Restriction
  author of change: Marinus Vonhof
  date of change: 2016-04-15
  author at start life: Nic Roest (Idoro)
  date of start life: 2007-11-29
  validity context: 1t 10t 12t
  on class: Vrijverval rioolstelsel
  on property: has as part (inverse)
  max qualified cardinality: 1
subclass of: Restriction
  author at start life: Marinus Vonhof
  date of start life: 2014-12-23
  validity context: *t
  comment: Relatie (kardinaliteit) uitgeschakeld voor CFK's (SHACL-syntax) (20260403) (20260824)
  on class: Reinigen vrijverval leiding
  on property: has as output (inverse)
  max qualified cardinality: 1
subclass of: Restriction
  on property: heeft Structuur
  has value: Gesloten
subclass of: Restriction
  on property: heeft Technologie
  has value: Transport door de zwaartekracht

Mechanisme
author of change: Marinus Vonhof
date of change: 2021-01-09
definition: Bij activiteit: waarmee
author at start life: Marinus Vonhof
date of start life: 2014-04-29
validity context: 6d
comment: Onderscheidend kenmerk
comment: [is aspect]
scope note: Cof TOP
type: Class
subclass of: Onderscheidend kenmerk

Informatiedrager
author of change: Marinus Vonhof
date of change: 2013-12-01
definition: [Gellish] Is a medium intended or actually carrying physical objects from that properties information can be deducted. Typically paper that carries ink, magnetic fields on a disk or tape, electrically or optically modulated substances of electricity or light. @en
author at start life: Marinus Vonhof
date of start life: 2013-09-28
validity context: 10d 11d 12d 13d 14d 15d
scope note: Cof TOP
type: Class

Capaciteit
author of change: Marinus Vonhof
date of change: 2025-01-16
date of change: 2015-05-29
definition: [IMBOR] Vermogen tot opslaan of verwerken.
author at start life: Nic Roest (Idoro)
date of start life: 2006-02-21
validity context: 15d
comment: [is aspect]
scope note: Cof TOP
type: Class
subclass of: Kenmerk
subclass of: Restriction
  date of change: 2019-04-25
  author at start life: Marinus Vonhof
  date of start life: 2015-11-03
  on class: Inwinning
  on property: has as aspect
  max qualified cardinality: 1

Afslagniveau
author of change: Marinus Vonhof
date of change: 2018-05-03
definition: [NEN 3300:1996] peil waarop een pomp afslaat.
author at start life: Nic Roest (Idoro)
date of start life: 2006-02-21
units of measurements: m
see also: [IRIS-RIOKEN:2012] Ingesteld laag peil in de pompkelder van rioolgemaal. Als de riolering en de pompkelder tot aan het uitslagpeil is leeggepompt, wordt de bemaling beëindigd.
alternative label: Uitslagpeil
comment: [is aspect]
scope note: Cof MDS
scope note: Cof HYD
scope note: Cof RGM
type: Class
subclass of: Hoogte t.o.v. NAP
subclass of: Restriction
  on property: has as value
  all values from: decimal

Mechanische afsluiter
author of change: Marinus Vonhof
author of change: Johan Post
author of change: Wouter van Riel
date of change: 2026-05-21
date of change: 2024-04-22
date of change: 2019-07-11
definition: Een doorlaat met een voorziening om de stroming te regelen
author at start life: Marinus Vonhof
date of start life: 2019-05-15
validity context: 14f
alternative label: Mechanische doorlaat
scope note: Cof MDS
scope note: Cof REV
scope note: Cof PLI
scope note: Cof HYD
scope note: Cof DMO
type: Class
subclass of: Doorlaat
subclass of: Restriction
  author of change: Marinus Vonhof
  date of change: 2019-05-16
  author at start life: Marinus Vonhof
  date of start life: 2014-04-29
  on class: Bijzondere putconstructie
  on property: has as part (inverse)
  max qualified cardinality: 1
subclass of: Restriction
  author of change: Marinus Vonhof
  date of change: 2020-04-17
  author at start life: Marinus Vonhof
  date of start life: 2014-12-02
  on class: Transportleiding
  on property: is connected to
  max qualified cardinality: 2
subclass of: Restriction
  author at start life: Wouter van Riel
  date of start life: 2022-09-26
  on class: Overstortput
  on property: has as part (inverse)
  max qualified cardinality: 1
subclass of: Restriction
  on property: heeft Technologie
  has value: Mechanisch

Afsluitstuk (eindkap)
author of change: Marinus Vonhof
date of change: 2017-12-13
definition: Een hulpstuk bestemd voor het afsluiten van een leiding.
author at start life: Finy Teitsma (Oranjewoud)
date of start life: 2006-11-29
alternative label: Eindkap
scope note: Cof MDS
scope note: Cof PLI
scope note: Cof HYD
type: Class
subclass of: Hulpstuk
subclass of: Restriction
  on property: heeft Functie
  has value: Afsluiten van leidingen

Hulpstuk
author of change: Marinus Vonhof
author of change: Johan Post
author of change: Wouter van Riel
date of change: 2025-01-16
date of change: 2022-09-30
date of change: 2026-05-18
date of change: 2021-09-24
definition: [NEN 3300:1996] Verzamelnaam voor een constructieonderdeel van de riolering met een speciaal doel, zoals verloopstuk, overgangsstuk, ontstoppingsstuk
author at start life: Marinus Vonhof
date of start life: 2017-12-13
validity context: *f
comment: [cfk fout]
scope note: Cof MDS
scope note: Cof LDR
scope note: Cof REV
scope note: Cof PLI
scope note: Cof HYD
type: Class
subclass of: Constructieonderdeel
subclass of: Restriction
  author of change: Marinus Vonhof
  date of change: 2017-12-13
  author at start life: Marinus Vonhof
  date of start life: 2013-03-29
  validity context: 5t 10t 11t 14t
  on class: Hulpstukoriëntatie
  on property: has as aspect
  max qualified cardinality: 1
subclass of: Restriction
  on property: heeft Toepassing
  has value: Onderdeel van een leiding

Inlaat leiding
author of change: Marinus Vonhof
author of change: Johan Post
date of change: 2025-01-16
date of change: 2021-10-01
definition: [IMBOR] Een toegangsopening die een leiding toegankelijk maakt voor de door de leiding vervoerde substantie.
author at start life: Marinus Vonhof
date of start life: 2013-02-05
scope note: Cof MDS
scope note: Cof LDR
scope note: Cof REV
scope note: Cof MTR
type: Class
subclass of: Inlaat
subclass of: Restriction
  author of change: Marinus Vonhof
  date of change: 2019-05-15
  author at start life: Finy Teitsma (Oranjewoud)
  date of start life: 2006-07-12
  on class: Vrijverval rioolleiding
  on property: has as part (inverse)
  qualified cardinality: 1
subclass of: Restriction
  on property: heeft Uitvoering
  has value: Verbonden met leiding

Inlaat rioolput
author of change: Marinus Vonhof
author of change: Johan Post
date of change: 2025-01-16
date of change: 2021-10-01
definition: [IMBOR] Een toegangsopening die een put toegankelijk maakt voor de door de put geleide substantie.
author at start life: Marinus Vonhof
date of start life: 2013-02-05
scope note: Cof MDS
scope note: Cof LDR
scope note: Cof REV
scope note: Cof MTR
type: Class
subclass of: Inlaat
subclass of: Restriction
  author of change: Marinus Vonhof
  date of change: 2019-05-15
  author at start life: Finy Teitsma (Oranjewoud)
  date of start life: 2006-07-12
  on class: Inspectieput
  on property: has as part (inverse)
  qualified cardinality: 1
subclass of: Restriction
  on property: heeft Uitvoering
  has value: Verbonden met rioolput

Afstroomplaat
definition: verharde plaat rondom een slokop om begroeiing en erosie te voorkomen
author at start life: Johan Post
date of start life: 2026-05-01
scope note: Cof MDS
scope note: Cof REV
type: Class
subclass of: Afdekking
subclass of: Restriction
  on property: heeft Functie
  has value: Beschermen tegen begroeiing

Systeem
author of change: Marinus Vonhof
date of change: 2015-05-25
date of change: 2022-10-01
definition: De fysieke samenstelling van stelsels en inrichtingen die een functionele eenheid vormen
author at start life: Marinus Vonhof
date of start life: 2013-10-02
validity context: *f 10d 13d 14d 15d
comment: [cfk fout]
scope note: Cof TOP
type: Class
subclass of: Fysiek object
subclass of: Restriction
  author at start life: Marinus Vonhof
  date of start life: 2020-04-20
  on class: Gebiedsoriëntatie
  on property: has as aspect
  max qualified cardinality: 1
subclass of: Restriction
  on property: heeft Uitvoering
  has value: Geheel van stelsels

Transportstelsel
author of change: Marinus Vonhof
date of change: 2025-01-16
date of change: 2024-05-16
date of change: 2022-10-01
definition: [IMBOR] Voorzieningen voor het transport van afvalwater.
author at start life: Marinus Vonhof
date of start life: 2014-12-02
validity context: *f
comment: [cfk fout]
scope note: Cof TOP
type: Class
subclass of: Stelsel
subclass of: Restriction
  on property: heeft Functie
  has value: Transport van afvalwater

Rioolstelsel
label: Sewer system @en
definition: [EN 16323:2014] network of pipelines and ancillary works that conveys wastewater from drains to a treatment plant or other place of disposal @en
definition: [NEN 3300:1996] Het geheel aan voorzieningen voor de inzameling en het transport van afvalwater met uitzondering van zuiveringstechnische werken
definition: [NEN 3300:1996] Samenhangend geheel van riolen en rioolputten en de bijbehorende voorzieningen voor de inzameling en het transport van afvalwater
author at start life: Marinus Vonhof
date of start life: 2014-12-02
validity context: *f
alternative label: Riolering
alternative label: Rioleringsnet
comment: [cfk fout]
scope note: Cof TOP
type: Class
subclass of: Stelsel
subclass of: Restriction
  on property: heeft Functie
  has value: Inzameling van afvalwater
subclass of: Restriction
  on property: heeft Functie
  has value: Transport van afvalwater

Transportleiding
author of change: Marinus Vonhof
author of change: Johan Post
author of change: Wouter van Riel
date of change: 2025-01-16
date of change: 2024-04-23
date of change: 2026-05-13
date of change: 2025-04-02
definition: [IMBOR] Leiding met als functie de voortgeleiding van materie met mechanische en vrijverval leidingen als subtypen.
author at start life: Marinus Vonhof
date of start life: 2014-12-02
validity context: *f
comment: [cfk fout]
scope note: Cof TOP
type: Class
subclass of: Leiding
subclass of: Restriction
  author of change: Marinus Vonhof
  date of change: 2020-04-17
  author at start life: Marinus Vonhof
  date of start life: 2014-12-02
  on class: Mechanische afsluiter
  on property: is connected to
  max qualified cardinality: 2
subclass of: Restriction
  author at start life: Marinus Vonhof
  date of start life: 2024-05-16
  on class: Rioolafsluiter
  on property: has as part
  max qualified cardinality: 1
subclass of: Restriction
  author at start life: Marinus Vonhof
  date of start life: 2026-07-20
  on class: Doorlaat
  on property: has as part
  min qualified cardinality: 0
subclass of: Restriction
  on property: heeft Functie
  has value: Transport van afvalwater
subclass of: Restriction
  on class: Verbindingsstuk
  on property: has as part
  min qualified cardinality: 0

Afvoercoëfficiënt
label: Discharge coefficient @en
author of change: Johan Post
date of change: 2026-05-21
definition: factor om de afvoer onder ideale omstandigheden voor verliezen door randcondities, stromingsweerstand en geometrie te corrigeren
author at start life: Marinus Vonhof
date of start life: 2011-12-15
comment: [is aspect]
scope note: Cof MDS
scope note: Cof HYD
type: Class
subclass of: Kenmerk
subclass of: Restriction
  author of change: Marinus Vonhof
  date of change: 2019-03-20
  author at start life: Marinus Vonhof
  date of start life: 2011-12-15
  validity context: 5t 11t
  on class: Stuwmuur
  on property: has as aspect (inverse)
  max qualified cardinality: 1
subclass of: Restriction
  on property: has as value
  all values from: Afvoercoëfficiënt (datatype)

Stuwmuur
author of change: Marinus Vonhof
author of change: Johan Post
date of change: 2025-01-16
date of change: 2024-05-01
date of change: 2015-07-28
date of change: 2026-07-02
definition: [IMBOR] Een onderdeel bestaande uit muur die als functie heeft het keren van water.
author at start life: Marinus Vonhof
date of start life: 2013-09-28
comment: Als de stuwmuur geen drempniveau heeft is er geen overstort mogelijk, er wordt van uitgegaan dat de muur tot aan de bovenzijde van de put reikt.
scope note: Cof MDS
scope note: Cof REV
scope note: Cof HYD
scope note: Cof DMO
type: Class
subclass of: Wand
subclass of: Restriction
  author of change: Marinus Vonhof
  date of change: 2019-03-20
  author at start life: Marinus Vonhof
  date of start life: 2011-12-15
  validity context: 5t 11t 14t
  on class: Afvoercoëfficiënt
  on property: has as aspect
  max qualified cardinality: 1
subclass of: Restriction
  author of change: Marinus Vonhof
  date of change: 2026-07-20
  author at start life: Marinus Vonhof
  date of start life: 2019-03-20
  comment: Temporeel kenmerk, met kenmerk Inwinning
  on class: Drempelniveau
  on property: has as aspect
  min qualified cardinality: 0
subclass of: Restriction
  author at start life: Marinus Vonhof
  date of start life: 2017-12-07
  on class: Stuwput
  on property: has as part (inverse)
  qualified cardinality: 1
subclass of: Restriction
  author at start life: Marinus Vonhof
  date of start life: 2019-03-20
  validity context: 5t 11t 14t
  on class: Drempelbreedte
  on property: has as aspect
  max qualified cardinality: 1
subclass of: Restriction
  on property: heeft Functie
  has value: Keren van water

Open leiding
author of change: Marinus Vonhof
date of change: 2019-04-30
definition: Een rioolleiding waarvan de bovenzijde niet is afgesloten.
notation: OPL
author at start life: Marinus Vonhof
author at start life: Finy Teitsma (Oranjewoud)
date of start life: 2006-03-23
validity context: *f
comment: [cfk fout]
scope note: Cof MDS
scope note: Cof REV
scope note: Cof HYD
type: Class
subclass of: Leiding
subclass of: Restriction
  on property: heeft Structuur
  has value: Open

Representatie fysiek object
author of change: Marinus Vonhof
date of change: 2017-12-12
date of change: 2024-07-17
definition: Een topologisch element met als enige functie het dragen van de geometrie voor het representeren van fysieke objecten. Het vormt dus geen onderdeel van een netwerkdefinitie
author at start life: Marinus Vonhof
date of start life: 2013-02-03
scope note: Cof TOP
type: Class
subclass of: Topologisch element

Gebied
author of change: Marinus Vonhof
date of change: 2017-11-16
date of change: 2024-11-22
author at start life: Marinus Vonhof
date of start life: 2014-11-29
validity context: *f
see also: [IRIS-RIOKEN:2012] Het geheel van virtuele en fysieke (aanwijsbare) opdelingen en indelingen van het aardoppervlak.
alternative label: Ruimtelijk gebied
comment: [cfk fout]
scope note: Cof TOP
type: Class
subclass of: Ruimte
subclass of: Restriction
  author of change: Marinus Vonhof
  date of change: 2016-11-09
  author at start life: Marinus Vonhof
  date of start life: 2015-07-28
  on class: Gebiedsoriëntatie
  on property: has as aspect
  max qualified cardinality: 1

Reservoir
author of change: Marinus Vonhof
author of change: Wouter van Riel
date of change: 2025-01-16
date of change: 2024-04-22
date of change: 2017-08-21
definition: Constructies met een specifieke functie binnen het rioolstelsel.
definition: Een natuurlijk of kunstmatig gebied dat gebruikt wordt om water op te slaan
author at start life: Marinus Vonhof
date of start life: 2013-03-30
validity context: *f 12f 13d
comment: [cfk fout]
scope note: Cof TOP
type: Class
subclass of: Bouwwerk
subclass of: Restriction
  author at start life: Marinus Vonhof
  date of start life: 2018-12-06
  on class: Bergend oppervlak
  on property: has as aspect
  max qualified cardinality: 1
subclass of: Restriction
  author at start life: Marinus Vonhof
  date of start life: 2026-07-24
  on class: WIBON thema
  on property: has as aspect
  max qualified cardinality: 1
subclass of: Restriction
  on property: heeft Uitvoering
  has value: Natuurlijk of kunstmatig gebied
subclass of: Restriction
  on property: heeft Functie
  has value: Opslag van water

Stelsel
author of change: Marinus Vonhof
date of change: 2025-01-16
date of change: 2014-12-02
date of change: 2022-10-01
definition: Een netwerk van leidingen en aanverwante constructies
author at start life: Marinus Vonhof
date of start life: 2012-04-29
validity context: *f
comment: [cfk fout]
scope note: Cof TOP
type: Class
subclass of: Fysiek object
subclass of: Restriction
  author at start life: Marinus Vonhof
  date of start life: 2020-04-20
  validity context: 14t
  on class: Gebiedsoriëntatie
  on property: has as aspect
  max qualified cardinality: 1
subclass of: Restriction
  on property: heeft Uitvoering
  has value: Netwerk van verbonden knooppunten

Verbinding
author of change: Marinus Vonhof
date of change: 2024-07-17
date of change: 2017-12-22
definition: De verbinding van de knopen binnen de netwerkdefinitie
author at start life: Marinus Vonhof
date of start life: 2013-09-03
see also: [SUF-HYD 1.10] Een stroomvoerend element
scope note: Cof TOP
type: Class
subclass of: Edge

Lijn
author of change: Marinus Vonhof
author of change: Johan Post
date of change: 2019-05-15
date of change: 2024-05-02
definition: Eéndimensionaal geometrisch element. Voor geografische beschrijvingen conform het coordinatenstelsel EPSG:7415 (x/y conform EPSG:28992, optioneel z conform EPSG:5709).
author at start life: Marinus Vonhof
date of start life: 2016-11-09
units of measurements: gml
comment: [is aspect]
scope note: Cof TOP
type: Class
subclass of: Geometrie
subclass of: Restriction
  author of change: Marinus Vonhof
  date of change: 2020-04-18
  author at start life: Marinus Vonhof
  date of start life: 2016-11-09
  on class: Leidingoriëntatie
  on property: has as aspect (inverse)
  max qualified cardinality: 1
subclass of: Restriction
  on property: has as value
  all values from: gmlLiteral

Code
author of change: Marinus Vonhof
date of change: 2015-07-23
definition: Unieke verkorte aanduiding
author at start life: Nic Roest (Idoro)
date of start life: 2006-02-21
validity context: 15d
comment: [is aspect]
scope note: Cof MDS
scope note: Cof DMO
type: Class
subclass of: Unieke identificatie

Bouwwerk
author of change: Marinus Vonhof
author of change: Johan Post
author of change: Eric van Gorkom
date of change: 2025-01-16
date of change: 2024-05-01
date of change: 2021-11-23
definition: [IMBOR] Gegevens die specifiek zijn voor een met de aarde verbonden duurzaam constructie, dat niet valt onder de definities van een pand of kunstwerk.
definition: [Omgevingswet] Constructie van enige omvang van hout, steen, metaal of ander materiaal, die op de plaats van bestemming hetzij direct of indirect met de grond verbonden is, hetzij direct of indirect steun vindt in of op de grond, bedoeld om ter plaatse te functioneren, met inbegrip van de daarvan deel uitmakende bouwwerkgebonden installaties
author at start life: Marinus Vonhof
date of start life: 2016-04-20
validity context: *f
comment: [cfk fout]
scope note: Cof TOP
type: Class
subclass of: Fysiek object
subclass of: Restriction
  author of change: Marinus Vonhof
  date of change: 2017-08-21
  author at start life: Finy Teitsma (Oranjewoud)
  date of start life: 2006-02-25
  validity context: 5t 11t 14t
  comment: Vorm = niet rond
  on class: Breedte bouwwerk
  on property: has as aspect
  max qualified cardinality: 1
subclass of: Restriction
  author of change: Marinus Vonhof
  date of change: 2017-08-21
  author at start life: Finy Teitsma (Oranjewoud)
  date of start life: 2006-02-25
  validity context: 5t 11t
  comment: Vorm = niet rond
  on class: Lengte bouwwerk
  on property: has as aspect
  max qualified cardinality: 1
subclass of: Restriction
  author of change: Marinus Vonhof
  date of change: 2017-08-21
  author at start life: Finy Teitsma (Oranjewoud)
  date of start life: 2006-02-25
  validity context: 5t 11t
  on class: Vorm bouwwerk
  on property: has as aspect
  max qualified cardinality: 1
subclass of: Restriction
  author of change: Marinus Vonhof
  date of change: 2017-08-21
  author at start life: Finy Teitsma (Oranjewoud)
  date of start life: 2006-02-25
  on class: Hoogte bouwwerk
  on property: has as aspect
  max qualified cardinality: 1
subclass of: Restriction
  author of change: Marinus Vonhof
  date of change: 2018-05-03
  author at start life: Marinus Vonhof
  date of start life: 2017-08-19
  validity context: 5t 10t 11t 14t
  on class: Bouwwerkoriëntatie
  on property: has as aspect
  max qualified cardinality: 1
subclass of: Restriction
  author of change: Marinus Vonhof
  date of change: 2018-12-05
  author at start life: Marinus Vonhof
  date of start life: 2018-09-03
  on class: Straat
  on property: has as part (inverse)
  max qualified cardinality: 1
subclass of: Restriction
  author at start life: Finy Teitsma (Oranjewoud)
  date of start life: 2006-02-25
  on property: has as aspect
  some values from: Breedte bouwwerk
subclass of: Restriction
  author at start life: Finy Teitsma (Oranjewoud)
  date of start life: 2006-02-25
  on property: has as aspect
  some values from: Hoogte bouwwerk
subclass of: Restriction
  author at start life: Finy Teitsma (Oranjewoud)
  date of start life: 2006-02-25
  on property: has as aspect
  some values from: Vorm bouwwerk
subclass of: Restriction
  author at start life: Marinus Vonhof
  date of start life: 2017-08-21
  validity context: 5t 11t 14t
  on class: Materiaal bouwwerk
  on property: has as aspect
  max qualified cardinality: 1
subclass of: Restriction
  author at start life: Marinus Vonhof
  date of start life: 2017-08-21
  on property: has as aspect
  some values from: Materiaal bouwwerk
subclass of: Restriction
  on property: heeft Uitvoering
  has value: Constructie van enige omvang
subclass of: Restriction
  on property: heeft Uitvoering
  has value: Verbonden met de grond

Reinigen vrijverval leiding
author of change: Marinus Vonhof
date of change: 2018-05-01
author at start life: Marinus Vonhof
date of start life: 2014-12-23
scope note: Cof MDS
scope note: Cof RRB
scope note: Cof LDR
scope note: Cof MTR
scope note: Cof DMO
type: Class
subclass of: Reinigen
subclass of: Restriction
  author of change: Marinus Vonhof
  date of change: 2019-04-04
  author at start life: Marinus Vonhof
  date of start life: 2014-12-23
  validity context: 2t
  on class: Vrijverval rioolleiding
  on property: has as input
  qualified cardinality: 1
subclass of: Restriction
  author at start life: Marinus Vonhof
  date of start life: 2014-12-23
  validity context: *t
  comment: Relatie (kardinaliteit) uitgeschakeld voor CFK's (SHACL-syntax) (20260403) (20260824)
  on class: Vrijverval rioolleiding
  on property: has as output
  max qualified cardinality: 1
subclass of: Restriction
  author at start life: Marinus Vonhof
  date of start life: 2014-12-23
  on class: Reinigingsproject riolering
  on property: has as part (inverse)
  qualified cardinality: 1
subclass of: Restriction
  author at start life: Marinus Vonhof
  date of start life: 2015-10-26
  on class: Inspectieproject riolering
  on property: has as part (inverse)
  qualified cardinality: 1
subclass of: Restriction
  author at start life: Marinus Vonhof
  date of start life: 2020-04-20
  on class: Voegmateriaal
  on property: has as output
  max qualified cardinality: 1
subclass of: Restriction
  on property: heeft Functie
  has value: Afstroming herstellen

Reinigen rioolput
author of change: Marinus Vonhof
date of change: 2018-05-01
author at start life: Marinus Vonhof
date of start life: 2014-12-23
scope note: Cof MDS
scope note: Cof RRB
scope note: Cof LDR
scope note: Cof MTR
scope note: Cof DMO
type: Class
subclass of: Reinigen
subclass of: Restriction
  author of change: Marinus Vonhof
  date of change: 2019-04-04
  author at start life: Marinus Vonhof
  date of start life: 2014-12-23
  on class: Rioolput
  on property: has as input
  qualified cardinality: 1
subclass of: Restriction
  author at start life: Marinus Vonhof
  date of start life: 2014-12-23
  validity context: *t
  comment: Relatie (kardinaliteit) uitgeschakeld voor CFK's (SHACL-syntax) (20260403) (20260824)
  on class: Rioolput
  on property: has as output
  max qualified cardinality: 1
subclass of: Restriction
  author at start life: Marinus Vonhof
  date of start life: 2014-12-23
  on class: Reinigingsproject riolering
  on property: has as part (inverse)
  qualified cardinality: 1
subclass of: Restriction
  author at start life: Marinus Vonhof
  date of start life: 2015-10-26
  on class: Inspectieproject riolering
  on property: has as part (inverse)
  qualified cardinality: 1
subclass of: Restriction
  author at start life: Marinus Vonhof
  date of start life: 2020-04-20
  on class: Voegmateriaal
  on property: has as output
  max qualified cardinality: 1
subclass of: Restriction
  on property: heeft Functie
  has value: Afstroming herstellen

Reinigen en inspecteren kolk
author of change: Marinus Vonhof
date of change: 2018-05-01
author at start life: Marinus Vonhof
date of start life: 2012-05-06
scope note: Cof MDS
scope note: Cof RRB
scope note: Cof LDR
scope note: Cof MTR
type: Class
subclass of: Reinigen
subclass of: Restriction
  author of change: Marinus Vonhof
  date of change: 2013-10-18
  author at start life: Marinus Vonhof
  date of start life: 2013-07-19
  on class: Kolk
  on property: has as output
  qualified cardinality: 1
subclass of: Restriction
  author of change: Marinus Vonhof
  date of change: 2014-09-03
  author at start life: Marinus Vonhof
  date of start life: 2014-04-29
  on class: Reinigings- en inspectieproject kolken
  on property: has as part (inverse)
  qualified cardinality: 1
subclass of: Restriction
  author of change: Marinus Vonhof
  date of change: 2019-04-04
  author at start life: Marinus Vonhof
  date of start life: 2014-04-29
  on class: Kolk
  on property: has as input
  qualified cardinality: 1
subclass of: Restriction
  author at start life: Marinus Vonhof
  date of start life: 2020-04-20
  on class: Voegmateriaal
  on property: has as output
  max qualified cardinality: 1
subclass of: Restriction
  on property: heeft Functie
  has value: Afstroming herstellen

Verbindingstype (coll)
comment: [is coll]
scope note: Cof MDS
scope note: Cof RRB
scope note: Cof LDR
scope note: Cof PLI
type: Class
subclass of: Verzameling soorten
subclass of: Class
  one of: Dubbele steekmof
  one of: Vaar/moer
  one of: Mof/spie

Verhardingstype (coll)
validity context: 6d
comment: [is coll]
scope note: Cof MDS
scope note: Cof RRB
scope note: Cof LDR
type: Class
subclass of: Verzameling soorten
subclass of: Class
  one of: Elementen verharding
  one of: Klinkers
  one of: Asfalt
  one of: Tegels
  one of: Stelconplaten
  one of: Onverhard
  one of: Steenslag
  one of: Kasseien
  one of: Mager beton
  one of: Beton (verharding)

Vorm leiding (coll)
comment: [is coll]
scope note: Cof MDS
scope note: Cof EN
scope note: Cof RRB
scope note: Cof REV
scope note: Cof HYD
type: Class
subclass of: Verzameling soorten
subclass of: Class
  one of: Rond
  one of: Rechthoekig
  one of: Eivormig
  one of: Eivormig omgekeerd
  one of: U-vorm

Vorm opening (coll)
comment: [is coll]
scope note: Cof TOP
type: Class
subclass of: Verzameling soorten
subclass of: Class
  one of: Rechthoekig
  one of: Rond
  one of: Anders (vorm)

Vorm put (coll)
comment: [is coll]
scope note: Cof TOP
type: Class
subclass of: Verzameling soorten
subclass of: Class
  one of: Rechthoekig
  one of: Rond
  one of: Anders (vorm)

Punt
author of change: Marinus Vonhof
date of change: 2026-07-24
definition: Nuldimensionaal element van geografische informatie. Conform coordinatenstelsel EPSG:7415 (x/y conform EPSG:28992, optioneel z conform EPSG:5709).
author at start life: Marinus Vonhof
date of start life: 2016-11-09
units of measurements: gml
comment: [is aspect]
scope note: Cof TOP
type: Class
subclass of: Geometrie
subclass of: Restriction
  author of change: Marinus Vonhof
  date of change: 2020-04-18
  author at start life: Marinus Vonhof
  date of start life: 2016-11-09
  on class: Dekseloriëntatie
  on property: has as aspect (inverse)
  max qualified cardinality: 1
subclass of: Restriction
  author of change: Marinus Vonhof
  date of change: 2020-04-18
  author at start life: Marinus Vonhof
  date of start life: 2016-11-09
  on class: Aansluitpunt
  on property: has as aspect (inverse)
  qualified cardinality: 1
subclass of: Restriction
  author of change: Marinus Vonhof
  date of change: 2020-04-18
  author at start life: Marinus Vonhof
  date of start life: 2016-11-09
  on class: Knooppunt
  on property: has as aspect (inverse)
  qualified cardinality: 1
subclass of: Restriction
  author of change: Marinus Vonhof
  date of change: 2020-04-18
  author at start life: Marinus Vonhof
  date of start life: 2016-11-09
  on class: Putoriëntatie
  on property: has as aspect (inverse)
  qualified cardinality: 1
subclass of: Restriction
  author of change: Marinus Vonhof
  date of change: 2020-04-18
  author at start life: Marinus Vonhof
  date of start life: 2018-12-12
  on class: Maaiveldoriëntatie
  on property: has as aspect (inverse)
  max qualified cardinality: 1
subclass of: Restriction
  on property: has as value
  all values from: gmlLiteral

Materiaal deksel (coll)
author of change: Marinus Vonhof
date of change: 2025-12-19
comment: [is coll]
scope note: Cof TOP
type: Class
subclass of: Verzameling soorten
subclass of: Class

Materiaal leiding (coll)
author of change: Marinus Vonhof
author of change: Johan Post
date of change: 2026-05-04
date of change: 2025-12-19
comment: [is coll]
scope note: Cof TOP
type: Class
subclass of: Verzameling soorten
subclass of: Class

Materiaal put (coll)
author of change: Marinus Vonhof
author of change: Johan Post
author of change: Eric van Gorkom
date of change: 2026-05-04
date of change: 2022-10-03
date of change: 2026-05-21
date of change: 2024-05-13
author at start life: Marinus Vonhof
date of start life: 2026-05-01
comment: [is coll]
scope note: Cof TOP
type: Class
subclass of: Verzameling soorten
subclass of: Class

Visueel inspecteren rioolput
label: Visual inspection manhole or inspection chamber @en
author of change: Marinus Vonhof
date of change: 2018-05-01
author at start life: Marinus Vonhof
date of start life: 2012-08-15
scope note: Cof MDS
scope note: Cof EN
scope note: Cof MTR
type: Class
subclass of: Visueel inspecteren
subclass of: Restriction
  author of change: Marinus Vonhof
  date of change: 2015-08-26
  author at start life: Marinus Vonhof
  date of start life: 2013-07-19
  validity context: *t
  comment: Relatie (kardinaliteit) uitgeschakeld voor CFK's (SHACL-syntax) (20260403) (20260824)
  on class: Rioolput
  on property: has as output
  max qualified cardinality: 1
subclass of: Restriction
  author of change: Marinus Vonhof
  date of change: 2015-10-20
  author at start life: Marinus Vonhof
  date of start life: 2013-07-19
  on class: Putdekselniveau
  on property: has as output
  max qualified cardinality: 1
subclass of: Restriction
  author of change: Marinus Vonhof
  date of change: 2017-03-23
  author at start life: Marinus Vonhof
  date of start life: 2013-01-05
  on class: Inspectieproject riolering
  on property: has as part (inverse)
  qualified cardinality: 1
subclass of: Restriction
  author of change: Marinus Vonhof
  date of change: 2019-04-04
  author at start life: Marinus Vonhof
  date of start life: 2014-08-29
  on class: Rioolput
  on property: has as input
  qualified cardinality: 1
subclass of: Restriction
  author at start life: Marinus Vonhof
  date of start life: 2020-04-20
  on class: Voegmateriaal
  on property: has as output
  max qualified cardinality: 1
subclass of: Restriction
  author at start life: Marinus Vonhof
  date of start life: 2020-04-20
  on class: Breedte afdekking
  on property: has as output
  max qualified cardinality: 1
subclass of: Restriction
  author at start life: Marinus Vonhof
  date of start life: 2020-04-20
  on class: Lengte afdekking
  on property: has as output
  max qualified cardinality: 1
subclass of: Restriction
  author at start life: Marinus Vonhof
  date of start life: 2020-04-20
  on class: Materiaal afdekking
  on property: has as output
  max qualified cardinality: 1

Unieke identificatie
label: Resource identifier @en
author of change: Marinus Vonhof
date of change: 2025-01-16
date of change: 2015-08-24
date of change: 2024-11-22
definition: [IMBOR] Een ondubbelzinnige en unieke aanduiding van een object.
author at start life: Nic Roest (Idoro)
date of start life: 2006-03-23
comment: [is aspect]
scope note: Cof TOP
type: Class
subclass of: Kenmerk

Voegmateriaal
author of change: Marinus Vonhof
date of change: 2021-08-12
definition: Afdichtingsmateriaal van de buisverbindingen
notation: AXP
notation: CXP
notation: EXP
notation: GXP
notation: JXP
author at start life: Marinus Vonhof
date of start life: 2013-11-26
alternative label: Afdichtingsmateriaal
comment: [is aspect]
scope note: Cof MDS
scope note: Cof RRB
scope note: Cof LDR
type: Class
subclass of: Materiaal
subclass of: Restriction
  author at start life: Marinus Vonhof
  date of start life: 2018-12-05
  on class: Leiding
  on property: has as aspect (inverse)
  max qualified cardinality: 1
subclass of: Restriction
  author at start life: Marinus Vonhof
  date of start life: 2020-04-20
  on class: Reinigen en inspecteren kolk
  on property: has as output (inverse)
  max qualified cardinality: 1
subclass of: Restriction
  author at start life: Marinus Vonhof
  date of start life: 2020-04-20
  on class: Reinigen rioolput
  on property: has as output (inverse)
  max qualified cardinality: 1
subclass of: Restriction
  author at start life: Marinus Vonhof
  date of start life: 2020-04-20
  on class: Reinigen vrijverval leiding
  on property: has as output (inverse)
  max qualified cardinality: 1
subclass of: Restriction
  author at start life: Marinus Vonhof
  date of start life: 2020-04-20
  on class: Visueel inspecteren rioolput
  on property: has as output (inverse)
  max qualified cardinality: 1
subclass of: Restriction
  author at start life: Marinus Vonhof
  date of start life: 2020-04-20
  on class: Visueel inspecteren vrijverval leiding
  on property: has as output (inverse)
  max qualified cardinality: 1
subclass of: Restriction
  on property: has as reference (qualification)
  all values from: Voegmateriaal (coll)

Materiaal
author of change: Marinus Vonhof
date of change: 2015-06-01
author at start life: Marinus Vonhof
date of start life: 2013-09-03
validity context: 15d
comment: [is aspect]
scope note: Cof TOP
type: Class
subclass of: Kenmerk

Voegmateriaal (coll)
author of change: Marinus Vonhof
author of change: Eric van Gorkom
date of change: 2023-01-10
date of change: 2021-08-16
comment: [is coll]
scope note: Cof MDS
scope note: Cof RRB
scope note: Cof LDR
type: Class
subclass of: Verzameling soorten
subclass of: Class
  one of: Dichtingsmassa
  one of: Cementmortel
  one of: Voegenkit
  one of: Compriband
  one of: Rubberring
  one of: Kunststofring
  one of: Voegenkit, niet asbesthoudend
  one of: Voegenkit, (mogelijk) asbesthoudend
  one of: Voegenkit, asbesthoudend
  one of: Voegenkit, (mogelijk) teerhoudend
  one of: Geen

Materiaal lining (coll)
author at start life: Marinus Vonhof
date of start life: 2026-07-17
comment: [is coll]
scope note: Cof TOP
type: Class
subclass of: Verzameling soorten
subclass of: Class
  one of: Betonnen segmenten
  one of: Vezelcement
  one of: Glasvezel versterkte kunststof
  one of: Epoxy
  one of: Polyester
  one of: Polymeerbeton
  one of: Polyetheen
  one of: HDPE
  one of: Polypropyleen
  one of: Cementmortel
  one of: PVC

Rioolleiding
label: Pipeline (EN) @en
author of change: Johan Post
author of change: Eric van Gorkom
author of change: Wouter van Riel
date of change: 2022-09-27
date of change: 2024-04-23
date of change: 2026-05-13
definition: [EN 16323:2014] hollow structure for transporting wastewater between manholes or other structures @en
definition: [EN 16323:2014] pipeline or other construction, usually underground, designed to carry wastewater from more than one source @en
definition: [NEN 3300:1996] samenstel van buizen tussen twee putten bestemd voor de inzameling en/of het transport van afvalwater
author at start life: Marinus Vonhof
date of start life: 2014-04-28
validity context: *f
alternative label: Riool
alternative label: Rioolstreng
alternative label: Sewer @en
alternative label: Streng
comment: [cfk fout]
scope note: Cof TOP
type: Class
subclass of: Leiding
subclass of: Restriction
  author of change: Marinus Vonhof
  date of change: 2024-05-16
  date of change: 2020-04-17
  author at start life: Finy Teitsma (Oranjewoud)
  date of start life: 2006-05-23
  on class: Rioolafsluiter
  on property: has as part
  max qualified cardinality: 1
subclass of: Restriction
  author at start life: Marinus Vonhof
  date of start life: 2026-07-20
  on class: Doorlaat
  on property: has as part
  max qualified cardinality: 2
subclass of: Restriction
  on property: heeft Functie
  has value: Inzameling van afvalwater
subclass of: Restriction
  on property: heeft Functie
  has value: Transport van afvalwater

Beginpunt leiding
label: Node 1 reference @en
author of change: Marinus Vonhof
date of change: 2016-04-24
definition: Het uiteinde van een leiding, anders dan het eindpunt. Ter plaatse van het leidingmidden op de bovenkant bodem.
definition: [EN13508-2+A1] The node reference of the second node as specified by the employing authority. @en
notation: AAD
notation: GAD
author at start life: Marinus Vonhof
date of start life: 2012-04-22
alternative label: Knooppuntreferentie 1
scope note: Cof TOP
type: Class
subclass of: Vertex
subclass of: Restriction
  author of change: Marinus Vonhof
  date of change: 2018-12-06
  author at start life: Marinus Vonhof
  date of start life: 2016-11-09
  validity context: *t
  comment: Temporeel kenmerk, met kenmerk Inwinning
  on class: B.o.b. beginpunt leiding
  on property: has as aspect
  min qualified cardinality: 1
subclass of: Restriction
  author at start life: Marinus Vonhof
  date of start life: 2011-12-02
  validity context: *t
  on class: Knooppunt
  on property: is connected to
  qualified cardinality: 1
subclass of: Restriction
  author at start life: Marinus Vonhof
  date of start life: 2011-12-02
  on class: Leidingoriëntatie
  on property: has as part (inverse)
  qualified cardinality: 1

Eindpunt leiding
label: Node 2 reference @en
author of change: Marinus Vonhof
date of change: 2016-04-24
definition: [EN13508-2+A1] The node reference of the second node as specified by the employing authority. @en
definition: Het uiteinde van een leiding, anders dan het beginpunt. Ter plaatse van het leidingmidden op de bovenkant bodem.
notation: AAF
notation: GAF
author at start life: Marinus Vonhof
date of start life: 2012-04-22
alternative label: Knooppuntreferentie 2
scope note: Cof TOP
type: Class
subclass of: Vertex
subclass of: Restriction
  author of change: Marinus Vonhof
  date of change: 2018-12-06
  author at start life: Marinus Vonhof
  date of start life: 2016-11-09
  validity context: *t
  comment: Temporeel kenmerk, met kenmerk Inwinning
  on class: B.o.b. eindpunt leiding
  on property: has as aspect
  min qualified cardinality: 1
subclass of: Restriction
  author at start life: Marinus Vonhof
  date of start life: 2011-12-02
  validity context: *t
  on class: Knooppunt
  on property: is connected to
  qualified cardinality: 1
subclass of: Restriction
  author at start life: Marinus Vonhof
  date of start life: 2011-12-02
  on class: Leidingoriëntatie
  on property: has as part (inverse)
  qualified cardinality: 1

Beerput
author of change: Marinus Vonhof
author of change: Johan Post
date of change: 2021-08-05
date of change: 2026-05-01
definition: Put bestemd voor het tijdelijk opslaan van vuilwater en voor een gedeeltelijke biologische afbraak van het vuilwater (waarbij geen overstort is op een rioolstelsel) / Variant: Een op terreinriolering of gebouwriolering aangesloten put, bedoeld voor het tijdelijk opslaan, de biologische afbraak en/ of de infiltratie in de bodem van stedelijk afvalwater.
definition: [NEN 3300:1996] put bestemd voor de tijdelijke opslag van fecaliën
author at start life: Finy Teitsma (Oranjewoud)
date of start life: 2007-10-23
alternative label: Rottingsput
scope note: Cof MDS
type: Class
subclass of: Put
subclass of: Restriction
  on property: heeft Technologie
  has value: Biologisch reinigen
subclass of: Restriction
  on property: heeft Uitvoering
  has value: Reservoir zonder lozing
subclass of: Restriction
  on property: heeft Functie
  has value: Zuiveren afvalwater

Begindatum
author of change: Marinus Vonhof
author of change: Wouter van Riel
date of change: 2024-04-22
date of change: 2015-05-29
date of change: 2023-01-10
definition: Datum waarop het fysieke object is geplaatst of geïnstalleerd (het wordt daarmee onderdeel van een fysiek systeem). Dus bijvoorbeeld niet de datum van fabricage.
author at start life: Marinus Vonhof
date of start life: 2011-12-15
units of measurements: yyyy-mm-dd
validity context: 5d 16d
alternative label: Installatiedatum
comment: [is aspect]
scope note: Cof TOP
type: Class
subclass of: Datum
subclass of: Restriction
  author at start life: Marinus Vonhof
  date of start life: 2013-09-28
  on class: Fysiek object
  on property: has as aspect (inverse)
  max qualified cardinality: 1
subclass of: Restriction
  on property: has as value
  all values from: date

Beginknooppunt
definition: Het knooppunt dat koppelt aan het (topologische) beginpunt van een leiding.
definition: [EN13508-2+A1] The node reference of the first node as specified by the employing authority. @en
author at start life: Marinus Vonhof
date of start life: 2026-07-17
alternative label: Beginknoop
scope note: Cof TOP
type: Class
subclass of: Extra objecttype (rol)

Extra objecttype (rol)
definition: Aanvullende niet-functionele objecttypering, bijvoorbeeld voor onderscheid van de uitvoeringswijze of de toegevoegde rol van het object. Het subtype is altijd multiparent, met ook een functioneel supertype
author at start life: Marinus Vonhof
date of start life: 2024-08-01
validity context: *f
comment: [cfk fout]
scope note: Cof TOP
type: Class
subclass of: Informatiedrager

Vertex
author of change: Marinus Vonhof
date of change: 2020-11-24
definition: Het punt waar lijnstukken bij elkaar komen, in de grafentheorie een knoop, in de meetkunde een hoekpunt
author at start life: Marinus Vonhof
date of start life: 2012-04-22
validity context: *f
alternative label: Knoop
comment: [cfk fout]
scope note: Cof TOP
type: Class
subclass of: Topologisch element

B.o.b. beginpunt leiding
definition: Binnenonderkant buis ter plaatse van het beginpunt
notation: AXG
notation: GXG
author at start life: Marinus Vonhof
date of start life: 2013-03-26
units of measurements: m
alternative label: B.o.b. bij beginknoop t.o.v. NAP
comment: [is aspect]
scope note: Cof TOP
type: Class
subclass of: Binnenonderkant buis
subclass of: Restriction
  author of change: Marinus Vonhof
  date of change: 2017-05-17
  date of change: 2024-05-15
  author at start life: Marinus Vonhof
  date of start life: 2015-10-29
  on class: Inwinning
  on property: has as aspect
  max qualified cardinality: 1
subclass of: Restriction
  author of change: Marinus Vonhof
  date of change: 2018-12-06
  author at start life: Marinus Vonhof
  date of start life: 2016-11-09
  validity context: *t
  on class: Beginpunt leiding
  on property: has as aspect (inverse)
  qualified cardinality: 1
subclass of: Restriction
  on property: has as value
  all values from: decimal

Leidingoriëntatie
author of change: Marinus Vonhof
date of change: 2020-04-18
definition: Een topologisch element dat het beginpunt, eindpunt (vertices) en de verbindingslijn (edge) daartussen beschrijft. De geometrie volgt het midden van de binnenonderkant van de leiding
notation: AXY
notation: GXY
author at start life: Marinus Vonhof
date of start life: 2017-12-12
scope note: Cof TOP
type: Class
subclass of: Verbinding
subclass of: Restriction
  author of change: Marinus Vonhof
  date of change: 2020-04-18
  author at start life: Marinus Vonhof
  date of start life: 2016-11-09
  comment: Temporeel kenmerk, met kenmerk Inwinning
  on class: Lijn
  on property: has as aspect
  max qualified cardinality: 1
subclass of: Restriction
  author at start life: Marinus Vonhof
  date of start life: 2011-12-02
  on class: Beginpunt leiding
  on property: has as part
  qualified cardinality: 1
subclass of: Restriction
  author at start life: Marinus Vonhof
  date of start life: 2011-12-02
  on class: Eindpunt leiding
  on property: has as part
  qualified cardinality: 1
subclass of: Restriction
  author at start life: Marinus Vonhof
  date of start life: 2012-04-22
  validity context: *t
  on class: Leiding
  on property: has as aspect (inverse)
  qualified cardinality: 1

Beginpunt onderdeel
author of change: Marinus Vonhof
date of change: 2017-12-08
definition: Bij een pomp, externe doorlaat of externe overstort bepaalt het beginpunt ook de stromingsrichting (= stroming van begin- naar eindpunt).
author at start life: Marinus Vonhof
date of start life: 2012-04-22
scope note: Cof MDS
scope note: Cof REV
scope note: Cof HYD
type: Class
subclass of: Vertex
subclass of: Restriction
  author of change: Marinus Vonhof
  date of change: 2017-12-07
  author at start life: Marinus Vonhof
  date of start life: 2012-04-22
  on class: Onderdeeloriëntatie
  on property: has as part (inverse)
  qualified cardinality: 1
subclass of: Restriction
  author at start life: Marinus Vonhof
  date of start life: 2017-12-12
  validity context: 5t 11t
  on class: Knooppunt
  on property: is connected to
  max qualified cardinality: 1

Onderdeeloriëntatie
author of change: Marinus Vonhof
author of change: Wouter van Riel
date of change: 2018-12-05
date of change: 2024-04-20
definition: Een topologisch element dat de verbindingslijn (edge) tussen het beginpunt en het eindpunt van het onderdeel beschrijft. Voor een wand, pomp of doorlaat beschrijft dit topologisch element de verbinding ervan binnen het netwerk, zie daarvoor de concepten "beginpunt/eindpunt onderdeel". Dit element kan een geometrie (punt of lijn) bevatten voor presentaties. Bij een wand (stuw-/overstortconstructie) beschrijft de geometrie het midden van de bovenkant wand in de breedterichting.
author at start life: Marinus Vonhof
date of start life: 2017-12-12
scope note: Cof MDS
scope note: Cof REV
scope note: Cof HYD
scope note: Cof DMO
type: Class
subclass of: Verbinding
subclass of: Restriction
  author of change: Marinus Vonhof
  date of change: 2015-06-08
  author at start life: Marinus Vonhof
  date of start life: 2012-04-22
  validity context: 5t 11t
  on class: Wand
  on property: has as aspect (inverse)
  max qualified cardinality: 1
subclass of: Restriction
  author of change: Marinus Vonhof
  date of change: 2017-12-07
  author at start life: Marinus Vonhof
  date of start life: 2012-04-22
  on class: Beginpunt onderdeel
  on property: has as part
  qualified cardinality: 1
subclass of: Restriction
  author of change: Marinus Vonhof
  date of change: 2017-12-07
  author at start life: Marinus Vonhof
  date of start life: 2012-04-22
  on class: Eindpunt onderdeel
  on property: has as part
  qualified cardinality: 1
subclass of: Restriction
  author at start life: Marinus Vonhof
  date of start life: 2012-04-22
  validity context: 5t 11t
  on class: Doorlaat
  on property: has as aspect (inverse)
  max qualified cardinality: 1
subclass of: Restriction
  author at start life: Marinus Vonhof
  date of start life: 2025-03-19
  on class: Lijn
  on property: has as aspect
  max qualified cardinality: 1
subclass of: Restriction
  author at start life: Wouter van Riel
  date of start life: 2024-04-20
  on class: Punt
  on property: has as aspect
  max qualified cardinality: 1

Begroeide infiltratievoorziening
definition: Een begroeide, onverharde verlaging in het maaiveld (wadi, veld, berm, greppel of sloot), waarin het hemelwater tijdelijk wordt geborgen en waarbij het hemelwater via een waterdoorlatende (zuiverende) bodempassage infiltreert in de ondergrond. In de ondergrond onder de bodempassage kan een infiltratiekoffer en/of infiltratiekrat aanwezig zijn. Bij overbelasting en voor de vertraagde leegloop van de voorziening kunnen onderdelen (drainage, noodoverstort, slokop etc.) zijn aangebracht voor het reguleren van hemelwater- en grondwater.
author at start life: Marinus Vonhof
date of start life: 2026-07-13
alternative label: Bovengrondse infiltratievoorziening
alternative label: Groene infiltratievoorziening
alternative label: Onverharde infiltratievoorziening
scope note: Cof MDS
scope note: Cof HYD
type: Class
subclass of: Infiltratievoorziening
subclass of: Restriction
  on property: heeft Uitvoering
  has value: Verdiept terrein met waterdoorlatende bodem
subclass of: Restriction
  on class: Infiltratiecompartiment
  on property: has as part
  min qualified cardinality: 1

Infiltratievoorziening
author of change: Marinus Vonhof
author of change: Johan Post
author of change: Eric van Gorkom
date of change: 2024-04-30
date of change: 2026-07-13
date of change: 2024-05-13
definition: Het geheel van componenten bestemd voor de inzameling van hemelwater en afvoer ervan door infiltratie.
author at start life: Marinus Vonhof
date of start life: 2014-03-20
validity context: *f
comment: [cfk fout]
scope note: Cof MDS
scope note: Cof HYD
type: Class
subclass of: Fysiek object
subclass of: Restriction
  author of change: Marinus Vonhof
  date of change: 2026-07-14
  author at start life: Marinus Vonhof
  date of start life: 2019-07-10
  on class: Rioolstelsel
  on property: has as part (inverse)
  max qualified cardinality: 1
subclass of: Restriction
  author of change: Marinus Vonhof
  date of change: 2026-07-14
  author at start life: Nic Roest (Idoro)
  date of start life: 2007-11-29
  on class: Bergend vermogen
  on property: has as aspect
  max qualified cardinality: 1
subclass of: Restriction
  author of change: Marinus Vonhof
  date of change: 2026-07-14
  author at start life: Nic Roest (Idoro)
  date of start life: 2007-11-29
  on class: Infiltrerend oppervlak
  on property: has as aspect
  max qualified cardinality: 1
subclass of: Restriction
  author at start life: Marinus Vonhof
  date of start life: 2026-07-14
  on class: Gebiedsoriëntatie
  on property: has as aspect
  max qualified cardinality: 1
subclass of: Restriction
  author at start life: Marinus Vonhof
  date of start life: 2026-07-24
  on class: Bergend oppervlak
  on property: has as aspect
  max qualified cardinality: 1
subclass of: Restriction
  author at start life: Marinus Vonhof
  date of start life: 2026-07-24
  on class: DIT-riool
  on property: has as part
  min qualified cardinality: 0
subclass of: Restriction
  author at start life: Marinus Vonhof
  date of start life: 2026-07-24
  on class: DT-riool
  on property: has as part
  min qualified cardinality: 0
subclass of: Restriction
  author at start life: Marinus Vonhof
  date of start life: 2026-07-24
  on class: Hemelwaterriool
  on property: has as part
  min qualified cardinality: 0
subclass of: Restriction
  author at start life: Marinus Vonhof
  date of start life: 2026-07-24
  on class: Infiltratiekoffer
  on property: has as part
  min qualified cardinality: 0
subclass of: Restriction
  author at start life: Marinus Vonhof
  date of start life: 2026-08-20
  on class: Infiltratieriool
  on property: has as part
  min qualified cardinality: 0
subclass of: Restriction
  author at start life: Marinus Vonhof
  date of start life: 2026-07-24
  on class: Infiltratieput
  on property: has as part
  min qualified cardinality: 0
subclass of: Restriction
  author at start life: Marinus Vonhof
  date of start life: 2026-07-24
  on class: Inspectieput
  on property: has as part
  min qualified cardinality: 0
subclass of: Restriction
  author at start life: Marinus Vonhof
  date of start life: 2026-07-24
  on class: Kolk
  on property: has as part
  min qualified cardinality: 0
subclass of: Restriction
  on property: heeft Functie
  has value: Hemelwater afvoeren naar ondergrond

Infiltratiecompartiment
definition: Een bovengrondse ruimte binnen een infiltratievoorziening waarin zich het hemelwater verzameld, waarna het infiltreert in de ondergrond en/of daarin aanwezige objecten
author at start life: Marinus Vonhof
date of start life: 2026-07-14
scope note: Cof MDS
scope note: Cof HYD
type: Class
subclass of: Reservoir
subclass of: Restriction
  on property: heeft Functie
  has value: Afvoer van hemelwater
subclass of: Restriction
  on class: Begroeide infiltratievoorziening
  on property: has as part (inverse)
  qualified cardinality: 1

Rooster
author of change: Marinus Vonhof
author of change: Johan Post
date of change: 2025-01-16
date of change: 2026-05-01
definition: Een open constructie van spijlen of sleuven die wordt toegepast om doorlaat van water of lucht mogelijk te maken, terwijl het toegang, instroom of doorgang van ongewenste objecten beperkt of voorkomt
definition: [IMBOR] Een in de ondergrond aangebracht horizontaal raamwerk dat dient voor infiltratie.
author at start life: Marinus Vonhof
date of start life: 2016-04-15
scope note: Cof MDS
scope note: Cof REV
type: Class
subclass of: Afdekking
subclass of: Restriction
  on property: heeft Functie
  has value: Afschermen
subclass of: Restriction
  on property: heeft Uitvoering
  has value: Doorlatend
subclass of: Restriction
  on class: Infiltratieput
  on property: has as part (inverse)
  qualified cardinality: 1

Infiltratiekoffer
author of change: Marinus Vonhof
author of change: Johan Post
author of change: Eric van Gorkom
date of change: 2024-05-01
date of change: 2021-10-01
date of change: 2026-07-13
date of change: 2024-05-13
definition: Een in de ondergrond aangebrachte ruimte gevuld met een substraat met een hoge porositeit, waarin het hemelwater wordt verdeeld over de ruimte en daarin tijdelijk wordt geborgen, waarbij het hemelwater via de bodem en wanden infiltreert in de ondergrond.
author at start life: Marinus Vonhof
date of start life: 2016-04-20
comment: Vanaf versie 1.7.0 vervangt Infiltratiekoffer/-krat het concept Infiltratiereservoir
comment: Vanaf versie 1.7.0 kan het substraat-materiaal expliciet worden beschreven, daarmee is het gebruik van de subtypes Zandkoffer, Grindkoffer en dergelijke (voor gegevensuitwisseling) niet meer nodig.
alternative label: Infiltratiereservoir
scope note: Cof MDS
scope note: Cof HYD
type: Class
subclass of: Reservoir
subclass of: Restriction
  author at start life: Marinus Vonhof
  date of start life: 2026-07-13
  validity context: *t
  on class: Substraat kern
  on property: has as part
  max qualified cardinality: 1
subclass of: Restriction
  author at start life: Marinus Vonhof
  date of start life: 2026-07-14
  on class: Omhulling
  on property: has as part
  min qualified cardinality: 0
subclass of: Restriction
  author at start life: Marinus Vonhof
  date of start life: 2026-07-24
  on class: Infiltratievoorziening
  on property: has as part (inverse)
  qualified cardinality: 1
subclass of: Restriction
  on property: heeft Functie
  has value: Afvoeren hemelwater naar de ondergrond
subclass of: Restriction
  on property: heeft Technologie
  has value: Infiltreren
subclass of: Restriction
  on property: heeft Functie
  has value: Tijdelijke berging van hemelwater
subclass of: Restriction
  on class: Putdeksel
  on property: has as part
  min qualified cardinality: 0

Benedenstrooms eindriool
author of change: Marinus Vonhof
date of change: 2016-04-28
definition: Een gesloten rioolleiding die het afvalwater afvoert van het eindgemaal naar de RWZI
author at start life: Finy Teitsma (Oranjewoud)
date of start life: 2007-10-23
scope note: Cof MDS
scope note: Cof HYD
scope note: Cof DMO
type: Class
subclass of: Transportrioolleiding
subclass of: Restriction
  on property: heeft Functie
  has value: Afvoer van afvalwater naar een RWZI

Transportrioolleiding
author of change: Marinus Vonhof
date of change: 2015-07-28
definition: Een gesloten rioolleiding waarop in principe geen aansluitleidingen zijn aangesloten.
definition: [NEN 3300:1996] Riool hoofdzakelijk bestemd voor het transport van afvalwater
author at start life: Finy Teitsma (Oranjewoud)
date of start life: 2006-11-29
comment: 20151014: NEN3300-definitie aangepast
alternative label: Hoofdriool
alternative label: Moerriool
alternative label: Transportriool
scope note: Cof MDS
scope note: Cof REV
scope note: Cof HYD
scope note: Cof DMO
type: Class
subclass of: Vrijverval transportleiding
subclass of: Restriction
  author of change: Marinus Vonhof
  date of change: 2025-12-03
  author at start life: Marinus Vonhof
  date of start life: 2018-12-06
  on class: Vrijverval leidingsegment
  on property: has as part
  min qualified cardinality: 0
subclass of: Restriction
  on property: heeft Uitvoering
  has value: Zonder aansluitingen

Perceelaansluitleiding
author of change: Marinus Vonhof
author of change: Johan Post
date of change: 2025-01-16
date of change: 2021-08-05
date of change: 2026-05-01
definition: Onderdeel van een openbaar hemelwaterstelsel, openbaar ontwateringsstelsel of openbaar vuilwaterriool waarop aansluiting van terrein- en/of gebouwriolering aanwezig of mogelijk is
author at start life: Finy Teitsma (Oranjewoud)
date of start life: 2006-02-20
scope note: Cof MDS
scope note: Cof LDR
type: Class
subclass of: Aansluitleiding
subclass of: Restriction
  author of change: Marinus Vonhof
  date of change: 2016-04-25
  author at start life: Finy Teitsma (Oranjewoud)
  date of start life: 2007-11-30
  on class: Perceelaansluiting
  on property: has as part (inverse)
  qualified cardinality: 1
subclass of: Restriction
  on property: heeft Functie
  has value: Perceelaansluitpunt met inlaat verbinden

Bergbezinkbassin
author of change: Eric van Gorkom
author of change: Wouter van Riel
date of change: 2024-05-13
date of change: 2021-09-23
definition: Een gesloten reservoir waarin het afvalwater tijdelijk wordt opgevangen met een slibreinigende voorziening
definition: [NEN 3300:1996] reservoir voor de tijdelijke opslag van afvalwater waarin tevens slibafzetting plaatsvindt met een voorziening om het slib te kunnen verwijderen en waaruit overstortingen kunnen plaatsvinden
notation: BBB
author at start life: Marinus Vonhof
date of start life: 2013-09-29
scope note: Cof MDS
scope note: Cof HYD
scope note: Cof RGM
type: Class
subclass of: Reservoir
subclass of: Restriction
  author of change: Eric van Gorkom
  date of change: 2021-11-23
  author at start life: Marinus Vonhof
  date of start life: 2015-05-29
  on class: Overstortconstructie
  on property: has as part
  min qualified cardinality: 0
subclass of: Restriction
  author of change: Marinus Vonhof
  date of change: 2018-05-03
  author at start life: Finy Teitsma (Oranjewoud)
  date of start life: 2006-02-25
  on class: Bergend vermogen
  on property: has as aspect
  max qualified cardinality: 1
subclass of: Restriction
  author of change: Marinus Vonhof
  date of change: 2016-04-24
  author at start life: Marinus Vonhof
  date of start life: 2013-10-01
  on class: Gemengd rioolstelsel
  on property: has as part (inverse)
  qualified cardinality: 1
subclass of: Restriction
  author at start life: Marinus Vonhof
  date of start life: 2026-08-20
  validity context: *t
  on class: Bezinkcompartiment
  on property: has as part
  max qualified cardinality: 1
subclass of: Restriction
  author at start life: Marinus Vonhof
  date of start life: 2020-04-17
  on class: Verbeterd hemelwaterstelsel
  on property: has as part (inverse)
  max qualified cardinality: 1
subclass of: Restriction
  author at start life: Wouter van Riel
  date of start life: 2021-09-23
  on property: heeft Functie
  has value: Bezinken stoffen
subclass of: Restriction
  author at start life: Wouter van Riel
  date of start life: 2021-09-23
  on property: heeft Functie
  has value: Tijdelijke berging van afvalwater
subclass of: Restriction
  author at start life: Wouter van Riel
  date of start life: 2021-09-23
  on property: heeft Doel
  has value: Verminderen vuilbelasting van oppervlaktewater
subclass of: Restriction
  author at start life: Wouter van Riel
  date of start life: 2021-09-23
  on property: heeft Doel
  has value: Verwijderen bezinksel
subclass of: Restriction
  on property: heeft Functie
  has value: Regeling van de afvoer van het afvalwater
subclass of: Restriction
  on class: Putdeksel
  on property: has as part
  min qualified cardinality: 0

Overstortconstructie
author of change: Marinus Vonhof
author of change: Johan Post
author of change: Wouter van Riel
date of change: 2024-04-22
date of change: 2015-06-01
date of change: 2026-06-30
definition: Een constructie die het overstorten van water bij een ontworpen peilverschil mogelijk maakt, gerealiseerd door een overstortdrempel eventueel aangevuld met een op elkaar afgestemde combinatie van terugslagklep en duikschot.
author at start life: Marinus Vonhof
date of start life: 2015-05-29
validity context: 10f 11f 14f
scope note: Cof MDS
scope note: Cof HYD
type: Class
subclass of: Constructieonderdeel
subclass of: Restriction
  author of change: Marinus Vonhof
  date of change: 2017-03-06
  author at start life: Marinus Vonhof
  date of start life: 2015-07-27
  on class: Bergingsleiding
  on property: has as part (inverse)
  max qualified cardinality: 1
subclass of: Restriction
  author of change: Marinus Vonhof
  date of change: 2018-05-03
  author at start life: Marinus Vonhof
  date of start life: 2015-05-29
  on class: Bergbezinkbassin
  on property: has as part (inverse)
  max qualified cardinality: 1
subclass of: Restriction
  author of change: Marinus Vonhof
  date of change: 2018-05-03
  author at start life: Marinus Vonhof
  date of start life: 2015-07-27
  on class: Bergbezinkleiding
  on property: has as part (inverse)
  max qualified cardinality: 1
subclass of: Restriction
  author at start life: Marinus Vonhof
  date of start life: 2015-05-29
  on class: Bergingsbassin
  on property: has as part (inverse)
  max qualified cardinality: 1
subclass of: Restriction
  on property: heeft Functie
  has value: Overtollig afvalwater laten wegstromen

Bergend vermogen
author of change: Nic Roest (Idoro)
author of change: Johan Post
date of change: 2026-05-21
date of change: 2006-11-23
definition: De hoeveelheid afvalwater die in de voorziening kan worden geborgen
author at start life: Nic Roest (Idoro)
date of start life: 2006-02-21
units of measurements: m3
comment: [is aspect]
scope note: Cof MDS
scope note: Cof RGM
type: Class
subclass of: Inhoud
subclass of: Restriction
  author of change: Marinus Vonhof
  date of change: 2018-05-03
  author at start life: Finy Teitsma (Oranjewoud)
  date of start life: 2006-02-25
  on class: Bergbezinkbassin
  on property: has as aspect (inverse)
  max qualified cardinality: 1
subclass of: Restriction
  author at start life: Marinus Vonhof
  date of start life: 2015-05-29
  on class: Bergingsbassin
  on property: has as aspect (inverse)
  max qualified cardinality: 1
subclass of: Restriction
  author at start life: Marinus Vonhof
  date of start life: 2026-07-26
  on class: Inwinning
  on property: has as aspect
  max qualified cardinality: 1
subclass of: Restriction
  author at start life: Nic Roest (Idoro)
  date of start life: 2007-11-29
  on class: Infiltratiekoffer
  on property: has as aspect (inverse)
  max qualified cardinality: 1
subclass of: Restriction
  on property: has as value
  all values from: decimal

Bezinkcompartiment
definition: Een compartiment (fysiek onderdeel) van een bergbezinkvoorziening dat is bedoeld voor tijdelijke berging van afvalwater en het bevorderen van bezinking van zwevende stoffen door lage stroomsnelheid. Het compartiment wordt doorgaans gemodelleerd met leiding-eigenschappen: een leiding met ronde of vierkante vorm, aangelegd met bodemverhang.
author at start life: Marinus Vonhof
date of start life: 2026-08-21
scope note: Cof MDS
scope note: Cof HYD
type: Class
subclass of: Leiding
subclass of: Restriction
  on property: heeft Functie
  has value: Bezinken stoffen
subclass of: Restriction
  on property: heeft Functie
  has value: Transport van afvalwater
subclass of: Restriction
  validity context: *t
  on class: Bergbezinkbassin
  on property: has as part (inverse)
  max qualified cardinality: 1

Verbeterd hemelwaterstelsel
author of change: Marinus Vonhof
date of change: 2019-03-20
definition: Hemelwaterstelsel met voorzieningen waardoor een deel van de neerslag naar het vuilwaterriool wordt afgevoerd of wordt gezuiverd door bijvoorbeeld een filterconstructie of wadi.
author at start life: Marinus Vonhof
date of start life: 2018-12-06
scope note: Cof TOP
type: Class
subclass of: Hemelwaterstelsel
subclass of: Restriction
  author at start life: Marinus Vonhof
  date of start life: 2020-04-17
  on class: Bergbezinkbassin
  on property: has as part
  min qualified cardinality: 0
subclass of: Restriction
  author at start life: Marinus Vonhof
  date of start life: 2020-04-17
  on class: Bergingsbassin
  on property: has as part
  min qualified cardinality: 0
subclass of: Restriction
  author at start life: Marinus Vonhof
  date of start life: 2020-04-17
  on class: Bergingsvijver
  on property: has as part
  min qualified cardinality: 0
subclass of: Restriction
  author at start life: Marinus Vonhof
  date of start life: 2020-04-17
  on class: Bezinkbassin
  on property: has as part
  min qualified cardinality: 0
subclass of: Restriction
  author at start life: Marinus Vonhof
  date of start life: 2020-05-26
  on class: Rioolgemaal
  on property: has as part
  min qualified cardinality: 0
subclass of: Restriction
  on property: heeft Functie
  has value: Tijdelijke berging van hemelwater

Putdeksel
author of change: Marinus Vonhof
author of change: Eric van Gorkom
author of change: Wouter van Riel
date of change: 2025-01-16
date of change: 2024-04-22
date of change: 2024-05-13
definition: [IMBOR] Het deksel waarmee een rioolput wordt afgesloten.
author at start life: Marinus Vonhof
date of start life: 2011-12-02
validity context: 5d 11d
scope note: Cof MDS
scope note: Cof EN
scope note: Cof RRB
scope note: Cof REV
type: Class
subclass of: Deksel
subclass of: Restriction
  author at start life: Wouter van Riel
  date of start life: 2024-04-22
  on class: Rioolput
  on property: has as part (inverse)
  max qualified cardinality: 1
subclass of: Restriction
  on property: heeft Functie
  has value: Afdekken put
subclass of: Restriction
  on class: Bergbezinkbassin
  on property: has as part (inverse)
  min qualified cardinality: 0
subclass of: Restriction
  on class: Bergingsbassin
  on property: has as part (inverse)
  min qualified cardinality: 0
subclass of: Restriction
  on class: Infiltratiekoffer
  on property: has as part (inverse)
  min qualified cardinality: 0

Bergbezinkleiding
author of change: Marinus Vonhof
date of change: 2018-05-03
date of change: 2026-08-20
definition: Een bergbezinkbassin voorzien van een gesloten leiding waarin het afvalwater tijdelijk wordt opgevangen met een slibreinigende voorziening
definition: [NEN 3300:1996] riool voor de tijdelijke opslag van afvalwater waarin tevens slibafzetting plaatsvindt met een voorziening om het slib te kunnen verwijderen en waaruit overstortingen kunnen plaatsvinden
notation: BBL
author at start life: Nic Roest (Idoro)
date of start life: 2006-03-23
alternative label: Bergbezinkriool
scope note: Cof MDS
scope note: Cof HYD
scope note: Cof RGM
type: Class
subclass of: Bergbezinkbassin
subclass of: Restriction
  on property: heeft Uitvoering
  has value: Uitgevoerd als leiding

Bergend oppervlak
author of change: Marinus Vonhof
date of change: 2019-04-29
definition: Het oppervlak waarover het water op straat uitstroomt
author at start life: Marinus Vonhof
date of start life: 2011-12-15
units of measurements: m2
validity context: 15d
alternative label: Oppervlak water op straat
comment: [is aspect]
scope note: Cof MDS
scope note: Cof HYD
type: Class
subclass of: Kenmerk
subclass of: Restriction
  author of change: Marinus Vonhof
  date of change: 2018-05-03
  author at start life: Marinus Vonhof
  date of start life: 2011-12-15
  validity context: 5t 11t
  on class: Rioolput
  on property: has as aspect (inverse)
  max qualified cardinality: 1
subclass of: Restriction
  author at start life: Marinus Vonhof
  date of start life: 2018-12-06
  on class: Reservoir
  on property: has as aspect (inverse)
  max qualified cardinality: 1
subclass of: Restriction
  author at start life: Marinus Vonhof
  date of start life: 2026-07-24
  on class: Infiltratievoorziening
  on property: has as aspect (inverse)
  max qualified cardinality: 1
subclass of: Restriction
  author at start life: Marinus Vonhof
  date of start life: 2026-07-26
  on class: Inwinning
  on property: has as aspect
  max qualified cardinality: 1
subclass of: Restriction
  on property: has as value
  all values from: decimal

Inhoud
author of change: Marinus Vonhof
date of change: 2025-01-16
date of change: 2015-05-29
definition: [IMBOR] Kenmerk voor het volume van het beheerobject.
author at start life: Nic Roest (Idoro)
date of start life: 2006-02-21
units of measurements: m3
comment: [is aspect]
scope note: Cof TOP
type: Class
subclass of: Kenmerk
subclass of: Restriction
  on property: has as value
  all values from: decimal

Bergingsbassin
label: Detention tank @en
author of change: Eric van Gorkom
author of change: Wouter van Riel
date of change: 2024-05-13
date of change: 2021-09-23
definition: Een gesloten reservoir waarin het afvalwater tijdelijk wordt opgevangen
definition: [EN 16323:2014] closed or open tank for the temporary storage of wastewater @en
definition: [NEN 3300:1996] reservoir voor de tijdelijke opslag van afvalwater, ter regeling van de afvoerhoeveelheid
definition: [NEN-EN 752:2008] tank of reservoir voor de tijdelijke opslag van afvalwater [EN1085:2007, definitie 2240]
author at start life: Nic Roest (Idoro)
date of start life: 2006-03-23
alternative label: Bufferbassin
alternative label: Retentiebassin
scope note: Cof MDS
scope note: Cof HYD
type: Class
subclass of: Reservoir
subclass of: Restriction
  author of change: Marinus Vonhof
  date of change: 2016-04-24
  author at start life: Marinus Vonhof
  date of start life: 2014-04-30
  on class: Gemengd rioolstelsel
  on property: has as part (inverse)
  qualified cardinality: 1
subclass of: Restriction
  author at start life: Marinus Vonhof
  date of start life: 2015-05-29
  on class: Bergend vermogen
  on property: has as aspect
  max qualified cardinality: 1
subclass of: Restriction
  author at start life: Marinus Vonhof
  date of start life: 2015-05-29
  on class: Overstortconstructie
  on property: has as part
  max qualified cardinality: 1
subclass of: Restriction
  author at start life: Marinus Vonhof
  date of start life: 2020-04-17
  on class: Verbeterd hemelwaterstelsel
  on property: has as part (inverse)
  max qualified cardinality: 1
subclass of: Restriction
  author at start life: Wouter van Riel
  date of start life: 2021-09-23
  on property: heeft Functie
  has value: Regeling van de afvoer van het afvalwater
subclass of: Restriction
  author at start life: Wouter van Riel
  date of start life: 2021-09-23
  on property: heeft Functie
  has value: Tijdelijke berging van afvalwater
subclass of: Restriction
  author at start life: Wouter van Riel
  date of start life: 2021-09-23
  on property: heeft Doel
  has value: Verminderen vuilbelasting van oppervlaktewater
subclass of: Restriction
  on class: Putdeksel
  on property: has as part
  min qualified cardinality: 0

Bergingsleiding
author of change: Marinus Vonhof
date of change: 2015-07-27
definition: Een gesloten leiding waarin het afvalwater tijdelijk wordt opgevangen.
definition: [NEN 3300:1996] riool waardoor extra berging in het rioolstelsel wordt verkregen
definition: [NEN-EN 752:2008] deel van een riool dat als bergingsbassin fungeert
author at start life: Finy Teitsma (Oranjewoud)
date of start life: 2006-05-23
alternative label: Bergingsriool
alternative label: Retentieleiding
scope note: Cof MDS
scope note: Cof REV
scope note: Cof HYD
type: Class
subclass of: Vrijverval rioolleiding
subclass of: Restriction
  author of change: Marinus Vonhof
  date of change: 2017-03-06
  author at start life: Marinus Vonhof
  date of start life: 2015-07-27
  on class: Overstortconstructie
  on property: has as part
  max qualified cardinality: 1
subclass of: Restriction
  on property: heeft Functie
  has value: Tijdelijke berging van afvalwater

Bergingsvijver
author of change: Johan Post
date of change: 2021-09-23
definition: Een open reservoir (vijver, sloot, gracht, etc.), bestemd voor de berging van afvalwater ter regeling van de afvoer van het afvalwater.
definition: [NEN 3300:1996] open water voor de tijdelijke opslag van afvalwater
author at start life: Nic Roest (Idoro)
date of start life: 2006-03-23
validity context: 11d 12d
alternative label: Retentievijver
scope note: Cof MDS
scope note: Cof HYD
type: Class
subclass of: Reservoir
subclass of: Restriction
  author of change: Marinus Vonhof
  date of change: 2016-04-24
  author at start life: Marinus Vonhof
  date of start life: 2016-04-22
  on class: Gemengd rioolstelsel
  on property: has as part (inverse)
  qualified cardinality: 1
subclass of: Restriction
  author at start life: Finy Teitsma (Oranjewoud)
  date of start life: 2007-11-30
  on class: Lozingspunt
  on property: has as part
  min qualified cardinality: 1
subclass of: Restriction
  author at start life: Johan Post
  date of start life: 2021-09-23
  on property: heeft Functie
  has value: Regeling van de afvoer van het afvalwater
subclass of: Restriction
  author at start life: Johan Post
  date of start life: 2021-09-23
  on property: heeft Functie
  has value: Tijdelijke berging van afvalwater
subclass of: Restriction
  author at start life: Johan Post
  date of start life: 2021-09-23
  on property: heeft Doel
  has value: Verminderen vuilbelasting van oppervlaktewater
subclass of: Restriction
  author at start life: Marinus Vonhof
  date of start life: 2016-04-22
  on class: Hemelwaterstelsel
  on property: has as part (inverse)
  max qualified cardinality: 1
subclass of: Restriction
  author at start life: Marinus Vonhof
  date of start life: 2020-04-17
  on class: Verbeterd hemelwaterstelsel
  on property: has as part (inverse)
  max qualified cardinality: 1

Lozingspunt
label: Discharge point @en
definition: Een knooppunt in een stelsel waar het afvalwater het stelsel verlaat of binnenkomt.
definition: [EN 16323:2014] point where wastewater is discharged into a receiving water @en
definition: [NEN 3300:1996] het punt waar afvalwater het in beschouwing genomen rioolstelsel in- of uitstroomt
author at start life: Marinus Vonhof
date of start life: 2015-07-27
see also: [20150227] Vanuit het stelsel gezien het punt waar het afvalwater het stelsel verlaat
see also: [IRIS-RIOKEN:2012] Het punt waar door middel van een werk (afval)water in het oppervlaktewater wordt gebracht. Het water is niet afkomstig uit een ander oppervlaktewater.
scope note: Cof MDS
scope note: Cof PLI
scope note: Cof HYD
type: Class
subclass of: Aansluitpunt
subclass of: Restriction
  author of change: Marinus Vonhof
  date of change: 2016-04-13
  author at start life: Finy Teitsma (Oranjewoud)
  date of start life: 2007-10-24
  validity context: 5t 11t
  on class: Hemelwaterstelsel
  on property: has as part (inverse)
  max qualified cardinality: 1
subclass of: Restriction
  author of change: Marinus Vonhof
  date of change: 2016-04-22
  author at start life: Finy Teitsma (Oranjewoud)
  date of start life: 2007-10-24
  validity context: 5t 11t
  on class: Gemengd rioolstelsel
  on property: has as part (inverse)
  max qualified cardinality: 1
subclass of: Restriction
  author of change: Marinus Vonhof
  date of change: 2018-05-03
  author at start life: Finy Teitsma (Oranjewoud)
  date of start life: 2007-10-23
  on class: Mechanisch rioolstelsel
  on property: has as part (inverse)
  max qualified cardinality: 1
subclass of: Restriction
  author at start life: Finy Teitsma (Oranjewoud)
  date of start life: 2007-11-30
  on class: Bergingsvijver
  on property: has as part (inverse)
  max qualified cardinality: 1
subclass of: Restriction
  author at start life: Marinus Vonhof
  date of start life: 2015-03-01
  validity context: 5t 11t
  on class: Vuilwaterstelsel
  on property: has as part (inverse)
  max qualified cardinality: 1
subclass of: Restriction
  on property: heeft Functie
  has value: Lozen afvalwater

Hemelwaterstelsel
author of change: Marinus Vonhof
author of change: Johan Post
author of change: Wouter van Riel
date of change: 2024-05-16
date of change: 2021-10-01
date of change: 2024-04-22
definition: Een enkelvoudig vrijverval rioolstelsel bestemd voor de inzameling, het transport en de tijdelijke berging van hemelwater.
definition: [NEN 3300:1996] Rwa-rioolstelsel is synoniem van hemelwaterstelsel
definition: [NEN 3300:1996] rioolstelsel alleen bestemd voor de inzameling en het transport van neerslag
author at start life: Finy Teitsma (Oranjewoud)
date of start life: 2007-10-23
alternative label: HWA stelsel
alternative label: RWA-rioolstelsel
alternative label: Regenwaterrioolstelsel
scope note: Cof TOP
type: Class
subclass of: Vrijverval rioolstelsel
subclass of: Restriction
  author of change: Marinus Vonhof
  date of change: 2014-04-30
  author at start life: Finy Teitsma (Oranjewoud)
  date of start life: 2007-10-24
  validity context: *t
  on class: Hemelwaterriool
  on property: has as part
  min qualified cardinality: 0
subclass of: Restriction
  author of change: Marinus Vonhof
  date of change: 2016-04-13
  author at start life: Finy Teitsma (Oranjewoud)
  date of start life: 2007-10-24
  validity context: 5t 11t
  on class: Lozingspunt
  on property: has as part
  min qualified cardinality: 1
subclass of: Restriction
  author at start life: Marinus Vonhof
  date of start life: 2016-04-22
  on class: Bergingsvijver
  on property: has as part
  min qualified cardinality: 0
subclass of: Restriction
  author at start life: Marinus Vonhof
  date of start life: 2020-04-18
  on class: DIT-riool
  on property: has as part
  min qualified cardinality: 0
subclass of: Restriction
  author at start life: Marinus Vonhof
  date of start life: 2020-04-18
  on class: DT-riool
  on property: has as part
  min qualified cardinality: 0
subclass of: Restriction
  author at start life: Marinus Vonhof
  date of start life: 2020-05-26
  on class: Infiltratieriool
  on property: has as part
  min qualified cardinality: 0
subclass of: Restriction
  author at start life: Marinus Vonhof
  date of start life: 2024-05-16
  on class: Uitlaat (punt)
  on property: has as part
  min qualified cardinality: 1
subclass of: Restriction
  on property: heeft Functie
  has value: Inzameling van hemelwater
subclass of: Restriction
  on property: heeft Functie
  has value: Transport van hemelwater

Pompput
author of change: Finy Teitsma (Oranjewoud)
author of change: Johan Post
date of change: 2026-05-01
date of change: 2007-11-12
date of change: 2026-05-18
definition: Een rioolput met een inrichting bestemd voor het verpompen van afvalwater.
definition: [NEN 3300:1996] rioolput met een inrichting voor het verpompen van afvalwater
author at start life: Finy Teitsma (Oranjewoud)
date of start life: 2006-02-20
scope note: Cof TOP
type: Class
subclass of: Rioolput
subclass of: Restriction
  on property: heeft Functie
  has value: Verpompen van afvalwater
subclass of: Restriction
  on class: Rioolstelsel
  on property: has as part (inverse)
  max qualified cardinality: 1

Structuur
author of change: Marinus Vonhof
date of change: 2021-01-09
definition: Onderscheidende beschrijving van topologie, afmetingen, opbouw (delen)
author at start life: Marinus Vonhof
date of start life: 2013-09-29
validity context: 6d
comment: Onderscheidend kenmerk
comment: [is aspect]
scope note: Cof TOP
type: Class
subclass of: Onderscheidend kenmerk

Bezinkbassin
author of change: Wouter van Riel
date of change: 2021-09-23
definition: [NEN 3300:1996] reservoir waardoor afvalwater wordt gevoerd en waarin slibafzetting plaatsvindt, met een voorziening om het slib te kunnen verwijderen
author at start life: Marinus Vonhof
date of start life: 2012-04-29
scope note: Cof MDS
scope note: Cof HYD
scope note: Cof RGM
type: Class
subclass of: Reservoir
subclass of: Restriction
  author of change: Marinus Vonhof
  date of change: 2016-04-24
  author at start life: Finy Teitsma (Oranjewoud)
  date of start life: 2007-10-23
  on class: Gemengd rioolstelsel
  on property: has as part (inverse)
  qualified cardinality: 1
subclass of: Restriction
  author at start life: Marinus Vonhof
  date of start life: 2020-04-17
  on class: Verbeterd hemelwaterstelsel
  on property: has as part (inverse)
  max qualified cardinality: 1
subclass of: Restriction
  author at start life: Wouter van Riel
  date of start life: 2021-09-23
  on property: heeft Functie
  has value: Bezinken stoffen
subclass of: Restriction
  author at start life: Wouter van Riel
  date of start life: 2021-09-23
  on property: heeft Functie
  has value: Regeling van de afvoer van het afvalwater
subclass of: Restriction
  author at start life: Wouter van Riel
  date of start life: 2021-09-23
  on property: heeft Functie
  has value: Tijdelijke berging van afvalwater
subclass of: Restriction
  author at start life: Wouter van Riel
  date of start life: 2021-09-23
  on property: heeft Doel
  has value: Verminderen vuilbelasting van oppervlaktewater
subclass of: Restriction
  author at start life: Wouter van Riel
  date of start life: 2021-09-23
  on property: heeft Doel
  has value: Verwijderen bezinksel

Bijzondere putconstructie
author of change: Marinus Vonhof
author of change: Johan Post
date of change: 2025-01-16
date of change: 2021-10-01
definition: Put met een constructie die niet onder bekend type is onder te brengen
author at start life: Marinus Vonhof
date of start life: 2014-04-29
scope note: Cof MDS
scope note: Cof REV
scope note: Cof HYD
type: Class
subclass of: Rioolput
subclass of: Restriction
  author of change: Marinus Vonhof
  date of change: 2016-04-13
  author at start life: Marinus Vonhof
  date of start life: 2014-04-29
  on class: Wand
  on property: has as part
  min qualified cardinality: 0
subclass of: Restriction
  author of change: Marinus Vonhof
  date of change: 2019-05-16
  author at start life: Marinus Vonhof
  date of start life: 2014-04-29
  on class: Mechanische afsluiter
  on property: has as part
  min qualified cardinality: 0
subclass of: Restriction
  on property: heeft Uitvoering
  has value: Put met speciale voorzieningen

Wand
author of change: Marinus Vonhof
date of change: 2019-04-05
date of change: 2022-10-01
date of change: 2025-03-19
author at start life: Marinus Vonhof
date of start life: 2012-04-24
validity context: *f
comment: [cfk fout]
scope note: Cof MDS
scope note: Cof REV
scope note: Cof HYD
scope note: Cof DMO
type: Class
subclass of: Constructieonderdeel
subclass of: Restriction
  author of change: Marinus Vonhof
  date of change: 2015-06-08
  author at start life: Marinus Vonhof
  date of start life: 2012-04-22
  validity context: 5t 11t 14t
  on class: Onderdeeloriëntatie
  on property: has as aspect
  max qualified cardinality: 1
subclass of: Restriction
  author of change: Marinus Vonhof
  date of change: 2016-04-13
  author at start life: Marinus Vonhof
  date of start life: 2014-04-29
  on class: Bijzondere putconstructie
  on property: has as part (inverse)
  max qualified cardinality: 1
subclass of: Restriction
  on property: heeft Technologie
  has value: Statisch

Diameter leiding
author of change: Marinus Vonhof
date of change: 2019-01-24
definition: De lengte van de middellijn van de cirkel die de binnen- of de buitenzijde van de leidingdoorsnede beschrijft. Gehanteerd wordt de handelsmaat (de nominale diameter). Voor kunststof is deze lengte de buitenmaat, voor de overige materialen de binnenmaat. Dat geldt ook voor (de kunststof) Polypropyleen (PP), hoewel daarvoor in andere praktijken soms de binnenmaat wordt gebruikt.
author at start life: Marinus Vonhof
date of start life: 2013-10-01
units of measurements: mm
comment: Intrinsiek aspect
comment: In datasets kan voor de afmeting van ronde leidingen zowel de diameter, hoogte of breedte als kenmerk worden gebruikt
comment: [is aspect]
scope note: Cof MDS
scope note: Cof PLI
scope note: Cof HYD
scope note: Cof DMO
type: Class
subclass of: Diameter
subclass of: Restriction
  author of change: Marinus Vonhof
  date of change: 2015-09-20
  author at start life: Marinus Vonhof
  date of start life: 2013-10-01
  on class: Leiding
  on property: has as aspect (inverse)
  max qualified cardinality: 1
subclass of: Restriction
  author at start life: Marinus Vonhof
  date of start life: 2024-05-16
  on class: Inwinning
  on property: has as aspect
  max qualified cardinality: 1
subclass of: Restriction
  on property: has as value
  all values from: Diameter leiding (datatype)

Binnenonderkant buis
author of change: Marinus Vonhof
date of change: 2015-06-01
definition: Hoogteligging t.o.v. NAP van de binnen-onderkant-buis van de leiding
author at start life: Marinus Vonhof
date of start life: 2014-11-28
units of measurements: m
see also: [IRIS-RIOKEN:2012] Binnonderkant buis
alternative label: B.o.b.
alternative label: B.o.k.
comment: [is aspect]
scope note: Cof TOP
type: Class
subclass of: Hoogte t.o.v. NAP
subclass of: Restriction
  on property: has as value
  all values from: decimal

Eindpunt onderdeel
author of change: Marinus Vonhof
date of change: 2017-12-12
definition: Als het eindpunt ontbreekt bij het onderdeel (doorlaat, pomp, wand) wordt uitgegaan van externe lozing. Het transport verdwijnt uit het stelsel
author at start life: Marinus Vonhof
date of start life: 2012-04-22
scope note: Cof MDS
scope note: Cof REV
scope note: Cof HYD
type: Class
subclass of: Vertex
subclass of: Restriction
  author of change: Marinus Vonhof
  date of change: 2017-12-07
  author at start life: Marinus Vonhof
  date of start life: 2012-04-22
  on class: Onderdeeloriëntatie
  on property: has as part (inverse)
  qualified cardinality: 1
subclass of: Restriction
  author at start life: Marinus Vonhof
  date of start life: 2017-12-12
  validity context: 5t 11t
  on class: Knooppunt
  on property: is connected to
  max qualified cardinality: 1

Blinde inlaat
author of change: Marinus Vonhof
date of change: 2025-01-16
definition: Een afgedopte inlaat, zonder aansluiting
author at start life: Marinus Vonhof
date of start life: 2021-08-06
scope note: Cof MDS
scope note: Cof LDR
scope note: Cof REV
type: Class
subclass of: Inlaat
subclass of: Restriction
  on property: heeft Toepassing
  has value: Aansluiting ontbreekt
subclass of: Restriction
  on property: heeft Uitvoering
  has value: Afgedopt

Blusriool
definition: Permanent gevulde rioolleiding, verbonden met open water, voor het leveren van bluswater
author at start life: Marinus Vonhof
date of start life: 2018-12-05
alternative label: Brandriool
scope note: Cof MDS
type: Class
subclass of: Vrijverval rioolleiding
subclass of: Restriction
  on property: heeft Functie
  has value: Bluswater leveren

B.o.b. eindpunt leiding
definition: Binnenonderkant buis ter plaatse van het eindpunt
notation: AXH
notation: GXH
author at start life: Marinus Vonhof
date of start life: 2013-03-26
units of measurements: m
alternative label: B.o.b. bij eindknoop t.o.v. NAP
comment: [is aspect]
scope note: Cof TOP
type: Class
subclass of: Binnenonderkant buis
subclass of: Restriction
  author of change: Marinus Vonhof
  date of change: 2018-12-06
  author at start life: Marinus Vonhof
  date of start life: 2016-11-09
  validity context: *t
  on class: Eindpunt leiding
  on property: has as aspect (inverse)
  qualified cardinality: 1
subclass of: Restriction
  author at start life: Marinus Vonhof
  date of start life: 2015-10-29
  on class: Inwinning
  on property: has as aspect
  max qualified cardinality: 1
subclass of: Restriction
  on property: has as value
  all values from: decimal

Bochtstuk
author of change: Marinus Vonhof
date of change: 2017-12-13
definition: Een buis of buisstuk in de vorm van een bocht.
author at start life: Finy Teitsma (Oranjewoud)
date of start life: 2006-05-23
scope note: Cof MDS
scope note: Cof LDR
scope note: Cof REV
scope note: Cof PLI
scope note: Cof HYD
type: Class
subclass of: Verbindingsstuk
subclass of: Restriction
  on property: heeft Uitvoering
  has value: Buis in gebogen vorm
subclass of: Restriction
  on property: heeft Functie
  has value: Verbinden van leidingen in een hoek

Vorm
author of change: Marinus Vonhof
date of change: 2025-01-16
definition: Geometrische omschrijving
definition: [IMBOR] Kwalitatieve aanduiding van de contouren van een beheerobject.
author at start life: Marinus Vonhof
date of start life: 2016-04-23
validity context: 15d
comment: [is aspect]
scope note: Cof TOP
type: Class
subclass of: Kenmerk

Onderzoeken
author of change: Marinus Vonhof
date of change: 2015-08-24
definition: [NEN 3300:1996] Verzamelen, ordenen, analyseren en verwerken van gegevens, zodat informatie kan worden afgeleid over de toestand en het functioneren van de buitenriolering
author at start life: Marinus Vonhof
date of start life: 2013-03-26
validity context: 1f 3f 5d 10f 11d 12f 14f
comment: [cfk fout]
scope note: Cof TOP
type: Class
subclass of: Maatregel

Boostergemaal
author of change: Marinus Vonhof
date of change: 2018-05-03
definition: Een gemaal voor het verhogen van de vloeistofdruk door het afvalwater rechtstreeks van een pompinstallatie naar de volgende te persen
author at start life: Finy Teitsma (Oranjewoud)
date of start life: 2007-10-23
scope note: Cof MDS
scope note: Cof HYD
scope note: Cof RGM
scope note: Cof DMO
type: Class
subclass of: Rioolgemaal
subclass of: Restriction
  on property: heeft Technologie
  has value: Direct transport door pompen zonder opvang in een ontvangput/kelder

Rioolgemaal
author of change: Marinus Vonhof
author of change: Johan Post
date of change: 2024-04-30
date of change: 2017-08-19
definition: Een gemaal voor het verpompen van afvalwater.
definition: [NEN 3300:1996] een inrichting voor het verpompen van afvalwater
definition: [NEN-EN 752:2008] geheel van gebouw, constructies en apparatuur dat wordt gebruikt om afvalwater via een persleiding te transporteren of om het afvalwater op andere wijze omhoog te brengen
author at start life: Marinus Vonhof
date of start life: 2012-04-29
see also: [IRIS-RIOKEN:2012] Civiel werk waarin alle technische voorzieningen zijn ondergebracht die benodigd zijn voor het verpompen van rioolwater. Voor het waterschap zijn in principe alleen de riooleindgemalen interessant, waar overdracht van afvalwater plaatsvindt naar een stelsel dat onder beheer van dit waterschap is.
see also: [IRIS-RIOKEN:2012] Influentgemaal is synoniem van Rioolgemaal
alternative label: Influentgemaal
scope note: Cof TOP
type: Class
subclass of: Gemaal
subclass of: Restriction
  author of change: Marinus Vonhof
  date of change: 2019-07-10
  author at start life: Marinus Vonhof
  date of start life: 2014-10-14
  on class: Transportstelsel
  on property: has as part (inverse)
  max qualified cardinality: 1
subclass of: Restriction
  author at start life: Marinus Vonhof
  date of start life: 2020-05-26
  on class: Gemengd rioolstelsel
  on property: has as part (inverse)
  max qualified cardinality: 1
subclass of: Restriction
  author at start life: Marinus Vonhof
  date of start life: 2020-05-26
  on class: Verbeterd hemelwaterstelsel
  on property: has as part (inverse)
  max qualified cardinality: 1
subclass of: Restriction
  author at start life: Marinus Vonhof
  date of start life: 2020-05-26
  on class: Vuilwaterstelsel
  on property: has as part (inverse)
  max qualified cardinality: 1
subclass of: Restriction
  on property: heeft Functie
  has value: Verpompen van afvalwater

Onderhouden
label: Maintenance @en
author of change: Marinus Vonhof
date of change: 2020-10-28
definition: [EN 16323:2014] routine work undertaken to ensure the continuing performance of an asset @en
definition: [NEN 3300:1996] herstel van het oorspronkelijke functioneren, waarbij de toestand van objecten ongewijzigd gehandhaafd wordt
definition: [NEN-EN 752:2008] activiteiten die routinematig worden uitgevoerd om ervoor te zorgen dat de riolering goed blijft functioneren
author at start life: Marinus Vonhof
date of start life: 2013-02-05
validity context: 1f 3f 5d 10f 11d 12f 14f 16d
see also: [EN ISO 11298-1:2018] routine work undertaken to ensure the existing performance of an asset
comment: [cfk fout]
scope note: Cof TOP
type: Class
subclass of: Maatregel
subclass of: Restriction
  on property: heeft Doel
  has value: Goed blijven functioneren
subclass of: Restriction
  on property: heeft Functie
  has value: Zonder toestandswijziging

Breedte bouwwerk
author of change: Marinus Vonhof
date of change: 2024-05-16
date of change: 2017-08-21
definition: De inwendige breedte van het bouwwerk
author at start life: Nic Roest (Idoro)
date of start life: 2006-02-21
units of measurements: mm
comment: Intrinsiek aspect
comment: [is aspect]
scope note: Cof MDS
scope note: Cof REV
scope note: Cof HYD
scope note: Cof RGM
type: Class
subclass of: Breedte
subclass of: Restriction
  author of change: Marinus Vonhof
  date of change: 2017-08-21
  author at start life: Finy Teitsma (Oranjewoud)
  date of start life: 2006-02-25
  validity context: 5t 11t
  on class: Bouwwerk
  on property: has as aspect (inverse)
  max qualified cardinality: 1
subclass of: Restriction
  on property: has as value
  all values from: Breedte bouwwerk (datatype)

Lengte bouwwerk
author of change: Marinus Vonhof
date of change: 2024-05-16
date of change: 2017-08-21
definition: De inwendige lengte van het bouwwerk
author at start life: Nic Roest (Idoro)
date of start life: 2006-02-21
units of measurements: mm
validity context: 15d
comment: [is aspect]
scope note: Cof MDS
scope note: Cof REV
scope note: Cof HYD
scope note: Cof RGM
type: Class
subclass of: Lengte
subclass of: Restriction
  author of change: Marinus Vonhof
  date of change: 2017-08-21
  author at start life: Finy Teitsma (Oranjewoud)
  date of start life: 2006-02-25
  validity context: 5t 11t
  on class: Bouwwerk
  on property: has as aspect (inverse)
  max qualified cardinality: 1
subclass of: Restriction
  on property: has as value
  all values from: Lengte bouwwerk (datatype)

Vorm bouwwerk
author of change: Marinus Vonhof
date of change: 2013-09-20
author at start life: Marinus Vonhof
date of start life: 2012-05-01
comment: Intrinsiek aspect
alternative label: Bouwwerkvorm
comment: [is aspect]
scope note: Cof MDS
scope note: Cof REV
scope note: Cof HYD
scope note: Cof RGM
type: Class
subclass of: Vorm
subclass of: Restriction
  author of change: Marinus Vonhof
  date of change: 2017-08-21
  author at start life: Finy Teitsma (Oranjewoud)
  date of start life: 2006-02-25
  validity context: 5t 11t
  on class: Bouwwerk
  on property: has as aspect (inverse)
  max qualified cardinality: 1
subclass of: Restriction
  on property: has as reference (qualification)
  all values from: Vorm put (coll)

Hoogte bouwwerk
author of change: Marinus Vonhof
date of change: 2024-05-16
date of change: 2017-08-21
definition: De inwendige hoogte van het bouwwerk
author at start life: Nic Roest (Idoro)
date of start life: 2006-02-21
units of measurements: mm
validity context: 5t 11t
comment: Intrinsiek aspect
comment: [is aspect]
scope note: Cof MDS
scope note: Cof REV
scope note: Cof HYD
type: Class
subclass of: Hoogte
subclass of: Restriction
  author of change: Marinus Vonhof
  date of change: 2017-08-21
  author at start life: Finy Teitsma (Oranjewoud)
  date of start life: 2006-02-25
  on class: Bouwwerk
  on property: has as aspect (inverse)
  max qualified cardinality: 1
subclass of: Restriction
  on property: has as value
  all values from: Hoogte bouwwerk (datatype)

Bouwwerkoriëntatie
author of change: Marinus Vonhof
date of change: 2018-12-05
definition: Een topologisch element dat de contouren (edge) of het zwaartepunt (vertex) van een bouwwerk beschrijft
author at start life: Marinus Vonhof
date of start life: 2017-12-12
scope note: Cof TOP
type: Class
subclass of: Knooppunt
subclass of: Restriction
  author of change: Marinus Vonhof
  date of change: 2017-08-21
  author at start life: Marinus Vonhof
  date of start life: 2017-08-19
  on class: Maaiveldoriëntatie
  on property: is connected to
  max qualified cardinality: 1
subclass of: Restriction
  author of change: Marinus Vonhof
  date of change: 2018-05-03
  author at start life: Marinus Vonhof
  date of start life: 2017-08-19
  validity context: 5t 11t
  on class: Bouwwerk
  on property: has as aspect (inverse)
  max qualified cardinality: 1
subclass of: Restriction
  author of change: Marinus Vonhof
  date of change: 2020-04-18
  date of change: 2026-07-24
  author at start life: Marinus Vonhof
  date of start life: 2016-11-09
  comment: Temporeel kenmerk, met kenmerk Inwinning
  on class: Buitengrens
  on property: has as aspect
  max qualified cardinality: 1

Materiaal bouwwerk
author at start life: Marinus Vonhof
date of start life: 2015-05-29
comment: Intrinsiek aspect
comment: [is aspect]
scope note: Cof MDS
scope note: Cof REV
scope note: Cof HYD
scope note: Cof RGM
type: Class
subclass of: Materiaal
subclass of: Restriction
  author at start life: Marinus Vonhof
  date of start life: 2017-08-21
  validity context: 5t 11t
  on class: Bouwwerk
  on property: has as aspect (inverse)
  max qualified cardinality: 1
subclass of: Restriction
  on property: has as reference (qualification)
  all values from: Materiaal put (coll)

Buitengrens
author of change: Marinus Vonhof
date of change: 2024-07-17
date of change: 2020-11-24
date of change: 2024-12-07
definition: Het vlak dat de buitengrens beschrijft van de ruimte of de bovenkant van de constructie (topini: outer boundary/1661)
author at start life: Marinus Vonhof
date of start life: 2013-09-03
units of measurements: gml
comment: [is aspect]
scope note: Cof TOP
type: Class
subclass of: Vlak
subclass of: Restriction
  author of change: Marinus Vonhof
  date of change: 2020-04-18
  author at start life: Marinus Vonhof
  date of start life: 2012-11-23
  on class: Putoriëntatie
  on property: has as aspect (inverse)
  max qualified cardinality: 1
subclass of: Restriction
  author of change: Marinus Vonhof
  date of change: 2020-04-18
  author at start life: Marinus Vonhof
  date of start life: 2016-11-09
  on class: Bouwwerkoriëntatie
  on property: has as aspect (inverse)
  max qualified cardinality: 1
subclass of: Restriction
  author of change: Marinus Vonhof
  date of change: 2020-04-18
  author at start life: Marinus Vonhof
  date of start life: 2016-11-09
  on class: Gebiedsoriëntatie
  on property: has as aspect (inverse)
  max qualified cardinality: 1
subclass of: Restriction
  on property: has as value
  all values from: gmlLiteral

Bovengrond
author of change: Marinus Vonhof
author of change: Johan Post
date of change: 2015-06-01
date of change: 2026-04-30
author at start life: Marinus Vonhof
date of start life: 2013-10-05
validity context: *f 16d
comment: [cfk fout]
scope note: Cof TOP
type: Class
subclass of: Ruimte
subclass of: Restriction
  author at start life: Johan Post
  date of start life: 2026-04-30
  on class: Leiding
  on property: has as part
  min qualified cardinality: 0
subclass of: Restriction
  author at start life: Johan Post
  date of start life: 2026-04-30
  on class: Put
  on property: has as part
  min qualified cardinality: 0

Ruimte
author of change: Marinus Vonhof
date of change: 2017-11-16
definition: [Gellish] Is an inanimate physical object (a physical object that is not capable of life) that is volumetric and is enclosed by physical or imaginary boundaries and exists in time. This is distinguished from a volumetric spatial aspect and from a volume as a property. @en
author at start life: Marinus Vonhof
date of start life: 2013-09-03
validity context: *f 15d
comment: 2 of meer
comment: [cfk fout]
scope note: Cof TOP
type: Class
subclass of: Restriction
  on property: has as part
  all values from: Class
    union of: Ruimte
    union of: Fysiek object
disjoint with: Fysiek object

Breedte
author of change: Marinus Vonhof
date of change: 2015-05-29
definition: In zelfde vlak als lengte, haaks op lengtemeting
author at start life: Nic Roest (Idoro)
date of start life: 2006-02-21
validity context: 15d
comment: [is aspect]
scope note: Cof TOP
type: Class
subclass of: Afstand

Breedte compartiment
author at start life: Marinus Vonhof
date of start life: 2011-12-15
units of measurements: mm
comment: Intrinsiek aspect
comment: [is aspect]
scope note: Cof MDS
scope note: Cof HYD
type: Class
subclass of: Breedte
subclass of: Restriction
  on property: has as value
  all values from: integer

Breedte kast
author of change: Nic Roest (Idoro)
date of change: 2006-11-23
definition: De uitwendige breedte van een elektriciteitskast
author at start life: Nic Roest (Idoro)
date of start life: 2006-02-21
units of measurements: mm
comment: Intrinsiek aspect
comment: [is aspect]
scope note: Cof MDS
scope note: Cof RGM
type: Class
subclass of: Breedte
subclass of: Restriction
  on property: has as value
  all values from: integer

Breedte opening
author of change: Marinus Vonhof
date of change: 2015-06-01
author at start life: Marinus Vonhof
date of start life: 2011-12-15
units of measurements: mm
comment: Intrinsiek aspect
comment: [is aspect]
scope note: Cof MDS
scope note: Cof REV
scope note: Cof HYD
type: Class
subclass of: Breedte
subclass of: Restriction
  author of change: Marinus Vonhof
  date of change: 2017-12-07
  author at start life: Marinus Vonhof
  date of start life: 2011-12-15
  validity context: 5t 11t
  on class: Doorlaat
  on property: has as aspect (inverse)
  max qualified cardinality: 1
subclass of: Restriction
  on property: has as value
  all values from: integer

Doorlaat
author of change: Marinus Vonhof
date of change: 2018-12-13
definition: Een regelvoorziening voor de stroming van het afvalwater.
notation: DRL
author at start life: Marinus Vonhof
date of start life: 2012-05-05
validity context: *f
comment: [cfk fout]
scope note: Cof MDS
scope note: Cof REV
scope note: Cof PLI
scope note: Cof HYD
scope note: Cof DMO
type: Class
subclass of: Constructieonderdeel
subclass of: Restriction
  author of change: Marinus Vonhof
  date of change: 2017-09-06
  author at start life: Marinus Vonhof
  date of start life: 2011-12-15
  validity context: 5t 11t 14t
  on class: Maximale capaciteit doorlaat
  on property: has as aspect
  max qualified cardinality: 1
subclass of: Restriction
  author of change: Marinus Vonhof
  date of change: 2017-12-07
  author at start life: Marinus Vonhof
  date of start life: 2011-12-15
  validity context: 11t 14t
  on class: Hoogte opening
  on property: has as aspect
  max qualified cardinality: 1
subclass of: Restriction
  author of change: Marinus Vonhof
  date of change: 2017-12-07
  author at start life: Marinus Vonhof
  date of start life: 2011-12-15
  validity context: 5t 11t 14t
  on class: Breedte opening
  on property: has as aspect
  max qualified cardinality: 1
subclass of: Restriction
  author of change: Marinus Vonhof
  date of change: 2017-12-07
  author at start life: Marinus Vonhof
  date of start life: 2011-12-15
  validity context: 5t 11t 14t
  on class: Vorm opening
  on property: has as aspect
  max qualified cardinality: 1
subclass of: Restriction
  author of change: Marinus Vonhof
  date of change: 2017-12-07
  author at start life: Marinus Vonhof
  date of start life: 2017-08-31
  on class: Diameter opening
  on property: has as aspect
  max qualified cardinality: 1
subclass of: Restriction
  author at start life: Marinus Vonhof
  date of start life: 2011-12-15
  on property: has as aspect
  some values from: Breedte opening
subclass of: Restriction
  author at start life: Marinus Vonhof
  date of start life: 2011-12-15
  on property: has as aspect
  some values from: Hoogte opening
subclass of: Restriction
  author at start life: Marinus Vonhof
  date of start life: 2011-12-15
  on property: has as aspect
  some values from: Vorm opening
subclass of: Restriction
  author at start life: Marinus Vonhof
  date of start life: 2012-04-22
  validity context: 5t 11t 14t
  on class: Onderdeeloriëntatie
  on property: has as aspect
  max qualified cardinality: 1
subclass of: Restriction
  author at start life: Marinus Vonhof
  date of start life: 2017-08-31
  on property: has as aspect
  some values from: Diameter opening
subclass of: Restriction
  author at start life: Marinus Vonhof
  date of start life: 2017-12-07
  validity context: 5t 11t 14t
  on class: Doorlaatniveau
  on property: has as aspect
  max qualified cardinality: 1
subclass of: Restriction
  author at start life: Marinus Vonhof
  date of start life: 2026-07-20
  on class: Rioolleiding
  on property: has as part (inverse)
  max qualified cardinality: 1
subclass of: Restriction
  author at start life: Marinus Vonhof
  date of start life: 2026-07-20
  on class: Transportleiding
  on property: has as part (inverse)
  max qualified cardinality: 1
subclass of: Restriction
  on property: heeft Functie
  has value: Beperken debiet

Breedte put
author of change: Marinus Vonhof
author of change: Johan Post
date of change: 2021-08-06
date of change: 2026-05-01
definition: De inwendige breedte (horizontaal, uit het bovenaanzicht). Indien aanwezig de breedte van de onderbak - zie afbeelding dc (bron EN13508-2)
author at start life: Marinus Vonhof
date of start life: 2018-10-17
units of measurements: mm
comment: Intrinsiek aspect
comment: [is aspect]
scope note: Cof TOP
type: Class
subclass of: Breedte
subclass of: Restriction
  author of change: Marinus Vonhof
  date of change: 2014-08-01
  author at start life: Finy Teitsma (Oranjewoud)
  date of start life: 2006-02-25
  validity context: *t
  on class: Put
  on property: has as aspect (inverse)
  qualified cardinality: 1
subclass of: Restriction
  on property: has as value
  all values from: Breedte put (datatype)

Overstortput
label: Combined sewer overflow @en
author of change: Marinus Vonhof
author of change: Wouter van Riel
date of change: 2024-04-20
date of change: 2024-05-17
definition: Een rioolput voorzien van een overstortdrempel met een ontworpen drempellengte en -hoogte.
definition: [EN 16323:2014] device on a combined system that relieves the system of excess flow @en
definition: [NEN 3300:1996] rioolput voorzien van een overstortdrempel
definition: [Omgevingswet] Een kunstwerk waarmee rioolwater op het oppervlaktewater wordt geloosd, zodra het riool door te grote neerslaghoeveelheden niet al het rioolwater kan verwerken
author at start life: Finy Teitsma (Oranjewoud)
date of start life: 2006-02-20
validity context: 3f 10f 11f 14f
see also: [IRIS-RIOKEN:2012] Een inzamelknooppunt, uitgevoerd als voorziening met drempel, voor het onder bepaalde omstandigheden lozen van afvalwater uit het rioleringsnetwerk naar een ander rioleringsnetwerk of oppervlaktewater in de zin van de Wet verontreiniging oppervlaktewateren. Een riooloverstort is dus een voorziening door middel waarvan bij de neerslag van hemelwater het teveel aan hemelwater, al of niet vermengd met afvalwater dat niet in het stelsel wordt geborgen, kan worden geloosd op oppervlaktewater.
alternative label: Overstort
alternative label: Riooloverstort
scope note: Cof TOP
type: Class
subclass of: Rioolput
subclass of: Restriction
  on property: heeft Toepassing
  has value: Calamiteit
subclass of: Restriction
  on property: heeft Functie
  has value: Overtollig afvalwater laten wegstromen

Lining met afzonderlijke buizen
label: Lining with discrete pipes @en
author of change: Marinus Vonhof
date of change: 2025-01-16
definition: [IMBOR] Lining door middel van een geheel nieuwe buisleiding bestaande uit meerdere stukken, die in een bestaande leiding worden aangebracht.
notation: E
author at start life: Marinus Vonhof
date of start life: 2018-12-12
scope note: Cof MDS
scope note: Cof LDR
scope note: Cof MTR
type: Class
subclass of: Lining
subclass of: Restriction
  on property: heeft Uitvoering
  has value: Buis uit meerdere stukken

Verbindingstype
label: Joint @en
author of change: Marinus Vonhof
date of change: 2018-12-05
definition: De wijze waarop de buizen binnen een leiding zijn verbonden
definition: [EN 16323:2014] connection between the adjacent ends of two components including the means of sealing @en
notation: AXF
notation: GXF
author at start life: Nic Roest (Idoro)
date of start life: 2006-02-21
validity context: 15d
comment: [is aspect]
scope note: Cof MDS
scope note: Cof RRB
scope note: Cof LDR
scope note: Cof PLI
type: Class
subclass of: Kenmerk
subclass of: Restriction
  author of change: Marinus Vonhof
  date of change: 2018-12-05
  author at start life: Finy Teitsma (Oranjewoud)
  date of start life: 2006-02-25
  on class: Leiding
  on property: has as aspect (inverse)
  max qualified cardinality: 1
subclass of: Restriction
  on property: has as reference (qualification)
  all values from: Verbindingstype (coll)

Wanddikte
author of change: Marinus Vonhof
author of change: Johan Post
date of change: 2024-05-02
date of change: 2019-09-02
definition: Dikte van de wand van de constructie
notation: AXE
notation: CXE
author at start life: Nic Roest (Idoro)
date of start life: 2006-02-21
units of measurements: mm
comment: [is aspect]
scope note: Cof MDS
scope note: Cof EN
scope note: Cof RRB
scope note: Cof PLI
scope note: Cof HYD
type: Class
subclass of: Dikte
subclass of: Restriction
  author of change: Marinus Vonhof
  date of change: 2019-09-02
  author at start life: Finy Teitsma (Oranjewoud)
  date of start life: 2006-02-25
  on class: Leiding
  on property: has as aspect (inverse)
  max qualified cardinality: 1
subclass of: Restriction
  author at start life: Marinus Vonhof
  date of start life: 2015-10-21
  on class: Put
  on property: has as aspect (inverse)
  max qualified cardinality: 1
subclass of: Restriction
  on property: has as value
  all values from: integer

Vlak
author of change: Marinus Vonhof
date of change: 2019-05-15
definition: Tweedimensionaal geometrisch element. Voor geografische beschrijvingen conform coordinatenstelsel EPSG:7415 (x/y conform EPSG:28992, optioneel z conform EPSG:5709).
author at start life: Marinus Vonhof
date of start life: 2016-11-09
units of measurements: gml
comment: [is aspect]
scope note: Cof TOP
type: Class
subclass of: Geometrie
subclass of: Restriction
  on property: has as value
  all values from: gmlLiteral

Putoriëntatie
author of change: Marinus Vonhof
date of change: 2018-12-10
definition: Een topologisch element dat het zwaartepunt (vertex) van de bovenkant putbodem en/of de contouren van de constructie (edge) beschrijft.
author at start life: Marinus Vonhof
date of start life: 2017-12-12
scope note: Cof TOP
type: Class
subclass of: Knooppunt
subclass of: Restriction
  author of change: Marinus Vonhof
  date of change: 2017-12-12
  author at start life: Marinus Vonhof
  date of start life: 2015-11-07
  validity context: 5t 11t
  on class: Maaiveldoriëntatie
  on property: is connected to
  max qualified cardinality: 1
subclass of: Restriction
  author of change: Marinus Vonhof
  date of change: 2020-04-18
  author at start life: Marinus Vonhof
  date of start life: 2012-11-23
  comment: Temporeel kenmerk, met kenmerk Inwinning
  on class: Buitengrens
  on property: has as aspect
  min qualified cardinality: 0
subclass of: Restriction
  author at start life: Marinus Vonhof
  date of start life: 2012-04-22
  validity context: *t
  on class: Put
  on property: has as aspect (inverse)
  qualified cardinality: 1

Gebiedsoriëntatie
author of change: Marinus Vonhof
date of change: 2020-11-24
definition: Een topologisch element dat (de contouren van) het gebied, systeem of stelsel beschrijft
author at start life: Marinus Vonhof
date of start life: 2016-11-09
scope note: Cof MDS
scope note: Cof HYD
scope note: Cof DMO
type: Class
subclass of: Representatie fysiek object
subclass of: Restriction
  author of change: Marinus Vonhof
  date of change: 2016-11-09
  author at start life: Marinus Vonhof
  date of start life: 2015-07-28
  on class: Gebied
  on property: has as aspect (inverse)
  max qualified cardinality: 1
subclass of: Restriction
  author of change: Marinus Vonhof
  date of change: 2020-04-18
  author at start life: Marinus Vonhof
  date of start life: 2016-11-09
  comment: Temporeel kenmerk, met kenmerk Inwinning
  on class: Buitengrens
  on property: has as aspect
  min qualified cardinality: 0
subclass of: Restriction
  author at start life: Marinus Vonhof
  date of start life: 2020-04-20
  on class: Stelsel
  on property: has as aspect (inverse)
  max qualified cardinality: 1
subclass of: Restriction
  author at start life: Marinus Vonhof
  date of start life: 2020-04-20
  on class: Systeem
  on property: has as aspect (inverse)
  max qualified cardinality: 1

Materiaal put
label: Material (manhole) @en
author of change: Marinus Vonhof
date of change: 2014-12-17
definition: [EN13508-2+A1] The material of the fabric of the manhole or inspection chamber in accordance with Table C.4. @en
notation: CCD
notation: ECD
notation: JCD
author at start life: Marinus Vonhof
date of start life: 2012-05-01
comment: Intrinsiek aspect
alternative label: Putmateriaal
comment: [is aspect]
scope note: Cof TOP
type: Class
subclass of: Materiaal
subclass of: Restriction
  author of change: Marinus Vonhof
  date of change: 2015-06-01
  author at start life: Finy Teitsma (Oranjewoud)
  date of start life: 2007-10-24
  validity context: *t
  on class: Put
  on property: has as aspect (inverse)
  qualified cardinality: 1
subclass of: Restriction
  on property: has as reference (qualification)
  all values from: Materiaal put (coll)

Reinigen
label: Cleaning @en
author of change: Marinus Vonhof
date of change: 2018-05-01
definition: [EN 16323:2014] operation consisting of removing deposited solid matter or obstructions @en
author at start life: Marinus Vonhof
date of start life: 2016-04-24
validity context: 1f 3f 5d 10f 11d 12f 14f
comment: [cfk fout]
scope note: Cof TOP
type: Class
subclass of: Onderhouden

Reinigingsproject riolering
author of change: Marinus Vonhof
date of change: 2015-10-30
definition: Een project dat tot doel heeft het rioleringssysteem te reinigen.
author at start life: Marinus Vonhof
date of start life: 2014-12-23
validity context: 3d 14d
scope note: Cof MDS
scope note: Cof RRB
type: Class
subclass of: Project
subclass of: Restriction
  author at start life: Marinus Vonhof
  date of start life: 2014-12-23
  on class: Reinigen rioolput
  on property: has as part
  min qualified cardinality: 0
subclass of: Restriction
  author at start life: Marinus Vonhof
  date of start life: 2014-12-23
  on class: Reinigen vrijverval leiding
  on property: has as part
  min qualified cardinality: 0

Close fit lining
author of change: Marinus Vonhof
date of change: 2025-01-16
definition: [IMBOR] Nieuwe, zeer nauw op de bestaande leiding aansluitende bekleding of geheel nieuwe leiding die in een bestaande leiding wordt aangebracht.
notation: G
author at start life: Marinus Vonhof
date of start life: 2018-12-12
scope note: Cof MDS
scope note: Cof LDR
scope note: Cof MTR
type: Class
subclass of: Lining
subclass of: Restriction
  on property: heeft Uitvoering
  has value: Zeer nauw aansluitend op binnenwand

Lining
author of change: Marinus Vonhof
author of change: Johan Post
date of change: 2025-01-16
date of change: 2026-05-01
date of change: 2018-09-03
definition: [IMBOR] Nieuwe bekleding of een geheel nieuwe leiding die in een bestaande leiding wordt aangebracht.
author at start life: Marinus Vonhof
date of start life: 2015-02-28
validity context: 10d
alternative label: Liner
alternative label: Relining
scope note: Cof MDS
scope note: Cof LDR
scope note: Cof PLI
scope note: Cof MTR
type: Class
subclass of: Constructieonderdeel
subclass of: Restriction
  author of change: Marinus Vonhof
  date of change: 2018-09-03
  author at start life: Finy Teitsma (Oranjewoud)
  date of start life: 2006-02-25
  on class: Vrijverval rioolleiding
  on property: has as part (inverse)
  max qualified cardinality: 1
subclass of: Restriction
  author of change: Marinus Vonhof
  date of change: 2018-09-03
  author at start life: Marinus Vonhof
  date of start life: 2015-07-28
  on class: Vrijverval transportleiding
  on property: has as part (inverse)
  max qualified cardinality: 1
subclass of: Restriction
  author of change: Marinus Vonhof
  date of change: 2018-12-12
  author at start life: Marinus Vonhof
  date of start life: 2013-09-20
  on class: Materiaal lining
  on property: has as aspect
  max qualified cardinality: 1
subclass of: Restriction
  author at start life: Johan Post
  date of start life: 2026-05-01
  on class: Rioolput
  on property: has as part (inverse)
  max qualified cardinality: 1
subclass of: Restriction
  on property: heeft Uitvoering
  has value: Buis aan binnenzijde leiding

Lengte compartiment
author at start life: Marinus Vonhof
date of start life: 2011-12-15
units of measurements: mm
comment: [is aspect]
scope note: Cof MDS
scope note: Cof HYD
type: Class
subclass of: Lengte
subclass of: Restriction
  on property: has as value
  all values from: integer

Stuwput
author of change: Marinus Vonhof
date of change: 2015-02-28
date of change: 2026-07-20
definition: Een rioolput voorzien van een wand met opening of bijvoorbeeld een wervelventiel om de bergingscapaciteit van het bovenstroomse rioolstelsel te benutten.
definition: [NEN 3300:1996] Rioolput voorzien van een afvoerbeperking
author at start life: Finy Teitsma (Oranjewoud)
date of start life: 2006-02-20
comment: 20151014: NEN3300-definitie aangepast
scope note: Cof MDS
scope note: Cof RRB
scope note: Cof LDR
scope note: Cof REV
scope note: Cof HYD
type: Class
subclass of: Rioolput
subclass of: Restriction
  author of change: Marinus Vonhof
  date of change: 2018-12-12
  author at start life: Marinus Vonhof
  date of start life: 2017-12-07
  on class: Opening in wand
  on property: has as part
  max qualified cardinality: 1
subclass of: Restriction
  author at start life: Marinus Vonhof
  date of start life: 2017-12-07
  on class: Stuwmuur
  on property: has as part
  max qualified cardinality: 1
subclass of: Restriction
  on property: heeft Functie
  has value: Waterniveau in stelsel regelen

Pompunit
author of change: Marinus Vonhof
author of change: Johan Post
date of change: 2024-05-16
date of change: 2022-10-02
date of change: 2017-05-30
date of change: 2026-05-18
definition: Pompput in een drukrioleringsstelsel
author at start life: Marinus Vonhof
date of start life: 2012-04-24
validity context: 12d
see also: [Waterkring West] Onderdeel van een mechanisch rioolstelsel
alternative label: Drukrioleringsunit
alternative label: Minigemaal
scope note: Cof MDS
scope note: Cof REV
scope note: Cof RGM
scope note: Cof DMO
type: Class
subclass of: Rioolput
subclass of: Restriction
  on property: heeft Functie
  has value: Inzameling van afvalwater
subclass of: Restriction
  on property: heeft Functie
  has value: Verpompen van afvalwater

Hoogte compartiment
definition: De inwendige hoogte van het compartiment
author at start life: Wouter van Riel
date of start life: 2024-04-22
units of measurements: mm
comment: Intrinsiek aspect
comment: [is aspect]
scope note: Cof MDS
scope note: Cof HYD
type: Class
subclass of: Hoogte
subclass of: Restriction
  on property: has as value
  all values from: integer

DIT-riool
author of change: Marinus Vonhof
author of change: Johan Post
date of change: 2021-08-05
date of change: 2026-05-01
date of change: 2026-05-18
definition: Een rioolleiding met waterdoorlatende wanden bestemd voor de inzameling en transport van grondwater en hemelwater. Het grondwaterpeil wordt afgevlakt door infiltratie van hemelwater of exfiltratie van grondwater (drainage).
author at start life: Marinus Vonhof
date of start life: 2018-12-06
alternative label: Drainage infiltratie transportriool
scope note: Cof MDS
scope note: Cof HYD
type: Class
subclass of: Vrijverval rioolleiding
subclass of: Restriction
  author of change: Marinus Vonhof
  date of change: 2026-07-13
  author at start life: Marinus Vonhof
  date of start life: 2018-12-06
  on class: Omhulling
  on property: has as part
  max qualified cardinality: 1
subclass of: Restriction
  author at start life: Marinus Vonhof
  date of start life: 2020-04-18
  on class: Hemelwaterstelsel
  on property: has as part (inverse)
  max qualified cardinality: 1
subclass of: Restriction
  author at start life: Marinus Vonhof
  date of start life: 2026-07-24
  on class: Infiltratievoorziening
  on property: has as part (inverse)
  max qualified cardinality: 1
subclass of: Restriction
  author at start life: Wouter van Riel
  date of start life: 2021-11-19
  on property: heeft Functie
  has value: Afvoeren hemelwater naar de ondergrond
subclass of: Restriction
  author at start life: Wouter van Riel
  date of start life: 2021-11-19
  on property: heeft Functie
  has value: Inzamelen hemelwater en afgifte aan ondergrond
subclass of: Restriction
  author at start life: Wouter van Riel
  date of start life: 2021-11-19
  on property: heeft Functie
  has value: Inzameling van grondwater
subclass of: Restriction
  author at start life: Wouter van Riel
  date of start life: 2021-11-19
  on property: heeft Functie
  has value: Inzameling van hemelwater
subclass of: Restriction
  author at start life: Wouter van Riel
  date of start life: 2021-11-19
  on property: heeft Functie
  has value: Transport van grondwater
subclass of: Restriction
  author at start life: Wouter van Riel
  date of start life: 2021-11-19
  on property: heeft Functie
  has value: Transport van hemelwater
subclass of: Restriction
  on class: Doorlaatbaarheid
  on property: has as aspect
  max qualified cardinality: 1

Omhulling
author of change: Marinus Vonhof
date of change: 2026-07-13
definition: Bekleding van de buitenzijde
author at start life: Marinus Vonhof
date of start life: 2026-07-13
comment: Was Leidingomhulling, wordt meer algemeen. URI gewijzigd vanaf versie 1.7.0
alternative label: Bekleding
alternative label: Mantel
scope note: Cof MDS
scope note: Cof HYD
type: Class
subclass of: Constructieonderdeel
subclass of: Restriction
  author at start life: Marinus Vonhof
  date of start life: 2018-12-06
  on class: DT-riool
  on property: has as part (inverse)
  max qualified cardinality: 1
subclass of: Restriction
  author at start life: Marinus Vonhof
  date of start life: 2018-12-06
  on class: Infiltratieriool
  on property: has as part (inverse)
  max qualified cardinality: 1
subclass of: Restriction
  author at start life: Marinus Vonhof
  date of start life: 2026-07-13
  on class: DIT-riool
  on property: has as part (inverse)
  max qualified cardinality: 1
subclass of: Restriction
  author at start life: Marinus Vonhof
  date of start life: 2026-07-13
  on class: Infiltratiekoffer
  on property: has as part (inverse)
  max qualified cardinality: 1
subclass of: Restriction
  author at start life: Marinus Vonhof
  date of start life: 2026-07-13
  on class: Infiltratiekolk
  on property: has as part (inverse)
  max qualified cardinality: 1
subclass of: Restriction
  author at start life: Marinus Vonhof
  date of start life: 2026-07-13
  on class: Infiltratieput
  on property: has as part (inverse)
  max qualified cardinality: 1
subclass of: Restriction
  on property: heeft Uitvoering
  has value: Bekleding buitenzijde object

Doorlaatbaarheid
label: Permeability @en
author of change: Johan Post
date of change: 2026-05-01
definition: De mate van doorlaatbaarheid
definition: [EN 16323:2014] property of a material characterizing its ability to selectively permit substances to pass through it @en
author at start life: Johan Post
date of start life: 2024-05-01
units of measurements: m/dag
validity context: 15d
comment: Eenheid m/dag = m/etmaal
alternative label: Infiltratiesnelheid
alternative label: Permeabiliteit
comment: [is aspect]
scope note: Cof MDS
scope note: Cof RRB
scope note: Cof LDR
type: Class
subclass of: Kenmerk
subclass of: Restriction
  author of change: Marinus Vonhof
  date of change: 2017-05-20
  author at start life: Nic Roest (Idoro)
  date of start life: 2007-11-29
  on class: Infiltratieput
  on property: has as aspect (inverse)
  max qualified cardinality: 1
subclass of: Restriction
  author of change: Marinus Vonhof
  date of change: 2017-05-20
  author at start life: Nic Roest (Idoro)
  date of start life: 2007-11-29
  on class: Infiltratieriool
  on property: has as aspect (inverse)
  max qualified cardinality: 1
subclass of: Restriction
  author at start life: Marinus Vonhof
  date of start life: 2026-07-26
  on class: Inwinning
  on property: has as aspect
  max qualified cardinality: 1
subclass of: Restriction
  author at start life: Nic Roest (Idoro)
  date of start life: 2007-11-29
  on class: Infiltratiekoffer
  on property: has as aspect (inverse)
  max qualified cardinality: 1
subclass of: Restriction
  author at start life: Nic Roest (Idoro)
  date of start life: 2007-11-29
  on class: Infiltratiekolk
  on property: has as aspect (inverse)
  max qualified cardinality: 1
subclass of: Restriction
  on property: has as value
  all values from: decimal
subclass of: Restriction
  on class: DIT-riool
  on property: has as aspect (inverse)
  max qualified cardinality: 1
subclass of: Restriction
  on class: DT-riool
  on property: has as aspect (inverse)
  max qualified cardinality: 1

DT-riool
author of change: Marinus Vonhof
author of change: Johan Post
author of change: Eric van Gorkom
date of change: 2021-08-06
date of change: 2026-05-01
date of change: 2024-05-13
date of change: 2026-05-18
definition: Een rioolleiding met waterdoorlatende wanden bestemd voor de inzameling en transport van grondwater en eventueel ook hemelwater, waarbij grondwater via de wanden kan intreden
author at start life: Marinus Vonhof
date of start life: 2018-12-06
alternative label: Drainage transportriool
alternative label: Exfiltratieriool
scope note: Cof MDS
scope note: Cof HYD
type: Class
subclass of: Vrijverval rioolleiding
subclass of: Restriction
  author of change: Marinus Vonhof
  date of change: 2026-07-13
  author at start life: Marinus Vonhof
  date of start life: 2018-12-06
  on class: Omhulling
  on property: has as part
  max qualified cardinality: 1
subclass of: Restriction
  author at start life: Marinus Vonhof
  date of start life: 2020-04-18
  on class: Hemelwaterstelsel
  on property: has as part (inverse)
  max qualified cardinality: 1
subclass of: Restriction
  author at start life: Marinus Vonhof
  date of start life: 2024-08-01
  on property: heeft Functie
  has value: Inzameling van grondwater
subclass of: Restriction
  author at start life: Marinus Vonhof
  date of start life: 2024-08-01
  on property: heeft Functie
  has value: Inzameling van hemelwater
subclass of: Restriction
  author at start life: Marinus Vonhof
  date of start life: 2024-08-01
  on property: heeft Functie
  has value: Transport van grondwater
subclass of: Restriction
  author at start life: Marinus Vonhof
  date of start life: 2024-08-01
  on property: heeft Functie
  has value: Transport van hemelwater
subclass of: Restriction
  author at start life: Marinus Vonhof
  date of start life: 2026-07-24
  on class: Infiltratievoorziening
  on property: has as part (inverse)
  max qualified cardinality: 1
subclass of: Restriction
  on class: Doorlaatbaarheid
  on property: has as aspect
  max qualified cardinality: 1

Datacommunicatie
author of change: Marinus Vonhof
author of change: Johan Post
date of change: 2024-05-16
date of change: 2026-06-30
definition: Type communicatie tussen het OT-procesbesturings- en bewakingssysteem en het object, waarmee besturingssignalen, meetwaarden of statusinformatie worden uitgewisseld.
author at start life: Marinus Vonhof
date of start life: 2014-08-01
validity context: 6d 10d 11d 12d 13d
comment: Type verbinding met OT-systeem
comment: [is aspect]
scope note: Cof MDS
type: Class
subclass of: Kenmerk

WIBON thema (coll)
author of change: Marinus Vonhof
date of change: 2022-10-01
comment: [is coll]
scope note: Cof MDS
scope note: Cof DMO
type: Class
subclass of: Verzameling soorten
subclass of: Class
  one of: Riool onder druk (thema)
  one of: Riool vrijverval (thema)
  one of: Wees (thema)
  one of: Hoogspanning (thema)
  one of: Laagspanning (thema)
  one of: Middenspanning (thema)
  one of: Datatransport (thema)

Datum inwinning
author of change: Johan Post
date of change: 2022-09-29
author at start life: Marinus Vonhof
date of start life: 2015-10-29
units of measurements: yyyy-mm-dd
alternative label: Inwinningsdatum
comment: [is aspect]
scope note: Cof TOP
type: Class
subclass of: Datum
subclass of: Restriction
  date of change: 2019-04-25
  author at start life: Marinus Vonhof
  date of start life: 2015-10-29
  on class: Inwinning
  on property: has as aspect (inverse)
  max qualified cardinality: 1
subclass of: Restriction
  on property: has as value
  all values from: date

Datum maatregel
author of change: Marinus Vonhof
date of change: 2019-03-14
definition: De datum waarop de status van de maatregel (ontwerp, uitgevoerd) is ingegaan. Als de status ontbreekt de datum waarop de uitvoering van de maatregel is afgerond
author at start life: Marinus Vonhof
date of start life: 2013-03-26
units of measurements: yyyy-mm-dd
validity context: 6d 15d
comment: [is aspect]
scope note: Cof TOP
type: Class
subclass of: Datum
subclass of: Restriction
  author of change: Marinus Vonhof
  date of change: 2018-05-01
  author at start life: Marinus Vonhof
  date of start life: 2013-03-26
  validity context: *t
  on class: Maatregel
  on property: has as aspect (inverse)
  qualified cardinality: 1
subclass of: Restriction
  on property: has as value
  all values from: date

Deksel
label: Cover @en
author of change: Marinus Vonhof
author of change: Eric van Gorkom
author of change: Wouter van Riel
date of change: 2025-01-16
date of change: 2018-05-03
date of change: 2022-09-27
date of change: 2024-04-22
definition: [IMBOR] Een verwijderbare afdekking van een bepaald object.
notation: B
author at start life: Marinus Vonhof
date of start life: 2013-09-29
validity context: *f
comment: [cfk fout]
scope note: Cof MDS
scope note: Cof EN
scope note: Cof RRB
scope note: Cof REV
type: Class
subclass of: Afdekking
subclass of: Restriction
  author of change: Marinus Vonhof
  date of change: 2021-08-06
  author at start life: Marinus Vonhof
  date of start life: 2020-04-18
  on class: Kolk
  on property: has as part (inverse)
  qualified cardinality: 1
subclass of: Restriction
  author at start life: Johan Post
  date of start life: 2026-05-04
  on class: Spuikolk
  on property: has as part (inverse)
  max qualified cardinality: 1
subclass of: Restriction
  author at start life: Marinus Vonhof
  date of start life: 2013-09-29
  on class: Ontstoppingsstuk
  on property: has as part (inverse)
  qualified cardinality: 1
subclass of: Restriction
  author at start life: Marinus Vonhof
  date of start life: 2014-08-01
  on property: has as aspect
  some values from: Hoogte afdekking
subclass of: Restriction
  author at start life: Marinus Vonhof
  date of start life: 2014-11-16
  on property: has as aspect
  some values from: Lengte afdekking
subclass of: Restriction
  on property: heeft Functie
  has value: Afdekken
subclass of: Restriction
  on property: heeft Functie
  has value: Toegankelijk houden

Putdekselniveau
label: Cover level @en
author of change: Marinus Vonhof
date of change: 2017-05-17
definition: [EN13508-2+A1] Het niveau van de bovenkant van de putrand in meters boven het nationaal referentiepunt.
definition: [EN13508-2+A1] The level of the top of the frame of the cover in metres above to National datum. @en
notation: CAS
author at start life: Marinus Vonhof
date of start life: 2015-10-20
comment: Koppeling geometrie - topologie
alternative label: Putdekselhoogte
comment: [is aspect]
scope note: Cof MDS
scope note: Cof EN
scope note: Cof RRB
type: Class
subclass of: Hoogte t.o.v. NAP
subclass of: Restriction
  author of change: Marinus Vonhof
  date of change: 2015-10-20
  author at start life: Marinus Vonhof
  date of start life: 2013-07-19
  on class: Visueel inspecteren rioolput
  on property: has as output (inverse)
  max qualified cardinality: 1
subclass of: Restriction
  date of change: 2017-05-17
  author at start life: Marinus Vonhof
  date of start life: 2015-10-30
  comment: Koppeling geometrie - topologie
  on class: Inwinning
  on property: has as aspect
  max qualified cardinality: 1
subclass of: Restriction
  author at start life: Marinus Vonhof
  date of start life: 2018-12-12
  on class: Dekseloriëntatie
  on property: has as aspect (inverse)
  qualified cardinality: 1

Diameter
author of change: Marinus Vonhof
date of change: 2018-12-05
definition: De lengte van de koorde die het middelpunt van de cirkel snijdt
definition: Zowel een lijn (de koorde die het middelpunt van de cirkel snijdt) als de lengte van die lijn
author at start life: Nic Roest (Idoro)
date of start life: 2006-02-21
validity context: 15d
alternative label: Middellijn
comment: [is aspect]
scope note: Cof TOP
type: Class
subclass of: Afstand

Infiltratieput
author of change: Marinus Vonhof
author of change: Johan Post
date of change: 2024-05-01
date of change: 2021-10-01
date of change: 2026-07-13
date of change: 2026-07-24
definition: Een put met waterdoorlatende wanden bestemd voor de inzameling van hemelwater, waarbij het hemelwater door middel van infiltratie door de wanden kan worden afgevoerd
definition: [NEN 3300:1996] put waarin voorbezonken afvalwater via infiltratie in de bodem wordt gebracht
notation: ITP
author at start life: Marinus Vonhof
date of start life: 2014-05-01
comment: Bron afbeelding: Wavin
alternative label: IT-put
alternative label: Zakput
scope note: Cof MDS
scope note: Cof HYD
type: Class
subclass of: Put
subclass of: Restriction
  author at start life: Marinus Vonhof
  date of start life: 2026-07-13
  on class: Omhulling
  on property: has as part
  max qualified cardinality: 1
subclass of: Restriction
  author at start life: Marinus Vonhof
  date of start life: 2026-07-13
  on class: Substraat omstorting
  on property: has as part
  max qualified cardinality: 1
subclass of: Restriction
  author at start life: Marinus Vonhof
  date of start life: 2026-07-13
  validity context: *t
  on class: Substraat kern
  on property: has as part
  max qualified cardinality: 1
subclass of: Restriction
  author at start life: Marinus Vonhof
  date of start life: 2026-07-24
  on class: Infiltratievoorziening
  on property: has as part (inverse)
  max qualified cardinality: 1
subclass of: Restriction
  on property: heeft Functie
  has value: Afvoeren hemelwater naar de ondergrond
subclass of: Restriction
  on property: heeft Functie
  has value: Tijdelijke berging van hemelwater
subclass of: Restriction
  on property: heeft Uitvoering
  has value: Waterdoorlatende wanden
subclass of: Restriction
  on class: Niveau bovenkant filterdeel
  on property: has as aspect
  max qualified cardinality: 1
subclass of: Restriction
  on class: Niveau onderkant filterdeel
  on property: has as aspect
  max qualified cardinality: 1
subclass of: Restriction
  on class: Rooster
  on property: has as part
  max qualified cardinality: 1

Diameter opening
author at start life: Marinus Vonhof
date of start life: 2017-08-31
units of measurements: mm
comment: Intrinsiek aspect
comment: [is aspect]
scope note: Cof MDS
scope note: Cof HYD
type: Class
subclass of: Diameter
subclass of: Restriction
  author of change: Marinus Vonhof
  date of change: 2017-12-07
  author at start life: Marinus Vonhof
  date of start life: 2017-08-31
  on class: Doorlaat
  on property: has as aspect (inverse)
  max qualified cardinality: 1
subclass of: Restriction
  on property: has as value
  all values from: integer

Diameter put
author of change: Marinus Vonhof
author of change: Johan Post
date of change: 2021-08-06
date of change: 2026-05-01
definition: De inwendige diameter (horizontaal, uit het bovenaanzicht). Indien aanwezig de diameter van de onderbak. - zie afbeelding dc (bron EN13508-2)
author at start life: Marinus Vonhof
date of start life: 2013-10-01
units of measurements: mm
comment: Intrinsiek aspect
comment: In datasets kan voor de afmeting van ronde putten zowel de diameter, lengte of breedte als kenmerk worden gebruikt
comment: [is aspect]
scope note: Cof MDS
scope note: Cof HYD
scope note: Cof RGM
type: Class
subclass of: Diameter
subclass of: Restriction
  author of change: Marinus Vonhof
  date of change: 2015-08-24
  author at start life: Marinus Vonhof
  date of start life: 2013-10-01
  on class: Put
  on property: has as aspect (inverse)
  max qualified cardinality: 1
subclass of: Restriction
  on property: has as value
  all values from: Diameter put (datatype)

Dikte
author of change: Marinus Vonhof
date of change: 2015-05-29
definition: In de richting haaks op het vlak van een plat voorwerp, waarbij de meetpunten op de buitenkant liggen
author at start life: Nic Roest (Idoro)
date of start life: 2006-02-21
validity context: 15d
comment: [is aspect]
scope note: Cof TOP
type: Class
subclass of: Afstand

Doekomhulling
definition: Omhulling van een constructie met doek
author at start life: Marinus Vonhof
date of start life: 2026-07-16
scope note: Cof MDS
scope note: Cof HYD
type: Class
subclass of: Omhulling
subclass of: Restriction
  on property: heeft Uitvoering
  has value: Bekleding met doek

Onderscheidend kenmerk
author of change: Marinus Vonhof
date of change: 2021-01-09
definition: Een dicriminerend (onderscheidend) kenmerk
author at start life: Marinus Vonhof
date of start life: 2015-02-25
comment: [is aspect]
scope note: Cof TOP
type: Class
subclass of: Kenmerk

Maximale capaciteit doorlaat
author of change: Marinus Vonhof
author of change: Johan Post
date of change: 2025-01-16
date of change: 2022-11-25
definition: [IMBOR] Aanduiding van de van de bovengrens van het vermogen tot verwerken van water van opening.
author at start life: Marinus Vonhof
date of start life: 2011-12-15
units of measurements: m3/h
comment: [is aspect]
scope note: Cof MDS
scope note: Cof HYD
type: Class
subclass of: Capaciteit
subclass of: Restriction
  author of change: Marinus Vonhof
  date of change: 2017-09-06
  author at start life: Marinus Vonhof
  date of start life: 2011-12-15
  validity context: 5t 11t
  on class: Doorlaat
  on property: has as aspect (inverse)
  max qualified cardinality: 1
subclass of: Restriction
  on property: has as value
  all values from: Maximale capaciteit doorlaat (datatype)

Hoogte opening
author of change: Marinus Vonhof
date of change: 2015-02-28
author at start life: Marinus Vonhof
date of start life: 2011-12-15
units of measurements: mm
comment: Intrinsiek aspect
comment: [is aspect]
scope note: Cof MDS
scope note: Cof REV
scope note: Cof HYD
type: Class
subclass of: Hoogte
subclass of: Restriction
  author of change: Marinus Vonhof
  date of change: 2017-12-07
  author at start life: Marinus Vonhof
  date of start life: 2011-12-15
  on class: Doorlaat
  on property: has as aspect (inverse)
  max qualified cardinality: 1
subclass of: Restriction
  on property: has as value
  all values from: integer

Vorm opening
author of change: Eric van Gorkom
date of change: 2024-05-13
definition: A 2 48-49 Vst rond
author at start life: Marinus Vonhof
date of start life: 2011-12-15
comment: Intrinsiek aspect
comment: [is aspect]
scope note: Cof MDS
scope note: Cof REV
scope note: Cof HYD
type: Class
subclass of: Vorm
subclass of: Restriction
  author of change: Marinus Vonhof
  date of change: 2017-12-07
  author at start life: Marinus Vonhof
  date of start life: 2011-12-15
  validity context: 5t 11t
  on class: Doorlaat
  on property: has as aspect (inverse)
  max qualified cardinality: 1
subclass of: Restriction
  on property: has as reference (qualification)
  all values from: Vorm opening (coll)

Doorlaatniveau
author of change: Marinus Vonhof
date of change: 2019-08-12
definition: Niveau binnenonderkant doorlaatopening
author at start life: Marinus Vonhof
date of start life: 2017-12-07
units of measurements: m
comment: [is aspect]
scope note: Cof MDS
scope note: Cof REV
scope note: Cof HYD
type: Class
subclass of: Hoogte t.o.v. NAP
subclass of: Restriction
  author at start life: Marinus Vonhof
  date of start life: 2017-12-07
  validity context: 5t 11t
  on class: Doorlaat
  on property: has as aspect (inverse)
  max qualified cardinality: 1
subclass of: Restriction
  on property: has as value
  all values from: decimal

Infiltratieriool
author of change: Marinus Vonhof
author of change: Johan Post
date of change: 2024-05-01
date of change: 2026-07-13
definition: Een rioolleiding met waterdoorlatende wanden bestemd voor de inzameling en transport van hemelwater, waarbij het hemelwater door middel van infiltratie door de wanden kan worden afgevoerd. Kan ook beschouwd worden als een soort infiltratievoorziening.
notation: ITR
author at start life: Marinus Vonhof
date of start life: 2017-05-20
alternative label: IT-riool
alternative label: Infiltratieleiding
scope note: Cof MDS
scope note: Cof REV
scope note: Cof HYD
type: Class
subclass of: Vrijverval rioolleiding
subclass of: Restriction
  author of change: Marinus Vonhof
  date of change: 2026-07-13
  author at start life: Marinus Vonhof
  date of start life: 2018-12-06
  on class: Omhulling
  on property: has as part
  max qualified cardinality: 1
subclass of: Restriction
  author of change: Marinus Vonhof
  date of change: 2017-05-20
  author at start life: Nic Roest (Idoro)
  date of start life: 2007-11-29
  on class: Doorlaatbaarheid
  on property: has as aspect
  max qualified cardinality: 1
subclass of: Restriction
  author at start life: Marinus Vonhof
  date of start life: 2020-05-26
  on class: Hemelwaterstelsel
  on property: has as part (inverse)
  max qualified cardinality: 1
subclass of: Restriction
  author at start life: Marinus Vonhof
  date of start life: 2026-08-20
  on class: Infiltratievoorziening
  on property: has as part (inverse)
  max qualified cardinality: 1
subclass of: Restriction
  on property: heeft Functie
  has value: Afvoeren hemelwater naar de ondergrond
subclass of: Restriction
  on property: heeft Uitvoering
  has value: Waterdoorlatende wanden

Infiltratiekolk
author of change: Marinus Vonhof
author of change: Johan Post
date of change: 2021-08-06
date of change: 2024-05-01
date of change: 2026-07-13
definition: Een kolk met waterdoorlatende wanden bestemd voor de inzameling van hemelwater, waarbij het hemelwater door middel van infiltratie door de wanden kan worden afgevoerd. Kan ook beschouwd worden als een soort infiltratievoorziening.
notation: D
author at start life: Finy Teitsma (Oranjewoud)
date of start life: 2006-11-29
comment: ron afbeelding: Wavin
scope note: Cof MDS
scope note: Cof RRB
scope note: Cof LDR
scope note: Cof REV
type: Class
subclass of: Kolk
subclass of: Restriction
  author at start life: Marinus Vonhof
  date of start life: 2026-07-13
  on class: Omhulling
  on property: has as part
  max qualified cardinality: 1
subclass of: Restriction
  author at start life: Marinus Vonhof
  date of start life: 2026-07-13
  on class: Substraat omstorting
  on property: has as part
  max qualified cardinality: 1
subclass of: Restriction
  author at start life: Marinus Vonhof
  date of start life: 2026-07-13
  validity context: *t
  on class: Substraat kern
  on property: has as part
  max qualified cardinality: 1
subclass of: Restriction
  author at start life: Nic Roest (Idoro)
  date of start life: 2007-11-29
  on class: Porositeit
  on property: has as aspect
  max qualified cardinality: 1
subclass of: Restriction
  on property: heeft Functie
  has value: Afvoeren hemelwater naar de ondergrond
subclass of: Restriction
  on property: heeft Uitvoering
  has value: Waterdoorlatende wanden

Lining met een doorlopende buis
label: Lining with continuous pipes @en
author of change: Marinus Vonhof
date of change: 2025-01-16
definition: [IMBOR] Lining door middel van een geheel nieuwe buisleiding bestaande uit één stuk, die in een bestaande leiding wordt aangebracht.
notation: F
author at start life: Marinus Vonhof
date of start life: 2018-12-12
comment: Bron afbeelding: http://www.nstt.nl
scope note: Cof MDS
scope note: Cof LDR
scope note: Cof MTR
type: Class
subclass of: Lining
subclass of: Restriction
  on property: heeft Uitvoering
  has value: Buis uit één stuk

Doorspoelput
author of change: Johan Post
author of change: Wouter van Riel
date of change: 2021-10-01
date of change: 2022-12-19
date of change: 2024-04-22
definition: Een rioolput met voorziening voor het inlaten van oppervlaktewater voor de reiniging van een vrijverval rioolstelsel.
author at start life: Finy Teitsma (Oranjewoud)
date of start life: 2006-02-20
alternative label: Spoelput
scope note: Cof MDS
scope note: Cof RRB
scope note: Cof LDR
scope note: Cof HYD
type: Class
subclass of: Rioolput
subclass of: Restriction
  on property: heeft Functie
  has value: Toegang geven voor doorspoelen

Doorspuitput
author of change: Johan Post
date of change: 2024-05-01
date of change: 2026-05-18
definition: Een rioolput met voorziening voor het inbrengen van een spuitstuk voor de reiniging van de aangesloten leidingen.
author at start life: Wouter van Riel
date of start life: 2022-12-19
scope note: Cof MDS
type: Class
subclass of: Rioolput
subclass of: Restriction
  author at start life: Marinus Vonhof
  date of start life: 2023-01-13
  on class: Mechanisch rioolstelsel
  on property: has as part (inverse)
  max qualified cardinality: 1
subclass of: Restriction
  on property: heeft Functie
  has value: Toegang geven voor doorspoelen

Mechanisch rioolstelsel
author of change: Marinus Vonhof
author of change: Johan Post
date of change: 2026-05-01
date of change: 2014-04-29
date of change: 2026-05-18
definition: Een rioolstelsel waarbij het transport door middel van over- of onderdruk plaatsvindt.
author at start life: Finy Teitsma (Oranjewoud)
date of start life: 2006-11-29
validity context: *f
comment: [cfk fout]
scope note: Cof MDS
scope note: Cof RGM
scope note: Cof DMO
type: Class
subclass of: Rioolstelsel
subclass of: Restriction
  author of change: Marinus Vonhof
  date of change: 2018-05-03
  author at start life: Finy Teitsma (Oranjewoud)
  date of start life: 2007-10-23
  on class: Lozingspunt
  on property: has as part
  qualified cardinality: 1
subclass of: Restriction
  author at start life: Marinus Vonhof
  date of start life: 2023-01-13
  on class: Doorspuitput
  on property: has as part
  min qualified cardinality: 0
subclass of: Restriction
  on property: heeft Functie
  has value: Inzameling van vuilwater
subclass of: Restriction
  on property: heeft Technologie
  has value: Transport onder overdruk of onderdruk
subclass of: Restriction
  on property: heeft Functie
  has value: Transport van vuilwater
subclass of: Restriction
  on class: Perceelaansluiting
  on property: has as part
  min qualified cardinality: 1

Grindkoffer
author of change: Marinus Vonhof
author of change: Eric van Gorkom
date of change: 2025-01-16
date of change: 2026-07-13
date of change: 2024-05-13
definition: Een grindkoffer is (meestal) een kuil met worteldoek, gevuld met grind waar regenwater de tijd krijgt om langzaam in de bodem opgenomen te worden
author at start life: Marinus Vonhof
date of start life: 2018-12-05
alternative label: Grindkist
scope note: Cof MDS
type: Class
subclass of: Infiltratiekoffer
subclass of: Restriction
  on property: heeft Uitvoering
  has value: Gevuld met grind

Porositeit
label: Porosity @en
author of change: Marinus Vonhof
author of change: Johan Post
date of change: 2024-05-01
date of change: 2019-05-01
definition: De verhouding tussen de (grond)deeltjes en de open ruimten (de poriën)
author at start life: Finy Teitsma (Oranjewoud)
date of start life: 2007-10-25
validity context: 15d
comment: [is aspect]
scope note: Cof MDS
scope note: Cof RRB
scope note: Cof LDR
scope note: Cof HYD
type: Class
subclass of: Kenmerk
subclass of: Restriction
  author of change: Marinus Vonhof
  date of change: 2017-05-20
  author at start life: Nic Roest (Idoro)
  date of start life: 2007-11-29
  on class: Infiltratieput
  on property: has as aspect (inverse)
  max qualified cardinality: 1
subclass of: Restriction
  author at start life: Marinus Vonhof
  date of start life: 2026-07-26
  on class: Inwinning
  on property: has as aspect
  max qualified cardinality: 1
subclass of: Restriction
  author at start life: Nic Roest (Idoro)
  date of start life: 2007-11-29
  on class: Infiltratiekoffer
  on property: has as aspect (inverse)
  max qualified cardinality: 1
subclass of: Restriction
  author at start life: Nic Roest (Idoro)
  date of start life: 2007-11-29
  on class: Infiltratiekolk
  on property: has as aspect (inverse)
  max qualified cardinality: 1
subclass of: Restriction
  on property: has as value
  all values from: Porositeit (datatype)

Zandkoffer
author of change: Marinus Vonhof
date of change: 2025-01-16
date of change: 2026-07-13
definition: [IMBOR] Een constructie gevuld met zand waar regenwater de tijd krijgt om langzaam in de bodem opgenomen te worden.
author at start life: Marinus Vonhof
date of start life: 2019-07-10
scope note: Cof MDS
type: Class
subclass of: Infiltratiekoffer
subclass of: Restriction
  on property: heeft Uitvoering
  has value: Gevuld met zand

Drainaansluitleiding
definition: Een aansluitleiding met doorlatende wanden bestemd voor het op peil houden van het grondwater
author at start life: Johan Post
date of start life: 2024-05-01
alternative label: Drainage-aansluitleiding
scope note: Cof MDS
scope note: Cof LDR
type: Class
subclass of: Aansluitleiding
subclass of: Restriction
  on property: heeft Functie
  has value: Aanvoer van grondwater
subclass of: Restriction
  on class: Aansluiting
  on property: has as part (inverse)
  qualified cardinality: 1

Substraat kern
definition: De inwendige vulling van de constructie
author at start life: Marinus Vonhof
date of start life: 2026-08-05
scope note: Cof MDS
scope note: Cof HYD
type: Class
subclass of: Substraat
subclass of: Restriction
  on property: heeft Toepassing
  has value: Vulling van de constructie
subclass of: Restriction
  validity context: *t
  on class: Infiltratiekoffer
  on property: has as part (inverse)
  max qualified cardinality: 1
subclass of: Restriction
  validity context: *t
  on class: Infiltratiekolk
  on property: has as part (inverse)
  max qualified cardinality: 1
subclass of: Restriction
  validity context: *t
  on class: Infiltratieput
  on property: has as part (inverse)
  max qualified cardinality: 1

Inspectieput
label: Manhole @en
author of change: Wouter van Riel
date of change: 2024-04-22
definition: Een rioolput die voor mens of apparatuur vanaf het maaiveld toegang biedt tot de aangesloten rioolleidingen.
definition: [EN 16323:2014] structure with a removable cover, constructed on a drain or sewer to permit entry by personnel @en
definition: [NEN-EN 752:2008] (Ongeldig) put met een afneembaar deksel, gekoppeld aan een aansluitleiding of riool waarmee reinigings- en inspectieapparatuur vanaf de oppervlakte kan worden ingebracht, maar die geen toegang biedt voor personeel
notation: INS
author at start life: Finy Teitsma (Oranjewoud)
date of start life: 2006-05-23
see also: [IMGeo:1.0/2007] Put die toegang geeft tot een (riool)leiding.
see also: [IRIS-RIOKEN:2012] Constructie toeganggevend tot het rioolstelsel.
alternative label: Controleput
scope note: Cof MDS
scope note: Cof RRB
scope note: Cof LDR
scope note: Cof REV
scope note: Cof HYD
type: Class
subclass of: Rioolput
subclass of: Restriction
  author of change: Marinus Vonhof
  date of change: 2019-05-15
  author at start life: Finy Teitsma (Oranjewoud)
  date of start life: 2006-07-12
  on class: Inlaat rioolput
  on property: has as part
  min qualified cardinality: 0
subclass of: Restriction
  author of change: Marinus Vonhof
  date of change: 2015-04-21
  author at start life: Marinus Vonhof
  date of start life: 2014-12-02
  on class: Vrijverval transportstelsel
  on property: has as part (inverse)
  qualified cardinality: 1
subclass of: Restriction
  author at start life: Marinus Vonhof
  date of start life: 2026-07-24
  on class: Infiltratievoorziening
  on property: has as part (inverse)
  max qualified cardinality: 1
subclass of: Restriction
  on property: heeft Functie
  has value: Beluchten of ventileren
subclass of: Restriction
  on property: heeft Functie
  has value: Inzameling van afvalwater
subclass of: Restriction
  on property: heeft Functie
  has value: Toegang geven tot het rioolstelsel
subclass of: Restriction
  on property: heeft Functie
  has value: Toegang verschaffen
subclass of: Restriction
  on property: heeft Uitvoering
  has value: Toegankelijk voor inspectie- en reinigingsapparatuur
subclass of: Restriction
  on property: heeft Uitvoering
  has value: Verwijderbaar deksel

Lozingsput
author of change: Marinus Vonhof
date of change: 2016-04-15
definition: Een put waarop een rioolleiding is aangesloten waarmee het afvalwater het rioolstelsel verlaat naar, of ontvangt uit, een ander rioolstelsel
author at start life: Nic Roest (Idoro)
date of start life: 2006-03-23
alternative label: Ontvangstput
scope note: Cof MDS
scope note: Cof REV
scope note: Cof HYD
type: Class
subclass of: Rioolput
subclass of: Restriction
  on property: heeft Uitvoering
  has value: Naar ander rioolstelsel
subclass of: Restriction
  on property: heeft Functie
  has value: Overtollig afvalwater laten wegstromen

Verzameldrain
definition: Een leiding met ondoorlatende wand die het door drains aangevoerde water verzamelt en transporteert, zonder zelf water uit de omliggende bodem op te nemen.
author at start life: Johan Post
date of start life: 2026-05-19
type: Class
subclass of: Vrijverval rioolleiding
subclass of: Restriction
  on property: heeft Functie
  has value: Transport van grondwater

Drempelbreedte
definition: De ontwikkelde lengte van de overlaat, waarover het afvalwater overstort, gemeten haaks op de stroomrichting
definition: [NEN 3300:1996] Overstortbreedte is synoniem van drempelbreedte
definition: [NEN 3300:1996] de ontwikkelde lengte van de overlaat waarover het water overstort, gemeten haaks op de stroomrichting
author at start life: Marinus Vonhof
date of start life: 2017-05-17
units of measurements: mm
alternative label: Overstortbreedte
comment: [is aspect]
scope note: Cof MDS
scope note: Cof REV
scope note: Cof HYD
type: Class
subclass of: Breedte
subclass of: Restriction
  author at start life: Marinus Vonhof
  date of start life: 2019-03-20
  validity context: 5t 11t
  on class: Stuwmuur
  on property: has as aspect (inverse)
  max qualified cardinality: 1
subclass of: Restriction
  author at start life: Marinus Vonhof
  date of start life: 2024-05-16
  on class: Inwinning
  on property: has as aspect
  max qualified cardinality: 1
subclass of: Restriction
  on property: has as value
  all values from: integer

Drempelniveau
definition: De hoogte van de drempel
definition: [NEN 3300:1996] Drempelhoogte is synoniem van drempelniveau
definition: [NEN 3300:1996] de hoogte van de bovenkant van de drempel ten opzichte van een referentiepeil
author at start life: Marinus Vonhof
date of start life: 2016-04-24
units of measurements: m
alternative label: Drempelhoogte
alternative label: Drempelpeil
comment: [is aspect]
scope note: Cof MDS
scope note: Cof REV
scope note: Cof HYD
type: Class
subclass of: Hoogte t.o.v. NAP
subclass of: Restriction
  author at start life: Marinus Vonhof
  date of start life: 2015-10-30
  on class: Inwinning
  on property: has as aspect
  max qualified cardinality: 1
subclass of: Restriction
  author at start life: Marinus Vonhof
  date of start life: 2019-03-20
  on class: Stuwmuur
  on property: has as aspect (inverse)
  qualified cardinality: 1
subclass of: Restriction
  on property: has as value
  all values from: decimal

Mechanische rioolleiding
author of change: Marinus Vonhof
author of change: Johan Post
author of change: Wouter van Riel
date of change: 2016-08-26
date of change: 2024-04-23
date of change: 2024-05-04
date of change: 2026-05-19
definition: Een gesloten rioolleiding waarin het afvalwater door middel van onder-/overdruk wordt getransporteerd.
author at start life: Marinus Vonhof
author at start life: Finy Teitsma (Oranjewoud)
date of start life: 2006-02-20
validity context: *f 11d 12d 13d
see also: [IMKL:1.1/2008] Riolering waarbij het transport plaatsvindt door overdruk (uit NEN 3300, Buitenriolering).
comment: [cfk fout]
scope note: Cof TOP
type: Class
subclass of: Rioolleiding
subclass of: Restriction
  on property: heeft Structuur
  has value: Gesloten
subclass of: Restriction
  on property: heeft Technologie
  has value: Transport onder overdruk of onderdruk

Duiker
author of change: Marinus Vonhof
date of change: 2017-05-31
definition: Een leiding die oppervlaktewater-elementen verbindt
author at start life: Marinus Vonhof
date of start life: 2012-04-29
see also: [IHW:20130706] Een kokervormige constructie met als doel de wederzijdse verbinding tussen oppervlaktewater te waarborgen
see also: [IMGeo:1.0/2007] Kunstmatige doorstroomopening onder een rivier; kanaal weg enz., die een functie vervult in de waterhuishouding.
scope note: Cof MDS
scope note: Cof REV
type: Class
subclass of: Leiding
subclass of: Restriction
  on property: heeft Functie
  has value: Verbinding tussen oppervlaktewater

Duikerput
author of change: Johan Post
date of change: 2026-05-11
definition: Put welke toegang geeft naar een duiker.
author at start life: Johan Post
date of start life: 2024-05-01
scope note: Cof MDS
type: Class
subclass of: Put
subclass of: Restriction
  on property: heeft Functie
  has value: Duikers aansluiten

Verbeterde overstortput
definition: [NEN 3300:1996] een overstortput waarbij duikschotten en een langere drempel zijn toegepast en de inhoud van de put voor de drempel is vergroot met het doel de vuiluitworp te beperken
author at start life: Marinus Vonhof
date of start life: 2012-04-29
scope note: Cof MDS
scope note: Cof HYD
scope note: Cof DMO
type: Class
subclass of: Externe overstortput
subclass of: Restriction
  on property: heeft Uitvoering
  has value: Langere drempel
subclass of: Restriction
  on property: heeft Uitvoering
  has value: Vergrote inhoud voor de drempel
subclass of: Restriction
  on property: heeft Doel
  has value: Verminderen vuilbelasting van oppervlaktewater

DWA perceelaansluitleiding
author of change: Marinus Vonhof
author of change: Johan Post
date of change: 2026-05-01
date of change: 2016-04-25
date of change: 2026-05-18
definition: Transport van vuilwater vanaf het perceel
author at start life: Marinus Vonhof
date of start life: 2013-02-05
alternative label: Vuilwaterperceelaansluitleiding
scope note: Cof MDS
type: Class
subclass of: Perceelaansluitleiding
subclass of: Restriction
  on property: heeft Functie
  has value: Aanvoer van vuilwater

Edge
author of change: Marinus Vonhof
date of change: 2020-11-24
definition: Wiskundige term (engels) voor zijde, kant, boog, tak
author at start life: Marinus Vonhof
date of start life: 2011-12-15
alternative label: Zijde
scope note: Cof TOP
type: Class
subclass of: Topologisch element

Topologisch element
author of change: Marinus Vonhof
date of change: 2025-01-16
date of change: 2016-11-09
definition: [Gellish] Is a configuration that indicates how items are connected or positioned relative to each other. The topology in terms of connections usually doesn't change when the positions of the items change. @en
definition: [IMBOR] Een configuratie waarin vastgelegd wordt hoe objecten verbonden zijn of hoe ze relatief tot elkaar gepositioneerd zijn.
author at start life: Marinus Vonhof
date of start life: 2013-10-04
validity context: *f 15d
comment: [cfk fout]
scope note: Cof TOP
type: Class

Einddatum
author of change: Marinus Vonhof
author of change: Johan Post
date of change: 2015-05-29
date of change: 2023-01-10
date of change: 2026-05-13
definition: Datum waarop een object functioneel geen onderdeel meer vormt van het systeem, doordat het niet langer een rol vervult in het functioneren, beheren of gebruiken van dat systeem. Dit is niet per definitie de datum van fysieke verwijdering of sloop
author at start life: Marinus Vonhof
date of start life: 2011-12-15
units of measurements: yyyy-mm-dd
validity context: 6d 15d 16d
comment: [is aspect]
scope note: Cof TOP
type: Class
subclass of: Datum
subclass of: Restriction
  author at start life: Marinus Vonhof
  date of start life: 2013-09-28
  on class: Fysiek object
  on property: has as aspect (inverse)
  max qualified cardinality: 1
subclass of: Restriction
  on property: has as value
  all values from: date

Eindknooppunt
definition: [EN13508-2+A1] The node reference of the second node as specified by the employing authority. @en
definition: Het knooppunt dat koppelt aan het (topologische) eindpunt van een leiding.
author at start life: Marinus Vonhof
date of start life: 2026-07-17
alternative label: Eindknoop
scope note: Cof TOP
type: Class
subclass of: Extra objecttype (rol)

Hoogte kast
author of change: Nic Roest (Idoro)
date of change: 2006-11-23
definition: De uitwendige hoogte van een elektriciteitskast
author at start life: Nic Roest (Idoro)
date of start life: 2006-02-21
units of measurements: mm
comment: Intrinsiek aspect
comment: [is aspect]
scope note: Cof MDS
type: Class
subclass of: Hoogte
subclass of: Restriction
  on property: has as value
  all values from: integer

Lengte kast
author at start life: Marinus Vonhof
date of start life: 2013-12-05
units of measurements: mm
comment: [is aspect]
scope note: Cof MDS
scope note: Cof RGM
type: Class
subclass of: Lengte
subclass of: Restriction
  on property: has as value
  all values from: integer

Explosievrije kolk
author of change: Marinus Vonhof
date of change: 2025-01-16
definition: [IMBOR] Een explosievrije of explosieveilige kolk kan worden uitgevoerd als straatkolk voor in het wegdek bij bijvoorbeeld tankstations. Het rooster komt gelijk te liggen met het wegdek en kan worden geopend om de kolk leeg te zuigen of om het leidingwerk of kolk te controleren.
author at start life: Marinus Vonhof
date of start life: 2021-08-06
scope note: Cof MDS
scope note: Cof RRB
scope note: Cof LDR
scope note: Cof REV
type: Class
subclass of: Kolk
subclass of: Restriction
  on property: heeft Functie
  has value: Voorkomen van explosie

Externe overstortconstructie
author of change: Marinus Vonhof
date of change: 2015-09-01
definition: Een overstortconstructie waarbij het overtollig afvalwater uit een rioolstelsel kan stromen.
author at start life: Marinus Vonhof
date of start life: 2015-05-29
scope note: Cof MDS
scope note: Cof HYD
type: Class
subclass of: Overstortconstructie
subclass of: Restriction
  on property: heeft Functie
  has value: Lozen buiten het stelsel

Externe overstortput
author of change: Finy Teitsma (Oranjewoud)
date of change: 2007-11-12
definition: Een overstortput waarbij overtollig afvalwater uit een rioolstelsel kan stromen.
definition: [NEN 3300:1996] rioolput voorzien van een overstortdrempel die loost buiten het in beschouwing genomen rioolstelsel, meestal op oppervlaktewater
definition: [NEN-EN 752:2008] voorziening in een gemengd systeem waarmee overtollig afvalwater wordt afgevoerd [EN 1085:2007, definitie 2130]
author at start life: Finy Teitsma (Oranjewoud)
date of start life: 2006-05-23
alternative label: Externe overstort
scope note: Cof MDS
scope note: Cof REV
scope note: Cof HYD
scope note: Cof DMO
type: Class
subclass of: Overstortput
subclass of: Restriction
  on property: heeft Functie
  has value: Lozen buiten het stelsel

Rioolafsluiter
author of change: Marinus Vonhof
date of change: 2020-04-17
date of change: 2026-07-14
definition: Een statische constructie waarmee de doorstroomopening van een rioolleiding geheel of gedeeltelijk wordt afgesloten. Bij gedeeltelijke afsluiting (bijvoorbeeld als vloeistof via een uitsparing kan doorstromen) als deel een Opening In Wand toevoegen.
author at start life: Finy Teitsma (Oranjewoud)
date of start life: 2007-10-23
scope note: Cof MDS
scope note: Cof HYD
type: Class
subclass of: Wand
subclass of: Restriction
  author of change: Marinus Vonhof
  date of change: 2024-05-16
  date of change: 2020-04-17
  author at start life: Finy Teitsma (Oranjewoud)
  date of start life: 2006-05-23
  on class: Rioolleiding
  on property: has as part (inverse)
  max qualified cardinality: 1
subclass of: Restriction
  author of change: Marinus Vonhof
  date of change: 2020-04-17
  author at start life: Marinus Vonhof
  date of start life: 2013-02-05
  on class: Rioolput
  on property: has as part (inverse)
  max qualified cardinality: 1
subclass of: Restriction
  author at start life: Marinus Vonhof
  date of start life: 2024-05-16
  on class: Transportleiding
  on property: has as part (inverse)
  max qualified cardinality: 1
subclass of: Restriction
  on property: heeft Functie
  has value: Afsluiten van leidingen

Hulpstukoriëntatie
author of change: Marinus Vonhof
author of change: Johan Post
date of change: 2018-12-05
date of change: 2024-07-30
definition: Een topologisch element dat het zwaartepunt (vertex) van de bovenkant hulpstukbodem beschrijft
author at start life: Marinus Vonhof
date of start life: 2017-12-12
scope note: Cof MDS
scope note: Cof PLI
scope note: Cof HYD
type: Class
subclass of: Knooppunt
subclass of: Restriction
  author of change: Marinus Vonhof
  date of change: 2017-12-13
  author at start life: Marinus Vonhof
  date of start life: 2013-03-29
  validity context: 5t 11t
  on class: Hulpstuk
  on property: has as aspect (inverse)
  max qualified cardinality: 1
subclass of: Restriction
  author at start life: Marinus Vonhof
  date of start life: 2017-05-30
  comment: Koppeling geometrie - topologie
  on class: Maaiveldoriëntatie
  on property: is connected to
  max qualified cardinality: 1
subclass of: Restriction
  on class: Lijn
  on property: has as aspect
  max qualified cardinality: 1

Gegevenswoordenboek Stedelijk Water
author of change: Marinus Vonhof
date of change: 2024-05-16
date of change: 2024-07-31
date of change: 2021-12-29
date of change: 2021-09-20
date of change: 2021-10-02
date of change: 2025-11-18
date of change: 2026-08-25
definition: Een datamodel (ontologie, kennismodel) voor het vakgebied Stedelijk Water, het bevat modellen voor systemen en processen binnen het vakgebied. Belangrijke onderdelen ervan zijn modellen van constructies (systemen, stelsels, bouwwerken, leidingen, putten) en modellen van activiteiten (plannen, projecten, maatregelen). Het datamodel is onderdeel van het Semantisch Web, de datastructuur is gebaseerd op de linked-data-taal RDF/RDFS/OWL.
author at start life: Marinus Vonhof
date of start life: 2011-11-11
validity context: 6d
comment: URI gewijzigd (was GWSW_Datamodel) (20251118)
comment: Vigerend: GWSW versie 1.7.0 (25-08-2026)
alternative label: GWSW
scope note: Cof TOP
type: Class
subclass of: Informatiedrager
subclass of: Restriction
  author at start life: Marinus Vonhof
  date of start life: 2026-07-24
  on class: GWSW.orox
  on property: has as part
  qualified cardinality: 1

GWSW.orox
definition: Het uitwisselprotocol voor toepassingen van het GWSW. Het protocol beschrijft met de linked-data-taal RDF/RDFS/OWL de inhoud van het GWSW Datamodel en de GWSW Datasets (de gemeentelijke gegevens). In alle gevallen wordt het zogenaamde Turtle-formaat voor de uitwisselbestanden gebruikt, maar in principe is elk RDF-formaat bruikbaar. De door gemeenten gebruikte beheersystemen kunnen in de meeste gevallen gegevens exporteren conform GWSW OroX.
author at start life: Marinus Vonhof
date of start life: 2026-07-24
alternative label: GWSW OroX
scope note: Cof TOP
type: Class
subclass of: Informatiedrager
subclass of: Restriction
  author at start life: Marinus Vonhof
  date of start life: 2026-07-24
  on class: Gegevenswoordenboek Stedelijk Water
  on property: has as part (inverse)
  qualified cardinality: 1

Perceelaansluiting
author of change: Johan Post
date of change: 2026-05-01
definition: De aansluiting van een perceel op een rioolstelsel
definition: [Omgevingswet] De buis waarmee een gebouw is (of wordt) aangesloten op de riolering
author at start life: Marinus Vonhof
date of start life: 2018-12-05
see also: [IMKL:1.1/2008] (Ongeldig) De leiding die een leiding verbindt met een aansluitpunt.
alternative label: Huisaansluiting
scope note: Cof MDS
type: Class
subclass of: Aansluiting
subclass of: Restriction
  author of change: Marinus Vonhof
  date of change: 2016-04-25
  author at start life: Finy Teitsma (Oranjewoud)
  date of start life: 2007-11-30
  on class: Perceelaansluitleiding
  on property: has as part
  min qualified cardinality: 1
subclass of: Restriction
  author at start life: Johan Post
  date of start life: 2026-05-04
  on class: Spuikolk
  on property: has as part
  min qualified cardinality: 0
subclass of: Restriction
  on property: heeft Functie
  has value: Aanvoer van afvalwater vanaf een perceel
subclass of: Restriction
  on property: heeft Doel
  has value: Perceel aansluiten op rioolstelsel

Gecombineerde straat-trottoirkolk
author of change: Marinus Vonhof
date of change: 2021-08-06
definition: Een kolk met de inlaat aan de boven- en voorzijde bestemd om te worden aangebracht zowel gedeeltelijk in het vlak van de wegverharding als gedeeltelijk in de vlakken van de aansluitende trottoirbanden die in het zicht blijven.
notation: C
author at start life: Finy Teitsma (Oranjewoud)
date of start life: 2006-11-29
alternative label: Combikolk
alternative label: Gemengde kolk
scope note: Cof MDS
scope note: Cof RRB
scope note: Cof LDR
scope note: Cof REV
type: Class
subclass of: Kolk
subclass of: Restriction
  on property: heeft Functie
  has value: Afvoer naar kolkaansluitleiding
subclass of: Restriction
  on property: heeft Uitvoering
  has value: Met de inlaat aan de boven- en voorzijde

Gemaal droge opstelling
author of change: Marinus Vonhof
date of change: 2017-05-31
definition: Een gemaal waarbij de pompen zich buiten de ontvangput/kelder bevinden.
definition: [NEN 3300:1996] Gemaal ten minste bestaande uit een ontvangkelder en een pompenkelder. De pompen zijn buiten de ontvangkelder opgesteld
author at start life: Finy Teitsma (Oranjewoud)
date of start life: 2006-05-23
comment: 20151014: NEN3300-definitie aangepast
alternative label: Gemaal met droge pompopstelling
scope note: Cof MDS
scope note: Cof HYD
scope note: Cof RGM
scope note: Cof DMO
type: Class
subclass of: Rioolgemaal
subclass of: Restriction
  on property: heeft Uitvoering
  has value: Opstelling pomp(en) buiten de ontvangput/kelder

Gemaal natte opstelling
author of change: Marinus Vonhof
date of change: 2019-05-15
definition: Een gemaal waarbij de pompen zich in de ontvangput/kelder bevinden.
definition: [NEN 3300:1996] gemaal waarbij de pomp in de ontvangkelder van het gemaal is opgesteld
author at start life: Finy Teitsma (Oranjewoud)
date of start life: 2006-05-23
alternative label: Gemaal met natte pompopstelling
scope note: Cof MDS
scope note: Cof HYD
scope note: Cof RGM
scope note: Cof DMO
type: Class
subclass of: Rioolgemaal
subclass of: Restriction
  on property: heeft Uitvoering
  has value: Opstelling pomp(en) in de ontvangput/kelder

Vuilwaterstelsel
author of change: Johan Post
author of change: Eric van Gorkom
date of change: 2021-10-01
date of change: 2024-05-13
definition: Een vrijverval rioolstelsel bestemd voor de inzameling, het transport en de tijdelijke berging van vuilwater.
definition: [NEN 3300:1996] Dwa-rioolstelsel is synoniem van vuilwaterstelsel
definition: [NEN 3300:1996] rioolstelsel voor de inzameling en het transport van huishoudelijk- en bedrijfsafvalwater, niet zijnde neerslag
author at start life: Finy Teitsma (Oranjewoud)
date of start life: 2007-10-23
alternative label: DWA stelsel
alternative label: Dwa-rioolstelsel
alternative label: Vuilwaterrioolstelsel
scope note: Cof TOP
type: Class
subclass of: Vrijverval rioolstelsel
subclass of: Restriction
  author at start life: Marinus Vonhof
  date of start life: 2015-03-01
  validity context: 5t 11t
  on class: Lozingspunt
  on property: has as part
  min qualified cardinality: 1
subclass of: Restriction
  author at start life: Marinus Vonhof
  date of start life: 2020-05-26
  on class: Rioolgemaal
  on property: has as part
  min qualified cardinality: 0
subclass of: Restriction
  author at start life: Marinus Vonhof
  date of start life: 2020-05-26
  on class: Vuilwaterriool
  on property: has as part
  min qualified cardinality: 1
subclass of: Restriction
  on class: Vrijverval rioolleiding
  on property: has as part
  min qualified cardinality: 0
subclass of: Restriction
  on property: heeft Functie
  has value: Inzameling van vuilwater
subclass of: Restriction
  on property: heeft Functie
  has value: Tijdelijke berging van vuilwater
subclass of: Restriction
  on property: heeft Functie
  has value: Transport van vuilwater

Gemengde perceelaansluitleiding
author of change: Marinus Vonhof
date of change: 2026-05-01
date of change: 2016-04-25
definition: Transport van afvalwater vanaf het perceel
author at start life: Marinus Vonhof
date of start life: 2013-02-05
scope note: Cof MDS
type: Class
subclass of: Perceelaansluitleiding
subclass of: Restriction
  on property: heeft Functie
  has value: Aanvoer van hemelwater en vuilwater

Geometrie
author of change: Marinus Vonhof
date of change: 2025-01-16
date of change: 2017-11-16
definition: [Gellish] Is a scale that is a measurement of spatial aspects. (This may otherwise be called geometry)
definition: [IMBOR] Een kenmerk waarmee de locatie van een object wordt vastgelegd.
author at start life: Marinus Vonhof
date of start life: 2016-10-14
units of measurements: gml
validity context: 15d
comment: [is aspect]
scope note: Cof TOP
type: Class
subclass of: Kenmerk
subclass of: Restriction
  author at start life: Marinus Vonhof
  date of start life: 2016-11-09
  on class: Inwinning
  on property: has as aspect
  max qualified cardinality: 1
subclass of: Restriction
  on property: has as value
  all values from: gmlLiteral

Status maatregel (coll)
validity context: 6d
comment: [is coll]
scope note: Cof MDS
scope note: Cof MTR
type: Class
subclass of: Verzameling soorten
subclass of: Class
  one of: Uitgevoerd
  one of: Gepland
  one of: In uitvoering
  one of: In voorbereiding
  one of: Vervallen

Gesegmenteerde lining
label: Segmental linings @en
author of change: Marinus Vonhof
date of change: 2025-01-16
definition: [IMBOR] Nieuwe bekleding of een geheel nieuwe leiding die in een bestaande leiding wordt aangebracht bestaande uit meerdere segmenten die afzonderlijk worden aangebracht.
notation: D
author at start life: Marinus Vonhof
date of start life: 2018-12-12
comment: Bron afbeelding: www.unitracc.com
scope note: Cof MDS
scope note: Cof LDR
scope note: Cof MTR
type: Class
subclass of: Lining
subclass of: Restriction
  on property: heeft Uitvoering
  has value: Afzonderlijk aangebrachte segmenten

Opgespoten lining
label: Sprayed lining @en
author of change: Marinus Vonhof
date of change: 2025-01-16
definition: [IMBOR] Nieuwe bekleding die in een bestaande leiding wordt aangebracht door middel van het spuiten van het materiaal van de lining tegen de wanden van de bestaande leiding.
notation: B
author at start life: Marinus Vonhof
date of start life: 2018-12-12
comment: Bron afbeelding: www.spray-liner.eu
scope note: Cof MDS
scope note: Cof LDR
scope note: Cof MTR
type: Class
subclass of: Lining
subclass of: Restriction
  on property: heeft Uitvoering
  has value: Gespoten op binnenwand

Uitlaat (punt)
author of change: Marinus Vonhof
author of change: Johan Post
date of change: 2026-05-21
date of change: 2020-04-18
definition: Het punt waar uitstroming van water uit een uiteinde-opening van een leiding naar het oppervlaktewater mogelijk is, zonder dat sprake is van een civieltechnisch bouwwerk of vormgegeven uitstroomconstructie.
author at start life: Nic Roest (Idoro)
date of start life: 2006-03-23
alternative label: Modelrand
alternative label: Uitmonding
scope note: Cof MDS
scope note: Cof HYD
type: Class
subclass of: Aansluitpunt
subclass of: Restriction
  author at start life: Marinus Vonhof
  date of start life: 2016-04-24
  validity context: 5t 11t
  on class: Uitlaatconstructie
  on property: has as aspect (inverse)
  max qualified cardinality: 1

Hondenhokput
author of change: Johan Post
date of change: 2026-05-01
definition: Een put die over een bestaande leiding heen is gebouwd, waarna de buis binnenin de put is verbroken
author at start life: Marinus Vonhof
date of start life: 2018-12-05
alternative label: Hondenhok
scope note: Cof MDS
scope note: Cof HYD
type: Class
subclass of: Inspectieput
subclass of: Restriction
  on property: heeft Technologie
  has value: Over bestaande leiding gebouwd

Hoogte
author of change: Marinus Vonhof
date of change: 2015-05-29
definition: In de richting haaks op het horizontale vlak
author at start life: Nic Roest (Idoro)
date of start life: 2006-02-21
units of measurements: mm
validity context: 15d
comment: [is aspect]
scope note: Cof TOP
type: Class
subclass of: Afstand
subclass of: Restriction
  on property: has as value
  all values from: integer

Hoogte put
author of change: Marinus Vonhof
author of change: Eric van Gorkom
date of change: 2021-08-06
date of change: 2024-05-13
definition: De inwendige hoogte (verticaal, vanuit het zijaanzicht). De afstand van binnenonderkant tot binnenbovenkant putconstructie (inclusief onderbak) - zie afbeelding C+F (bron EN13508-2)
author at start life: Marinus Vonhof
date of start life: 2014-08-01
units of measurements: mm
comment: Intrinsiek aspect
comment: [is aspect]
scope note: Cof TOP
type: Class
subclass of: Hoogte
subclass of: Restriction
  author of change: Marinus Vonhof
  date of change: 2014-08-01
  author at start life: Finy Teitsma (Oranjewoud)
  date of start life: 2006-02-25
  validity context: 5t 11t
  on class: Put
  on property: has as aspect (inverse)
  max qualified cardinality: 1
subclass of: Restriction
  on property: has as value
  all values from: Hoogte put (datatype)

HWA perceelaansluitleiding
author of change: Marinus Vonhof
author of change: Johan Post
date of change: 2026-05-01
date of change: 2016-04-25
definition: Transport van hemelwater vanaf het perceel
author at start life: Marinus Vonhof
date of start life: 2013-02-05
scope note: Cof MDS
type: Class
subclass of: Perceelaansluitleiding
subclass of: Restriction
  on property: heeft Functie
  has value: Aanvoer van hemelwater

Lengte put
author of change: Marinus Vonhof
author of change: Johan Post
date of change: 2021-08-06
date of change: 2026-05-01
definition: De inwendige lengte (horizontaal, uit het bovenaanzicht). Indien aanwezig de lengte van de onderbak - zie afbeelding dc (bron EN13508-2)
author at start life: Marinus Vonhof
date of start life: 2016-08-05
units of measurements: mm
validity context: 15d
comment: Intrinsiek aspect
comment: [is aspect]
scope note: Cof TOP
type: Class
subclass of: Lengte
subclass of: Restriction
  author of change: Marinus Vonhof
  date of change: 2014-08-01
  author at start life: Finy Teitsma (Oranjewoud)
  date of start life: 2006-02-25
  validity context: *t
  on class: Put
  on property: has as aspect (inverse)
  qualified cardinality: 1
subclass of: Restriction
  on property: has as value
  all values from: Lengte put (datatype)

Lengte leiding
author of change: Marinus Vonhof
date of change: 2015-05-29
author at start life: Nic Roest (Idoro)
date of start life: 2006-02-21
units of measurements: m
comment: Intrinsiek aspect
comment: [is aspect]
scope note: Cof TOP
type: Class
subclass of: Lengte
subclass of: Restriction
  author of change: Marinus Vonhof
  date of change: 2015-08-24
  author at start life: Finy Teitsma (Oranjewoud)
  date of start life: 2006-02-25
  validity context: *t
  on class: Leiding
  on property: has as aspect (inverse)
  qualified cardinality: 1
subclass of: Restriction
  date of change: 2015-11-03
  author at start life: Marinus Vonhof
  date of start life: 2013-03-29
  on class: Inwinning
  on property: has as aspect
  max qualified cardinality: 1
subclass of: Restriction
  on property: has as value
  all values from: Lengte leiding (datatype)

Maaiveldhoogte
author of change: Marinus Vonhof
date of change: 2015-11-07
definition: Het niveau van het maaiveld
author at start life: Marinus Vonhof
date of start life: 2012-04-22
units of measurements: m
comment: [is aspect]
scope note: Cof TOP
type: Class
subclass of: Hoogte t.o.v. NAP
subclass of: Restriction
  author of change: Marinus Vonhof
  date of change: 2018-12-12
  author at start life: Marinus Vonhof
  date of start life: 2012-04-22
  on class: Maaiveldoriëntatie
  on property: has as aspect (inverse)
  qualified cardinality: 1
subclass of: Restriction
  author at start life: Marinus Vonhof
  date of start life: 2015-11-07
  on class: Inwinning
  on property: has as aspect
  max qualified cardinality: 1
subclass of: Restriction
  on property: has as value
  all values from: decimal

Opdrachtgever
label: Employing authority @en
author of change: Marinus Vonhof
date of change: 2025-01-16
date of change: 2020-04-20
definition: Een rechtspersoon die opdracht geeft voor het uitvoeren van activiteiten dan wel het leveren van producten of diensten. De initiator van het project, dus ongeacht onderaanneming.
definition: [IMBOR] Een opdrachtgever is een organisatie die een bepaalde opdracht tot het verrichten van werkzaamheden verstrekt aan een andere (rechts)persoon, de opdrachtnemer.
notation: AAM
notation: CAM
notation: EAM
notation: GAM
notation: JAM
author at start life: Marinus Vonhof
date of start life: 2011-12-02
validity context: 3d 14d
see also: [KIB] De naam van de bevoegde instantie
alternative label: Bevoegde instantie
scope note: Cof TOP
type: Class
subclass of: Levensvorm
subclass of: Restriction
  author at start life: Marinus Vonhof
  date of start life: 2015-10-26
  on class: Project
  on property: has as input (inverse)
  qualified cardinality: 1

Pompcapaciteit
author of change: Johan Post
date of change: 2022-11-25
definition: De in de praktijk maximaal leverbare hoeveelheid per tijdseenheid (de capaciteit kan variëren door wisselende drukhoogte)
definition: [Omgevingswet] De volume-productie van een pomp per tijdseenheid
author at start life: Nic Roest (Idoro)
date of start life: 2006-02-21
units of measurements: m3/h
alternative label: Geïnstalleerde pompcapaciteit
comment: [is aspect]
scope note: Cof MDS
scope note: Cof HYD
scope note: Cof RGM
type: Class
subclass of: Capaciteit
subclass of: Restriction
  on property: has as value
  all values from: decimal

Opdrachtnemer
author of change: Marinus Vonhof
date of change: 2017-05-08
definition: Rechtspersoon die door middel van een overeenkomst door een opdrachtgever tegen vergoeding in staat wordt gesteld tot het uitvoeren van bepaalde activiteiten dan wel het leveren van producten of diensten
author at start life: Marinus Vonhof
date of start life: 2015-10-26
validity context: 3d 6d 14d
scope note: Cof TOP
type: Class
subclass of: Levensvorm
subclass of: Restriction
  author of change: Marinus Vonhof
  date of change: 2015-10-31
  author at start life: Marinus Vonhof
  date of start life: 2015-10-26
  on class: Project
  on property: has as output (inverse)
  qualified cardinality: 1

Vorm put
author of change: Marinus Vonhof
date of change: 2021-08-06
definition: De inwendige vorm (horizontaal, uit het bovenaanzicht). Indien aanwezig de vorm van de onderbak
author at start life: Marinus Vonhof
date of start life: 2012-05-01
comment: Intrinsiek aspect
comment: [is aspect]
scope note: Cof TOP
type: Class
subclass of: Vorm
subclass of: Restriction
  author of change: Marinus Vonhof
  date of change: 2021-08-06
  author at start life: Finy Teitsma (Oranjewoud)
  date of start life: 2006-02-25
  validity context: *t
  on class: Put
  on property: has as aspect (inverse)
  qualified cardinality: 1
subclass of: Restriction
  date of change: 2017-05-17
  author at start life: Marinus Vonhof
  date of start life: 2015-10-30
  on class: Inwinning
  on property: has as aspect
  max qualified cardinality: 1
subclass of: Restriction
  on property: has as reference (qualification)
  all values from: Vorm put (coll)

Lozingspunt bodem
definition: Locatie van de lozing bevindt zich in de bodem.
author at start life: Marinus Vonhof
date of start life: 2015-07-27
scope note: Cof MDS
type: Class
subclass of: Lozingspunt

Infiltratiebassin
author of change: Marinus Vonhof
author of change: Johan Post
author of change: Eric van Gorkom
date of change: 2021-10-01
date of change: 2026-07-13
date of change: 2024-05-13
definition: Een open reservoir met waterdoorlatende wanden voor de tijdelijke berging van hemelwater, waarbij het hemelwater door middel van infiltratie door de wanden kan worden afgevoerd
author at start life: Finy Teitsma (Oranjewoud)
date of start life: 2007-10-23
scope note: Cof MDS
scope note: Cof HYD
type: Class
subclass of: Begroeide infiltratievoorziening
subclass of: Restriction
  on property: heeft Uitvoering
  has value: Waterdoorlatende wanden

Infiltratieberm
definition: Een strook grond langs een weg, tussen rijstroken of tussen een rijweg en een fiets- of voetpad in die het afstromende hemelwater van de verharding ernaast laat infiltreren. Dit kan bedoeld zijn om (schoon) water niet af te voeren, om grondwater aan te vullen en ook om de beplanting in bermen van voldoende water te voorzien.
author at start life: Marinus Vonhof
date of start life: 2026-07-14
scope note: Cof MDS
scope note: Cof HYD
type: Class
subclass of: Begroeide infiltratievoorziening
subclass of: Restriction
  on property: heeft Uitvoering
  has value: In de berm

Infiltratiegreppel
author of change: Marinus Vonhof
author of change: Johan Post
date of change: 2021-10-01
date of change: 2026-07-13
definition: Een natuurlijk open reservoir met waterdoorlatende wanden voor de tijdelijke berging van hemelwater, waarbij het hemelwater door middel van infiltratie door de wanden kan worden afgevoerd.
author at start life: Finy Teitsma (Oranjewoud)
date of start life: 2007-10-23
alternative label: Zaksloot
scope note: Cof MDS
scope note: Cof HYD
type: Class
subclass of: Begroeide infiltratievoorziening
subclass of: Restriction
  on property: heeft Uitvoering
  has value: In de vorm van een greppel

Substraat omstorting
definition: De omstorting van de constructie
author at start life: Marinus Vonhof
date of start life: 2026-08-05
alternative label: Omgestorte substraat
scope note: Cof MDS
scope note: Cof HYD
type: Class
subclass of: Substraat
subclass of: Restriction
  on class: Infiltratiekolk
  on property: has as part (inverse)
  max qualified cardinality: 1
subclass of: Restriction
  on class: Infiltratieput
  on property: has as part (inverse)
  max qualified cardinality: 1
subclass of: Restriction
  on property: heeft Toepassing
  has value: Omstorting van de constructie

Niveau bovenkant filterdeel
author at start life: Marinus Vonhof
date of start life: 2026-07-24
units of measurements: m
comment: [is aspect]
scope note: Cof MDS
type: Class
subclass of: Hoogte t.o.v. NAP
subclass of: Restriction
  on property: has as value
  all values from: decimal
subclass of: Restriction
  validity context: *t
  on class: Infiltratieput
  on property: has as aspect (inverse)
  max qualified cardinality: 1

Niveau onderkant filterdeel
author at start life: Marinus Vonhof
date of start life: 2026-07-24
units of measurements: m
comment: [is aspect]
scope note: Cof MDS
type: Class
subclass of: Hoogte t.o.v. NAP
subclass of: Restriction
  on property: has as value
  all values from: decimal
subclass of: Restriction
  validity context: *t
  on class: Infiltratieput
  on property: has as aspect (inverse)
  max qualified cardinality: 1

Infiltrerend oppervlak
author of change: Marinus Vonhof
author of change: Wouter van Riel
date of change: 2025-01-16
date of change: 2024-04-23
definition: [IMBOR] Aanduiding voor het oppervlak (binnen het object) waarbinnen water kan infiltreren.
author at start life: Marinus Vonhof
date of start life: 2013-10-01
units of measurements: m2
comment: [is aspect]
scope note: Cof MDS
type: Class
subclass of: Kenmerk
subclass of: Restriction
  author at start life: Nic Roest (Idoro)
  date of start life: 2007-11-29
  on class: Infiltratiekoffer
  on property: has as aspect (inverse)
  max qualified cardinality: 1
subclass of: Restriction
  on property: has as value
  all values from: decimal

Infiltrerende wegconstructie
definition: Een verharding (doorlatend, passerend, halfverharding of traditioneel uitgevoerde verharding) op een constructielaag, met daar direct onder een infiltratiekoffer (fundatie/cunet met substraat met een hoge porositeit) of een infiltratiekrat. Het hemelwater wordt via een waterpasserende verharding, waterdoorlatende verharding, halfverharding, kolken met infiltratieriool en/of infiltratiegoot in het cunet of de infiltratiekrat gebracht en geborgen, waarbij het hemelwater via de bodem en wanden infiltreert in de ondergrond. Bij overbelasting en voor de vertraagde leegloop van de voorziening kunnen onderdelen (drainage, noodoverstort, slokop etc.) zijn aangebracht voor het reguleren van hemelwater- en grondwater.
author at start life: Marinus Vonhof
date of start life: 2026-07-13
scope note: Cof MDS
scope note: Cof HYD
type: Class
subclass of: Infiltratievoorziening
subclass of: Restriction
  on property: heeft Uitvoering
  has value: Onderdeel van de weg

Zadel
author of change: Marinus Vonhof
date of change: 2025-01-16
date of change: 2026-07-20
definition: Een verstevingingsstuk bestemd voor het verstevigen van een leidingaansluiting.
author at start life: Wouter van Riel
date of start life: 2021-09-24
scope note: Cof MDS
type: Class
subclass of: Hulpstuk
subclass of: Restriction
  author at start life: Wouter van Riel
  date of start life: 2021-09-24
  on class: Inlaat
  on property: has as part (inverse)
  max qualified cardinality: 1
subclass of: Restriction
  on property: heeft Functie
  has value: Leidingaansluiting verstevigen

Wijze van inwinning
author of change: Johan Post
date of change: 2022-09-29
definition: Wijze waarop gegevens verzameld zijn
author at start life: Marinus Vonhof
date of start life: 2013-02-05
alternative label: Wijze van inwinnen
comment: [is aspect]
scope note: Cof TOP
type: Class
subclass of: Kenmerk
subclass of: Restriction
  author of change: Marinus Vonhof
  date of change: 2026-07-26
  date of change: 2024-05-15
  date of change: 2019-04-25
  author at start life: Marinus Vonhof
  date of start life: 2015-10-29
  on class: Inwinning
  on property: has as aspect (inverse)
  max qualified cardinality: 1
subclass of: Restriction
  on property: has as reference (qualification)
  all values from: Wijze van inwinning (coll)

Inspecteren
author of change: Marinus Vonhof
date of change: 2022-09-30
date of change: 2015-08-24
definition: [NEN 3300:1996] (Inspectie) Het waarnemen, herkennen en beschrijven van de toestand
author at start life: Marinus Vonhof
date of start life: 2013-03-26
validity context: 1f 3f 5d 10f 11d 12f 14f
comment: [cfk fout]
scope note: Cof TOP
type: Class
subclass of: Onderzoeken

Mechanische transportleiding
author of change: Marinus Vonhof
author of change: Johan Post
author of change: Wouter van Riel
date of change: 2025-01-16
date of change: 2024-05-02
date of change: 2015-09-20
date of change: 2024-04-23
date of change: 2024-07-26
date of change: 2024-05-04
definition: [IMBOR] Een transportleiding waarin de materie op basis van onder- en bovendruk wordt verplaatst.
author at start life: Marinus Vonhof
date of start life: 2014-12-02
validity context: *f
comment: [cfk fout]
scope note: Cof TOP
type: Class
subclass of: Transportleiding
subclass of: Restriction
  on property: heeft Structuur
  has value: Gesloten
subclass of: Restriction
  on property: heeft Technologie
  has value: Transport onder overdruk of onderdruk

Inspecteur
label: Inspector @en
author of change: Marinus Vonhof
date of change: 2015-10-31
definition: [EN13508-2+A1] De naam van de inspecteur en de naam van het bedrijf van de inspecteur
definition: [EN13508-2+A1] The name of the inspector and the name of the inspector’s company @en
notation: ABH
notation: CBH
notation: EBH
author at start life: Marinus Vonhof
date of start life: 2013-04-23
validity context: 3d 14d
alternative label: Naam inspectiebedrijf (EN)
scope note: Cof MDS
scope note: Cof EN
type: Class
subclass of: Opdrachtnemer

Inspectieproject riolering
author of change: Marinus Vonhof
author of change: Johan Post
date of change: 2024-05-02
date of change: 2017-04-06
definition: Een project dat tot doel heeft het rioleringssysteem te inspecteren.
author at start life: Marinus Vonhof
date of start life: 2011-12-02
validity context: 3d 14d
scope note: Cof MDS
scope note: Cof LDR
type: Class
subclass of: Project
subclass of: Restriction
  author of change: Marinus Vonhof
  date of change: 2014-09-03
  author at start life: Marinus Vonhof
  date of start life: 2014-04-29
  on class: Visueel inspecteren vrijverval leiding
  on property: has as part
  min qualified cardinality: 0
subclass of: Restriction
  author of change: Marinus Vonhof
  date of change: 2017-03-23
  author at start life: Marinus Vonhof
  date of start life: 2013-01-05
  on class: Visueel inspecteren rioolput
  on property: has as part
  min qualified cardinality: 0
subclass of: Restriction
  author at start life: Marinus Vonhof
  date of start life: 2015-10-26
  on class: Reinigen rioolput
  on property: has as part
  min qualified cardinality: 0
subclass of: Restriction
  author at start life: Marinus Vonhof
  date of start life: 2015-10-26
  on class: Reinigen vrijverval leiding
  on property: has as part
  min qualified cardinality: 0

Project
author of change: Marinus Vonhof
date of change: 2025-01-16
definition: [IMBOR] Afbakening van het gebied (begrenzing) waarbinnen werkzaamheden gepland zijn, uitgevoerd worden of uitgevoerd zijn.
author at start life: Marinus Vonhof
date of start life: 2013-09-03
validity context: 3d 14d
scope note: Cof TOP
type: Class
subclass of: Activiteit
subclass of: Restriction
  author of change: Marinus Vonhof
  date of change: 2015-10-26
  author at start life: Marinus Vonhof
  date of start life: 2011-12-02
  validity context: 1t 10t 12t
  on class: Projectreferentie opdrachtgever
  on property: has as aspect
  qualified cardinality: 1
subclass of: Restriction
  author of change: Marinus Vonhof
  date of change: 2015-10-31
  author at start life: Marinus Vonhof
  date of start life: 2015-10-26
  on class: Opdrachtnemer
  on property: has as output
  min qualified cardinality: 1
subclass of: Restriction
  author at start life: Marinus Vonhof
  date of start life: 2015-10-26
  validity context: 1t 10t 12t
  on class: Projectreferentie opdrachtnemer
  on property: has as aspect
  qualified cardinality: 1
subclass of: Restriction
  author at start life: Marinus Vonhof
  date of start life: 2015-10-26
  on class: Opdrachtgever
  on property: has as input
  qualified cardinality: 1

Vrijverval transportstelsel
author of change: Marinus Vonhof
author of change: Johan Post
date of change: 2025-01-16
date of change: 2021-10-01
definition: [IMBOR] Een netwerk van leidingen en putten ten behoeve van het transport van materie dat door middel van zwaartekracht plaatsvindt.
author at start life: Marinus Vonhof
date of start life: 2014-12-02
scope note: Cof TOP
type: Class
subclass of: Transportstelsel
subclass of: Restriction
  author of change: Marinus Vonhof
  date of change: 2015-04-21
  author at start life: Marinus Vonhof
  date of start life: 2014-12-02
  on class: Inspectieput
  on property: has as part
  min qualified cardinality: 1
subclass of: Restriction
  author of change: Marinus Vonhof
  date of change: 2015-09-20
  author at start life: Marinus Vonhof
  date of start life: 2014-12-02
  validity context: 1t 10t 12t
  on class: Vrijverval transportleiding
  on property: has as part
  min qualified cardinality: 0
subclass of: Restriction
  on property: heeft Technologie
  has value: Transport door de zwaartekracht

Interne overstortconstructie
author of change: Marinus Vonhof
date of change: 2015-09-01
definition: Een overstortconstructie die loost op een voorziening binnen hetzelfde rioolstelsel.
author at start life: Marinus Vonhof
date of start life: 2015-05-29
scope note: Cof MDS
scope note: Cof HYD
type: Class
subclass of: Overstortconstructie
subclass of: Restriction
  on property: heeft Functie
  has value: Lozen binnen het stelsel

Interne overstortput
author of change: Marinus Vonhof
author of change: Finy Teitsma (Oranjewoud)
author of change: Wouter van Riel
date of change: 2024-04-20
date of change: 2007-11-12
date of change: 2025-03-20
definition: Een overstortput die loost op een voorziening binnen hetzelfde rioolstelsel.
definition: [NEN 3300:1996] rioolput voorzien van een overstortdrempel die loost binnen het in beschouwing genomen rioolstelsel
author at start life: Finy Teitsma (Oranjewoud)
date of start life: 2006-05-23
alternative label: Interne overstort
scope note: Cof MDS
scope note: Cof REV
scope note: Cof HYD
scope note: Cof DMO
type: Class
subclass of: Overstortput
subclass of: Restriction
  on property: heeft Functie
  has value: Lozen binnen het stelsel

Waterpeil
author of change: Marinus Vonhof
date of change: 2018-12-06
definition: Gemiddeld peil van het oppervlaktewater. Waarbij meetpunt op het waperoppervlak ligt
author at start life: Nic Roest (Idoro)
date of start life: 2006-02-21
units of measurements: m
comment: [is aspect]
scope note: Cof MDS
scope note: Cof HYD
type: Class
subclass of: Hoogte t.o.v. NAP
subclass of: Restriction
  author at start life: Marinus Vonhof
  date of start life: 2018-12-06
  on class: Inwinning
  on property: has as aspect
  max qualified cardinality: 1
subclass of: Restriction
  on property: has as value
  all values from: decimal

Vacuümopslagtank
definition: Afgesloten tank binnen een vacuümpompstation waarin afvalwater uit één of meerdere vacuümleidingen tijdelijk wordt geborgen voordat het verder wordt verpompt naar een benedenstrooms rioolstelsel of zuiveringsinstallatie.
definition: [NEN 3300:1996] Onderdrukopslagtank is synoniem van vacuümopslagtank
definition: [NEN 3300:1996] Opslagruimte voor het afvalwater dat via een vacuümleiding wordt aangevoerd en waarin onderdruk in stand wordt gehouden.
author at start life: Johan Post
date of start life: 2026-05-21
alternative label: Onderdrukopslagtank
scope note: Cof MDS
scope note: Cof RGM
type: Class
subclass of: Constructieonderdeel
subclass of: Restriction
  on property: heeft Functie
  has value: Tijdelijke berging van vuilwater
subclass of: Restriction
  on property: heeft Technologie
  has value: Via onderdruk

Uitlaatconstructie
author of change: Marinus Vonhof
author of change: Johan Post
date of change: 2022-09-30
date of change: 2026-05-21
date of change: 2020-04-18
definition: [NEN-EN 752:2008] constructie of punt van waaruit afvalwater wordt geloosd naar een afvalwaterzuiveringsinstallatie of ontvangend water [EN 1085:2007, definitie 1280]
definition: Een bouwwerk bestaande uit een constructief vormgegeven uitstroomelement dat de uitstroming van water uit een leiding naar het oppervlaktewater mogelijk maakt.
definition: [NEN 3300:1996] constructie waar uitstroming van afvalwater uit het in beschouwing genomen rioolstelsel naar het oppervlaktewater mogelijk is
author at start life: Marinus Vonhof
date of start life: 2013-10-01
scope note: Cof MDS
scope note: Cof HYD
scope note: Cof DMO
type: Class
subclass of: Bouwwerk
subclass of: Restriction
  author at start life: Marinus Vonhof
  date of start life: 2016-04-24
  validity context: 5t 11t
  on class: Uitlaat (punt)
  on property: has as aspect
  max qualified cardinality: 1
subclass of: Restriction
  on property: heeft Functie
  has value: Uitstroom van afvalwater naar oppervlaktewater

Kolkaansluitleiding
author of change: Marinus Vonhof
date of change: 2016-10-17
definition: Een aansluitleiding tussen een kolk en de inlaat.
author at start life: Marinus Vonhof
author at start life: Finy Teitsma (Oranjewoud)
date of start life: 2006-02-20
scope note: Cof MDS
scope note: Cof RRB
scope note: Cof LDR
type: Class
subclass of: Aansluitleiding
subclass of: Restriction
  on property: heeft Functie
  has value: Aanvoer van hemelwater

Straatkolk
author of change: Marinus Vonhof
date of change: 2016-04-15
definition: Een kolk met de inlaat aan de bovenzijde, bestemd om te worden aangebracht in het vlak van de wegverharding
definition: [NEN 3300:1996] kolk met horizontaal boveninlaatrooster, waarvan de bovenzijde gelijk ligt met het wegoppervlak
notation: A
author at start life: Finy Teitsma (Oranjewoud)
date of start life: 2006-11-29
scope note: Cof MDS
scope note: Cof RRB
scope note: Cof LDR
scope note: Cof REV
type: Class
subclass of: Kolk
subclass of: Restriction
  on property: heeft Functie
  has value: Afvoer naar kolkaansluitleiding
subclass of: Restriction
  on property: heeft Uitvoering
  has value: Met de inlaat aan de bovenzijde

Trottoirkolk
author of change: Finy Teitsma (Oranjewoud)
date of change: 2007-11-12
definition: Een kolk met de inlaat aan de voorzijde, bestemd om te worden aangebracht in de in het zicht blijvende vlakken van de aansluitende trottoirbanden.
definition: [NEN 3300:1996] kolk met een verticaal voorinlaatrooster, waarvan de voorkant strookt met de trottoirband
notation: B
author at start life: Finy Teitsma (Oranjewoud)
date of start life: 2006-11-29
scope note: Cof MDS
scope note: Cof RRB
scope note: Cof LDR
scope note: Cof REV
type: Class
subclass of: Kolk
subclass of: Restriction
  on property: heeft Functie
  has value: Afvoer naar kolkaansluitleiding
subclass of: Restriction
  on property: heeft Uitvoering
  has value: Met de inlaat aan de voorzijde

Ter plaatse uitgeharde lining
label: Cured in place lining @en
author of change: Marinus Vonhof
date of change: 2025-01-16
definition: [IMBOR] Nieuwe bekleding of een geheel nieuwe leiding, van een materiaal dat ter plaatse uithardt tegen de randen van de buitenste leiding, die in een bestaande leiding wordt aangebracht.
notation: C
author at start life: Marinus Vonhof
date of start life: 2018-12-12
comment: Bron afbeelding: https://www.unitracc.com
scope note: Cof MDS
scope note: Cof LDR
scope note: Cof MTR
type: Class
subclass of: Lining
subclass of: Restriction
  on property: heeft Uitvoering
  has value: Uithardend op binnenwand

Kruisingsput
author of change: Johan Post
date of change: 2021-10-01
definition: [NEN 3300:1996] rioolput voor de kruising van riolen, zonder dat de stromen elkaar raken
author at start life: Marinus Vonhof
date of start life: 2012-04-29
scope note: Cof MDS
scope note: Cof RRB
scope note: Cof LDR
scope note: Cof REV
scope note: Cof HYD
type: Class
subclass of: Rioolput
subclass of: Restriction
  on property: heeft Functie
  has value: Leiding gescheiden laten kruisen
subclass of: Restriction
  on property: heeft Functie
  has value: Voorkomen dat stromen elkaar raken

Lavakoffer
author of change: Marinus Vonhof
date of change: 2025-01-16
date of change: 2026-07-13
definition: [IMBOR] Een constructie gevuld met een granulaat met lavasteen waar regenwater de tijd krijgt om langzaam in de bodem opgenomen te worden.
author at start life: Marinus Vonhof
date of start life: 2021-08-06
scope note: Cof MDS
type: Class
subclass of: Infiltratiekoffer
subclass of: Restriction
  on property: heeft Uitvoering
  has value: Gevuld met lavasteen

WIBON thema
author of change: Marinus Vonhof
date of change: 2025-01-16
definition: [IMBOR] Het thema geeft aan welk type leiding het betreft en welke functie de leidingen hebben. Bijvoorbeeld: datatransport, gas lage druk, laagspanning, riool etc. Opmerking: signaleringskabels die data vervoeren vallen onder datatransport.
author at start life: Marinus Vonhof
date of start life: 2020-04-17
validity context: 15d
comment: [is aspect]
scope note: Cof MDS
scope note: Cof DMO
type: Class
subclass of: Kenmerk
subclass of: Restriction
  author at start life: Marinus Vonhof
  date of start life: 2020-04-17
  on class: Leiding
  on property: has as aspect (inverse)
  max qualified cardinality: 1
subclass of: Restriction
  author at start life: Marinus Vonhof
  date of start life: 2020-04-17
  on class: Put
  on property: has as aspect (inverse)
  max qualified cardinality: 1
subclass of: Restriction
  author at start life: Marinus Vonhof
  date of start life: 2026-07-24
  on class: Reservoir
  on property: has as aspect (inverse)
  max qualified cardinality: 1
subclass of: Restriction
  on property: has as reference (qualification)
  all values from: WIBON thema (coll)

Leidingsegment
author of change: Marinus Vonhof
author of change: Johan Post
author of change: Eric van Gorkom
date of change: 2022-09-27
date of change: 2022-09-29
date of change: 2018-12-12
author at start life: Marinus Vonhof
date of start life: 2014-12-02
validity context: 12d
see also: [WSH 20141028] Deel van een persleiding begrensd door wijziging materiaal, wijziging afmeting, locatie inprikpunt of locatie appendages
scope note: Cof MDS
scope note: Cof PLI
scope note: Cof HYD
scope note: Cof DMO
type: Class
subclass of: Mechanische transportleiding
subclass of: Restriction
  on property: heeft Uitvoering
  has value: Deel van mechanische transportleiding

Lengte
author of change: Marinus Vonhof
date of change: 2025-01-16
date of change: 2015-05-29
definition: In de richting van de langste afstand
definition: [IMBOR] Kenmerk voor de registratie van de langste horizontale dimensie van het beheerobject.
author at start life: Nic Roest (Idoro)
date of start life: 2006-02-17
comment: [is aspect]
scope note: Cof TOP
type: Class
subclass of: Afstand

Vrijverval transportleiding
author of change: Johan Post
author of change: Wouter van Riel
date of change: 2026-05-01
date of change: 2024-04-22
definition: Een transportleiding waarin de materie door de zwaartekracht wordt verplaatst
author at start life: Marinus Vonhof
date of start life: 2015-09-20
validity context: 3f
scope note: Cof TOP
type: Class
subclass of: Transportleiding
subclass of: Restriction
  author of change: Marinus Vonhof
  date of change: 2015-09-20
  author at start life: Marinus Vonhof
  date of start life: 2014-12-02
  validity context: 1t 10t 12t
  on class: Vrijverval transportstelsel
  on property: has as part (inverse)
  max qualified cardinality: 1
subclass of: Restriction
  author of change: Marinus Vonhof
  date of change: 2018-09-03
  author at start life: Marinus Vonhof
  date of start life: 2015-07-28
  on class: Lining
  on property: has as part
  max qualified cardinality: 1
subclass of: Restriction
  author at start life: Johan Post
  date of start life: 2026-05-01
  on class: Vrijverval rioolstelsel
  on property: has as part (inverse)
  max qualified cardinality: 1
subclass of: Restriction
  on property: heeft Technologie
  has value: Transport door de zwaartekracht

Lining aangebracht tijdens fabricage
label: Lining inserted during manufacture @en
author of change: Marinus Vonhof
date of change: 2025-01-16
definition: [IMBOR] Bekleding of een gehele leiding die reeds in een bestaande leiding wordt aangebracht tijden fabricage.
notation: A
author at start life: Marinus Vonhof
date of start life: 2018-12-12
scope note: Cof MDS
scope note: Cof LDR
scope note: Cof MTR
type: Class
subclass of: Lining
subclass of: Restriction
  on property: heeft Uitvoering
  has value: Aangebracht tijdens fabricage leiding

Wikkelbuis relining
label: Spirally wound lining @en
author of change: Marinus Vonhof
date of change: 2025-01-16
definition: [IMBOR] Een relining techniek waarbij een dunne holle buis wordt afgewikkeld van een haspel en tegen de binnenwand van de leiding wordt gespannen op spiraalvormige wijze.
notation: H
author at start life: Marinus Vonhof
date of start life: 2018-12-12
scope note: Cof MDS
scope note: Cof LDR
scope note: Cof MTR
type: Class
subclass of: Lining
subclass of: Restriction
  on property: heeft Uitvoering
  has value: Spiraalvormig gespannen op binnenwand

Luchtpersgemaal
author of change: Marinus Vonhof
date of change: 2025-01-16
date of change: 2018-11-07
definition: Een gemaal uitgevoerd met een luchtcompressor die het afvalwater door de persleiding drukt
author at start life: Marinus Vonhof
date of start life: 2018-05-03
scope note: Cof MDS
scope note: Cof HYD
scope note: Cof RGM
scope note: Cof DMO
type: Class
subclass of: Rioolgemaal
subclass of: Restriction
  on property: heeft Uitvoering
  has value: Verpompt met een luchtcompressor

Luik
author of change: Marinus Vonhof
date of change: 2025-01-16
definition: [IMBOR] Een soort poort of deur ter bescherming van een raam of venster of als onderdeel van een kunstwerk of constructie.
author at start life: Marinus Vonhof
date of start life: 2020-04-17
scope note: Cof MDS
scope note: Cof REV
type: Class
subclass of: Afdekking
subclass of: Restriction
  on property: heeft Functie
  has value: Afsluiten
subclass of: Restriction
  on property: heeft Uitvoering
  has value: Scharnierend
subclass of: Restriction
  on property: heeft Functie
  has value: Toegankelijk houden

Materiaal substraat
author at start life: Marinus Vonhof
date of start life: 2026-07-13
comment: [is aspect]
scope note: Cof MDS
type: Class
subclass of: Materiaal
subclass of: Restriction
  on class: Substraat
  on property: has as aspect (inverse)
  max qualified cardinality: 1

Substraat
definition: De vulling van een ruimte met een variabele porositeit en doorlaatbaarheid
author at start life: Marinus Vonhof
date of start life: 2026-08-05
scope note: Cof MDS
scope note: Cof HYD
type: Class
subclass of: Constructieonderdeel
subclass of: Restriction
  on class: Doorlaatbaarheid
  on property: has as aspect
  max qualified cardinality: 1
subclass of: Restriction
  on property: heeft Functie
  has value: Opslag van hemelwater
subclass of: Restriction
  on property: heeft Functie
  has value: Transport van hemelwater
subclass of: Restriction
  on class: Materiaal substraat
  on property: has as aspect
  max qualified cardinality: 1
subclass of: Restriction
  on class: Porositeit
  on property: has as aspect
  max qualified cardinality: 1

Mechanische perceelaansluiting
definition: Een aansluiting waarin het afvalwater door middel van onder-/overdruk wordt getransporteerd.
author at start life: Marinus Vonhof
date of start life: 2019-07-10
scope note: Cof MDS
type: Class
subclass of: Perceelaansluiting
subclass of: Restriction
  on property: heeft Technologie
  has value: Transport onder overdruk of onderdruk

Mof
definition: Een hulpstuk bestemd voor het verbinden van twee leidingen
author at start life: Wouter van Riel
date of start life: 2024-04-20
scope note: Cof MDS
scope note: Cof LDR
scope note: Cof PLI
scope note: Cof HYD
type: Class
subclass of: Verbindingsstuk
subclass of: Restriction
  on property: heeft Functie
  has value: Verbinden van twee leidingen

Wadi
author of change: Marinus Vonhof
author of change: Johan Post
date of change: 2025-01-16
date of change: 2024-04-30
date of change: 2017-05-31
definition: Een verdiept terrein, bestemd om het hemelwater tijdelijk te bergen, voorzien van waterdoorlatende bodem waardoor water door middel van infiltratie door de bodem kan worden afgevoerd.
definition: [IMBOR] Een (beplante) laagte, bestemd om het hemelwater tijdelijk te bergen en in de bodem te laten infiltreren. Voorzien van een infiltratiebed en veelal van infiltratiekratten.
definition: [IMBOR] Een verdiept terrein met waterdoorlatende bodem bestemd voor de inzameling van hemelwater, waarbij dit water door middel van infiltratie door de bodem kan worden afgevoerd.
definition: [NEN 3300:1996] verdiept terrein waarop overstort- of regenwater wordt geloosd om in de bodem te infiltreren.
author at start life: Finy Teitsma (Oranjewoud)
date of start life: 2007-10-23
comment: Vanaf versie 1.7.0 is de wadi een groepering van objecten geworden (was een reservoir), daarmee vervallen de kenmerken Breedte Bouwwerk, Lengte Bouwwerk en dergelijke. Gebruik nu de geometrie Buitengrens om de afmeting te beschijven.
see also: [Waterkring West] Een bufferings- en infiltratievoorziening, die tijdelijk gevuld is met hemelwater. De naam verwijst naar de Arabische naam voor een vaak droogstaand rivierdal en is ook een acroniem van Water Afvoer Door Infiltratie.
alternative label: Infiltratieveld
scope note: Cof MDS
scope note: Cof HYD
type: Class
subclass of: Begroeide infiltratievoorziening
subclass of: Restriction
  on property: heeft Uitvoering
  has value: Beplante/begroeide laagte

Slibvanger
author of change: Johan Post
date of change: 2022-11-25
definition: [NEN 3300:1996] Bezinkbak voor verontreinigd afvalwater waarin door het verschil in dichtheid en het vertragen van de vloeistofstroom, slib en afvalwater wordt gescheiden
author at start life: Marinus Vonhof
date of start life: 2012-04-29
comment: 20151014: NEN3300-definitie aangepast
alternative label: Slibvangput
scope note: Cof MDS
type: Class
subclass of: Slibafscheider
subclass of: Restriction
  on property: heeft Uitvoering
  has value: Bak of put

Naam openbare ruimte
author at start life: Marinus Vonhof
date of start life: 2016-02-05
see also: [BAG] Een door het bevoegde gemeentelijke orgaan aan een Openbare ruimte toegekende benaming
comment: [is aspect]
scope note: Cof MDS
scope note: Cof RRB
scope note: Cof LDR
type: Class
subclass of: Kenmerk

Noodoverstortput
author of change: Finy Teitsma (Oranjewoud)
date of change: 2007-11-12
definition: Een externe overstortput aangelegd voor afvoer als gevolg van een calamiteit.
author at start life: Finy Teitsma (Oranjewoud)
date of start life: 2007-10-23
alternative label: Noodoverlaat
scope note: Cof MDS
scope note: Cof HYD
scope note: Cof DMO
type: Class
subclass of: Externe overstortput
subclass of: Restriction
  on property: heeft Functie
  has value: Bij calamiteit afvalwater afvoeren

Nooduitlaat
author of change: Marinus Vonhof
date of change: 2015-03-01
definition: Een uitlaat aangelegd voor afvoer als gevolg van een calamiteit.
definition: [NEN 3300:1996] constructie voor de lozing van afvalwater op het oppervlaktewater bij calamiteiten
author at start life: Finy Teitsma (Oranjewoud)
date of start life: 2007-10-23
scope note: Cof MDS
scope note: Cof HYD
scope note: Cof DMO
type: Class
subclass of: Uitlaatconstructie
subclass of: Restriction
  on property: heeft Functie
  has value: Bij calamiteit afvalwater afvoeren
subclass of: Restriction
  on property: heeft Toepassing
  has value: Calamiteit
subclass of: Restriction
  on property: heeft Functie
  has value: Lozen afvalwater

Ondergrondse infiltratievoorziening
definition: Een ondergrondse voorziening (infiltratieriool, infiltratieput, infiltratiekolk, infiltratiekrat, -koffer en/of bassin) met waterdoorlatende wanden, waarin het hemelwater wordt ingezameld, getransporteerd en tijdelijk wordt geborgen en waarbij het hemelwater via de wanden en bodem infiltreert in de ondergrond. Bij overbelasting en voor de vertraagde leegloop van de voorziening kunnen onderdelen (drainage, noodoverstort, slokop etc.) zijn aangebracht voor het reguleren van hemelwater- en grondwater.
author at start life: Marinus Vonhof
date of start life: 2026-07-13
scope note: Cof MDS
scope note: Cof HYD
type: Class
subclass of: Infiltratievoorziening
subclass of: Restriction
  on property: heeft Uitvoering
  has value: Gelegen onder maaiveld

Projectreferentie opdrachtnemer
notation: EBI
author at start life: Marinus Vonhof
date of start life: 2015-10-26
validity context: 3d 6d 14d
comment: [is aspect]
scope note: Cof TOP
type: Class
subclass of: Unieke identificatie
subclass of: Restriction
  author at start life: Marinus Vonhof
  date of start life: 2015-10-26
  validity context: 1t 10t 12t
  on class: Project
  on property: has as aspect (inverse)
  qualified cardinality: 1

Opening in wand
author of change: Marinus Vonhof
date of change: 2025-01-16
date of change: 2019-05-15
definition: Een opening in een wand zonder afvoerregeling
definition: [IMBOR] Een doorlaat in de vorm van een opening in een wand.
author at start life: Marinus Vonhof
date of start life: 2012-04-24
comment: Als de opening gecombineerd is met bijvoorbeeld een klep of schuif, gebruik dan een subtype van Mechanische Afsluiter als hydraulisch element
scope note: Cof MDS
scope note: Cof REV
scope note: Cof HYD
scope note: Cof DMO
type: Class
subclass of: Doorlaat
subclass of: Restriction
  author of change: Marinus Vonhof
  date of change: 2018-12-12
  author at start life: Marinus Vonhof
  date of start life: 2017-12-07
  on class: Stuwput
  on property: has as part (inverse)
  max qualified cardinality: 1
subclass of: Restriction
  on property: heeft Uitvoering
  has value: Uitsparing in wand

Waarneming
label: Observation @en
author of change: Marinus Vonhof
date of change: 2018-04-06
author at start life: Marinus Vonhof
date of start life: 2013-01-07
validity context: 5d 6d 11d
comment: Was specialisatie van Inspecteren
scope note: Cof TOP
type: Class
subclass of: Activiteit

Opvoergemaal
author of change: Marinus Vonhof
date of change: 2025-01-16
date of change: 2019-01-11
definition: Een gemaal in een vrijverval rioolstelsel voor het verpompen van afvalwater naar een hoger gelegen vrijverval rioolstelsel zonder gebruik te maken van een persleiding buiten het bouwwerk.
author at start life: Nic Roest (Idoro)
date of start life: 2007-11-29
scope note: Cof MDS
scope note: Cof HYD
scope note: Cof RGM
scope note: Cof DMO
type: Class
subclass of: Rioolgemaal
subclass of: Restriction
  on property: heeft Uitvoering
  has value: Verpompt binnen het bouwwerk

Overgangsstuk
definition: [NEN 3300:1996] hulpstuk voor het verbinden van twee buizen van verschillende materialen of verbindingstypen
author at start life: Marinus Vonhof
date of start life: 2012-04-29
scope note: Cof MDS
scope note: Cof LDR
scope note: Cof PLI
scope note: Cof HYD
type: Class
subclass of: Verbindingsstuk
subclass of: Restriction
  on property: heeft Functie
  has value: Verbinden van leidingen met verschillend materiaal of verbindingstype

Riooleindgemaal
author of change: Marinus Vonhof
date of change: 2025-01-16
date of change: 2017-04-06
definition: Het rioolgemaal waar de overdracht plaatsvindt van een stelsel onder beheer van een gemeente naar een stelsel of ontvangstput onder beheer van een waterschap.
author at start life: Marinus Vonhof
date of start life: 2014-11-30
see also: [IRIS-RIOKEN:2012] Voor het waterschap zijn in principe alleen de riooleindgemalen interessant, waar overdracht van afvalwater plaatsvindt naar een stelsel dat onder beheer van dit waterschap is.
alternative label: Overnamegemaal
scope note: Cof MDS
scope note: Cof HYD
scope note: Cof RGM
scope note: Cof DMO
type: Class
subclass of: Rioolgemaal
subclass of: Restriction
  on property: heeft Toepassing
  has value: Is overdrachtspunt

Overstortleiding
author of change: Finy Teitsma (Oranjewoud)
date of change: 2007-11-12
definition: Een gesloten rioolleiding voor het transport van het afvalwater van een overstortput naar het lozingspunt
definition: [NEN 3300:1996] riool bestemd voor de afvoer van afvalwater geloosd via een overstort
author at start life: Finy Teitsma (Oranjewoud)
date of start life: 2007-10-23
alternative label: Overstortriool
scope note: Cof MDS
scope note: Cof REV
scope note: Cof HYD
type: Class
subclass of: Vrijverval rioolleiding
subclass of: Restriction
  on property: heeft Functie
  has value: Transport van overstortend afvalwater

Projectreferentie opdrachtgever
label: Employers job reference @en
definition: [EN13508-2+A1] De opdrachtcode van de opdrachtgever
definition: [EN13508-2+A1] The employer’s job reference code @en
notation: ABJ
notation: CBJ
notation: EBJ
notation: GBJ
notation: JBJ
author at start life: Marinus Vonhof
date of start life: 2011-12-02
validity context: 3d 6d 14d
alternative label: Opdrachtcode opdrachtgever (EN)
comment: [is aspect]
scope note: Cof TOP
type: Class
subclass of: Unieke identificatie
subclass of: Restriction
  author of change: Marinus Vonhof
  date of change: 2015-10-26
  author at start life: Marinus Vonhof
  date of start life: 2011-12-02
  validity context: 1t 10t 12t
  on class: Project
  on property: has as aspect (inverse)
  qualified cardinality: 1

Putbuis
author of change: Marinus Vonhof
date of change: 2025-01-16
date of change: 2018-12-11
definition: Een inspectieschacht aangebracht op een buis met grote afmeting
author at start life: Marinus Vonhof
date of start life: 2018-12-05
scope note: Cof MDS
scope note: Cof REV
scope note: Cof HYD
type: Class
subclass of: Rioolput
subclass of: Restriction
  on property: heeft Uitvoering
  has value: Inspectieschacht op leiding

Putdeksel - licht verkeer
author of change: Marinus Vonhof
date of change: 2025-01-16
definition: [IMBOR] Een deksel om de opening van een put af te sluiten, die sterk genoeg is om het passeren van voertuigen van gering gewicht te doorstaan.
author at start life: Marinus Vonhof
date of start life: 2018-12-06
scope note: Cof MDS
scope note: Cof REV
type: Class
subclass of: Putdeksel
subclass of: Restriction
  on property: heeft Functie
  has value: Dragen van licht verkeer

Putdeksel - zwaar verkeer
author of change: Marinus Vonhof
date of change: 2025-01-16
definition: [IMBOR] Een deksel om de opening van een put af te sluiten, die sterk genoeg is om het passeren van voertuigen van fors gewicht te doorstaan.
author at start life: Marinus Vonhof
date of start life: 2018-12-06
scope note: Cof MDS
scope note: Cof REV
type: Class
subclass of: Putdeksel
subclass of: Restriction
  on property: heeft Functie
  has value: Dragen van zwaar verkeer

RWS kolk
author of change: Marinus Vonhof
author of change: Johan Post
date of change: 2025-01-16
date of change: 2021-11-17
definition: [IMBOR] Tweedelige trottoirkolk beton/gietijzer, type RWS aansluitend op RWS-bandprofiel met U-vormige omranding.
author at start life: Marinus Vonhof
date of start life: 2021-08-06
scope note: Cof MDS
scope note: Cof RRB
scope note: Cof LDR
scope note: Cof REV
type: Class
subclass of: Kolk
subclass of: Restriction
  on property: heeft Uitvoering
  has value: Heeft U-vormige omranding
subclass of: Restriction
  on property: heeft Toepassing
  has value: Sluit aan op RWS-bandprofiel

Vorm deksel (coll)
comment: [is coll]
scope note: Cof MDS
scope note: Cof REV
type: Class
subclass of: Verzameling soorten
subclass of: Class
  one of: Rond
  one of: Rechthoekig

Reinigings- en inspectieproject kolken
author of change: Marinus Vonhof
date of change: 2017-04-06
definition: Een project dat tot doel heeft de kolken in het rioleringssysteem te reinigen en inspecteren.
author at start life: Marinus Vonhof
date of start life: 2014-04-29
validity context: 3d 14d
scope note: Cof MDS
scope note: Cof RRB
type: Class
subclass of: Project
subclass of: Restriction
  author of change: Marinus Vonhof
  date of change: 2014-09-03
  author at start life: Marinus Vonhof
  date of start life: 2014-04-29
  on class: Reinigen en inspecteren kolk
  on property: has as part
  min qualified cardinality: 1

Reinigende put
author of change: Marinus Vonhof
date of change: 2018-12-05
definition: Een rioolput met een fysisch reinigende voorziening, waarbij de vervuiling wordt gescheiden van het afvalwater. Kan ook beschouwd worden als een soort reinigende voorziening.
author at start life: Finy Teitsma (Oranjewoud)
date of start life: 2006-11-29
scope note: Cof MDS
scope note: Cof HYD
type: Class
subclass of: Inspectieput
subclass of: Restriction
  on property: heeft Uitvoering
  has value: Bevat fysisch reinigende voorziening
subclass of: Restriction
  on property: heeft Technologie
  has value: Fysisch reinigen
subclass of: Restriction
  on property: heeft Functie
  has value: Verwijderen vervuiling

Reiniger
author of change: Marinus Vonhof
date of change: 2015-10-31
notation: GBH
notation: JBH
author at start life: Marinus Vonhof
date of start life: 2014-12-23
validity context: 3d 14d
see also: [RIB] Naam en bedrijf reiniger
scope note: Cof MDS
scope note: Cof RRB
type: Class
subclass of: Opdrachtnemer

Slibafscheider
label: Grit separator @en
author of change: Finy Teitsma (Oranjewoud)
date of change: 2007-11-12
definition: Een toestel waarin ten gevolge van het verschil in dichtheid en het vertragen van de vloeistofstroom het slib door bezinking grotendeels van het afvalwater wordt gescheiden.
definition: [EN 16323:2014] device to separate grit, sand or similar mineral material from wastewater @en
author at start life: Finy Teitsma (Oranjewoud)
date of start life: 2007-10-23
validity context: 10d
scope note: Cof MDS
type: Class
subclass of: Constructieonderdeel
subclass of: Restriction
  on property: heeft Functie
  has value: Afscheiden slib
subclass of: Restriction
  on property: heeft Functie
  has value: Reinigen afvalwater
subclass of: Restriction
  on property: heeft Doel
  has value: Verwijderen bezinksel

Spoelgemaal
author of change: Marinus Vonhof
date of change: 2025-01-16
definition: Een gemaal voor het verpompen van spoelwater
author at start life: Eric van Gorkom
date of start life: 2022-09-27
validity context: 11d 12d
scope note: Cof MDS
scope note: Cof HYD
scope note: Cof RGM
type: Class
subclass of: Gemaal
subclass of: Restriction
  on property: heeft Functie
  has value: Verpompt spoelwater

Spoelleiding
author of change: Marinus Vonhof
date of change: 2016-04-28
author at start life: Marinus Vonhof
date of start life: 2015-09-20
validity context: 5d 12d
scope note: Cof MDS
type: Class
subclass of: Mechanische transportleiding
subclass of: Restriction
  on property: heeft Functie
  has value: Transport van spoelwater

Steenwolkoffer
author of change: Marinus Vonhof
date of change: 2025-01-16
date of change: 2026-07-13
definition: [IMBOR] Een constructie gevuld met steenwol waar regenwater de tijd krijgt om langzaam in de bodem opgenomen te worden.
author at start life: Marinus Vonhof
date of start life: 2020-04-17
scope note: Cof MDS
type: Class
subclass of: Infiltratiekoffer
subclass of: Restriction
  on property: heeft Uitvoering
  has value: Gevuld met steenwol

Verhardingstype
author of change: Marinus Vonhof
author of change: Eric van Gorkom
date of change: 2015-10-21
date of change: 2024-05-13
notation: AXB
notation: CXB
author at start life: Marinus Vonhof
date of start life: 2013-03-26
validity context: 5d 6d 15d
see also: [RIB] De verharding van het wegdek volgens BGT, bij wisselende verharding de dominante aanhouden.
alternative label: Verharding wegdek
comment: [is aspect]
scope note: Cof MDS
scope note: Cof RRB
scope note: Cof LDR
type: Class
subclass of: Kenmerk
subclass of: Restriction
  author of change: Marinus Vonhof
  date of change: 2015-10-31
  author at start life: Marinus Vonhof
  date of start life: 2013-03-26
  on class: Straat
  on property: has as aspect (inverse)
  max qualified cardinality: 1
subclass of: Restriction
  on property: has as reference (qualification)
  all values from: Verhardingstype (coll)

Straatnaam
author of change: Marinus Vonhof
date of change: 2017-08-31
author at start life: Marinus Vonhof
date of start life: 2012-05-06
validity context: 6d
comment: BAG / STUF-berichten - R02 Straat
see also: [NEN 5826:2002] de officiële door de gemeente vastgestelde naam van een straat
comment: [is aspect]
scope note: Cof MDS
scope note: Cof RRB
scope note: Cof LDR
type: Class
subclass of: Naam openbare ruimte
subclass of: Restriction
  author of change: Marinus Vonhof
  date of change: 2017-08-31
  author at start life: Marinus Vonhof
  date of start life: 2013-03-26
  on class: Straat
  on property: has as aspect (inverse)
  qualified cardinality: 1

Stuwrioolleiding
author of change: Finy Teitsma (Oranjewoud)
date of change: 2007-11-12
definition: Een gesloten rioolleiding met een verkleinde doorsnede om de bergingscapaciteit van het bovenstroomse rioolstelsel te benutten.
definition: [NEN 3300:1996] 1. riool met een verkleinde doorsnede om de bergingscapaciteit bovenstrooms door stuwen van afvalwater te vergroten; 2. riool om de afvoer te beperken
author at start life: Finy Teitsma (Oranjewoud)
date of start life: 2006-11-29
alternative label: Knijpriool
alternative label: Stuwriool
scope note: Cof MDS
scope note: Cof HYD
type: Class
subclass of: Vrijverval rioolleiding
subclass of: Restriction
  on property: heeft Functie
  has value: Regelen van het debiet om de bergingscapaciteit van het bovenstroomse rioolstelsel te benutten

Vrijverval leidingsegment
author of change: Marinus Vonhof
author of change: Johan Post
date of change: 2025-01-16
date of change: 2021-10-01
definition: Deel van een vrijverval rioolleiding begrensd door wijziging materiaal, wijziging afmeting of locatie appendages
author at start life: Marinus Vonhof
date of start life: 2018-12-06
scope note: Cof MDS
scope note: Cof HYD
scope note: Cof DMO
type: Class
subclass of: Vrijverval transportleiding
subclass of: Restriction
  author of change: Marinus Vonhof
  date of change: 2025-01-03
  author at start life: Marinus Vonhof
  date of start life: 2018-12-06
  on class: Transportrioolleiding
  on property: has as part (inverse)
  max qualified cardinality: 1
subclass of: Restriction
  on property: heeft Uitvoering
  has value: Deel van vrijverval transportleiding

Tunnelgemaal
author of change: Marinus Vonhof
date of change: 2025-01-16
definition: Een gemaal dat hemelwater verpompt uit een tunnel
author at start life: Marinus Vonhof
date of start life: 2018-05-03
scope note: Cof MDS
scope note: Cof HYD
scope note: Cof RGM
scope note: Cof DMO
type: Class
subclass of: Rioolgemaal
subclass of: Restriction
  on property: heeft Doel
  has value: Tunnel drooghouden
subclass of: Restriction
  on property: heeft Functie
  has value: Verpompt tunnelwater

Uitstroombak
author of change: Marinus Vonhof
date of change: 2025-01-16
definition: [IMBOR] Een uitlaatconstructie aan de onderkant voorzien van een bakconstructie, waar uitgelaten water op terecht komt.
author at start life: Marinus Vonhof
date of start life: 2018-12-05
scope note: Cof MDS
scope note: Cof HYD
scope note: Cof DMO
type: Class
subclass of: Uitlaatconstructie
subclass of: Restriction
  on property: heeft Uitvoering
  has value: Vorm van een bak

Verbeterd gemengd rioolstelsel
author of change: Marinus Vonhof
date of change: 2015-09-20
definition: [NEN 3300:1996] gemengd rioolstelsel met (rand)voorzieningen die de vuiluitworp richting oppervlaktewater beperken ten opzichte van de traditionele gemengde rioolstelsels
author at start life: Marinus Vonhof
date of start life: 2012-04-29
scope note: Cof TOP
type: Class
subclass of: Gemengd rioolstelsel
subclass of: Restriction
  on property: heeft Doel
  has value: Verminderen vuilbelasting van oppervlaktewater

Verloopstuk
author of change: Marinus Vonhof
date of change: 2017-12-13
definition: [NEN 3300:1996] hulpstuk voor het verbinden van twee buizen van dezelfde materiaalsoort maar met verschillende diameters
author at start life: Marinus Vonhof
date of start life: 2013-09-28
scope note: Cof MDS
scope note: Cof LDR
scope note: Cof PLI
scope note: Cof HYD
type: Class
subclass of: Verbindingsstuk
subclass of: Restriction
  on property: heeft Functie
  has value: Verbinden van leidingen met verschillende diameter

Vijzelgemaal
author of change: Marinus Vonhof
date of change: 2025-01-16
date of change: 2017-05-31
definition: [IMBOR] Gemaal voor het verpompen van (afval)water met behulp van een vijzel.
author at start life: Marinus Vonhof
date of start life: 2013-10-04
scope note: Cof MDS
scope note: Cof HYD
scope note: Cof RGM
scope note: Cof DMO
type: Class
subclass of: Rioolgemaal
subclass of: Restriction
  on property: heeft Technologie
  has value: Verpompen met een vijzel

Visueel inspecteren
author of change: Marinus Vonhof
date of change: 2015-08-24
definition: [NEN 3300:1996] het op directe wijze dan wel op indirecte wijze via optische hulpmiddelen inspecteren van de toestand
author at start life: Marinus Vonhof
date of start life: 2012-04-29
validity context: *f
see also: [NEN 3398:2004] op directe wijze dan wel indirecte wijze via optische hulpmiddelen inspecteren van de toestand
comment: [cfk fout]
scope note: Cof MDS
scope note: Cof EN
scope note: Cof RRB
scope note: Cof MTR
type: Class
subclass of: Inspecteren
subclass of: Restriction
  on property: heeft Technologie
  has value: Via optische hulpmiddelen

Werveloverstortput
definition: [NEN 3300:1996] een overstortput waarbij een cilindrische vorm, een spiraalachtige goot, een duikschot en een langere drempel zijn toegepast en de inhoud voor de drempel is vergroot om de vuiluitworp tijdens overstorting te beperken
author at start life: Marinus Vonhof
date of start life: 2012-04-29
scope note: Cof MDS
scope note: Cof HYD
scope note: Cof DMO
type: Class
subclass of: Verbeterde overstortput
subclass of: Restriction
  on property: heeft Structuur
  has value: Cilindrische vorm
subclass of: Restriction
  on property: heeft Uitvoering
  has value: Spiraalachtige goot

Wervelput
author of change: Marinus Vonhof
date of change: 2017-05-31
definition: [NEN-EN 752:2008] ronde mantoegankelijke put waarin een groot niveauverschil wordt overbrugd doordat het afvalwater tangentiaal wordt ingelaten en spiraalsgewijs afstroomt
author at start life: Marinus Vonhof
date of start life: 2012-04-29
scope note: Cof MDS
scope note: Cof RRB
scope note: Cof LDR
scope note: Cof REV
scope note: Cof HYD
type: Class
subclass of: Rioolput
subclass of: Restriction
  on property: heeft Uitvoering
  has value: Mantoegankelijk
subclass of: Restriction
  on property: heeft Functie
  has value: Overbruggen groot niveauverschil
subclass of: Restriction
  on property: heeft Structuur
  has value: Rond
subclass of: Restriction
  on property: heeft Uitvoering
  has value: Tangentiaal inlaten en spiraalsgewijs laten afstromen

AHN
definition: Actueel Hoogtebestand Nederland (alle versies)
validity context: 16d
comment: Was AHN2 (tm versie 1.4)
type: Wijze van inwinning (coll)

AHN1
definition: Actueel Hoogtebestand Nederland (versie 1)
validity context: 16d
type: Wijze van inwinning (coll)

AHN2
definition: Actueel Hoogtebestand Nederland (versie 2, anno 2011)
validity context: 16d
type: Wijze van inwinning (coll)

AHN3
definition: Actueel Hoogtebestand Nederland (versie 3, anno 2015)
validity context: 16d
type: Wijze van inwinning (coll)

AHN4
definition: Actueel Hoogtebestand Nederland (versie 4, anno 2020)
validity context: 16d
type: Wijze van inwinning (coll)

Afgeleid
definition: Via interpolatie, extrapolatie of berekening
validity context: 16d
type: Wijze van inwinning (coll)

Afvalwaterakkoord
definition: Productie afvalwater gebaseerd op het afvalwaterakkoord
author at start life: Johan Post
date of start life: 2022-03-27
validity context: 16d
type: Wijze van inwinning (coll)

BGT
alternative label: IMGeo of BGT
type: Wijze van inwinning (coll)

Basisregistratie Adressen en Gebouwen (BAG)
definition: Afgeleid uit gegevens van de Basisregistratie Adressen en Gebouwen (BAG)
validity context: 16d
type: Wijze van inwinning (coll)

Bruto vloeroppervlak
definition: Productie afvalwater gebaseerd op een vergunning
author at start life: Johan Post
date of start life: 2022-05-05
validity context: 16d
type: Wijze van inwinning (coll)

CBS
definition: Centraal Bureau voor de Statistiek
validity context: 16d
type: Wijze van inwinning (coll)

Drinkwaterverbruik
definition: Productie afvalwater gebaseerd op het drinkwaterverbruik
author at start life: Johan Post
date of start life: 2022-03-27
validity context: 16d
type: Wijze van inwinning (coll)

GBKN
validity context: 16d
type: Wijze van inwinning (coll)

GNSS Landmeting
author of change: Johan Post
date of change: 2024-05-01
definition: GNSS staat voor global navigation sattelite system, wat naast GPS ook het Europese Galileo, het Russische Glonass en het Chinese Beidoe omvat.
type: Wijze van inwinning (coll)

GNSS Vanuit wagen
author of change: Johan Post
date of change: 2024-05-01
definition: Bijvoorbeeld tijdens kolkenreinigen
type: Wijze van inwinning (coll)

Grondradar
author of change: Marinus Vonhof
date of change: 2025-01-16
date of change: 2024-11-07
definition: Door middel van radarmeting vanaf maaivled
definition: [IMBOR] Het gegeven over het object is ingewonnen door middel van een meetinstrument dat signalen uitzendt richting de bodem en opvangt voor het verrichten van bodemonderzoek. De situatie in de ondergrond wordt in kaart gebracht door een profiel te ontwikkelen op basis van de ontvangen signalen.
author at start life: Marinus Vonhof
date of start life: 2024-11-07
validity context: 16d
type: Wijze van inwinning (coll)

Inmeting
author of change: Marinus Vonhof
date of change: 2025-01-16
definition: Met waterpastoestel, theodoliet, meetlint
definition: [IMBOR] Het gegeven over het object is ingewonnen door middel van een nader te specificeren meetinstrument dat, bijvoorbeeld, gebruikt is om de exacte omvang of de inhoud van een object op te meten.
type: Wijze van inwinning (coll)

Inspectie
author of change: Marinus Vonhof
date of change: 2025-01-16
definition: Via uitgevoerde inspectie
definition: [IMBOR] De wijze waarop het gegeven over het object is ingewonnen is middels het beoordelen van het object in de daadwerkelijke buitenruimte.
validity context: 16d
type: Wijze van inwinning (coll)

LIDAR 3D
author at start life: Johan Post
date of start life: 2026-05-04
type: Wijze van inwinning (coll)

Luchtfoto
author of change: Marinus Vonhof
date of change: 2025-01-16
definition: [IMBOR] Het gegeven over het object is ingewonnen door middel van grootschalige fotografie vanuit een helikopter, vliegtuig of door een drone.
validity context: 16d
type: Wijze van inwinning (coll)

Niet kunnen achterhalen
author of change: Johan Post
date of change: 2022-09-22
definition: Een poging om het gevraagde kenmerk te achterhalen is niet succesvol geweest
validity context: 16d
type: Wijze van inwinning (coll)

Objecttype niet kunnen achterhalen
definition: Een poging om het objecttype te achterhalen is niet succesvol geweest
author at start life: Johan Post
date of start life: 2026-08-12
type: Wijze van inwinning (coll)

Plan/Ontwerp
validity context: 16d
alternative label: Plan of ontwerp
type: Wijze van inwinning (coll)

Revisie
author of change: Marinus Vonhof
date of change: 2025-01-16
definition: Via uitgevoerde revisie
definition: [IMBOR] De wijze waarop het gegeven over het object is ingewonnen is middels gegevens die zijn ontvangen aangaande de herziening van het object of de omgeving.
validity context: 16d
type: Wijze van inwinning (coll)

Schatting
author of change: Marinus Vonhof
date of change: 2025-01-16
definition: [IMBOR] Het gegeven over het object is ingewonnen door middel van een bepaling met een bepaalde onzekerheid van welke aard dan ook.
validity context: 16d
type: Wijze van inwinning (coll)

Sensor (inwinning)
validity context: 16d
type: Wijze van inwinning (coll)

Vergunning
author of change: Marinus Vonhof
date of change: 2025-01-16
definition: Productie afvalwater gebaseerd op een vergunning
definition: [IMBOR] Een document dat een officiële toestemming van de overheid om een bepaalde activiteit uit te voeren vastlegt ter raadpleging door derden.
author at start life: Johan Post
date of start life: 2022-03-27
validity context: 16d
type: Wijze van inwinning (coll)

Waterpassing
definition: Een specificatie van inmeting
author at start life: Marinus Vonhof
date of start life: 2025-10-07
type: Wijze van inwinning (coll)

Biologisch reinigen
type: Technologie

Direct transport door pompen zonder opvang in een ontvangput/kelder
type: Technologie

Fysisch reinigen
type: Technologie

Over bestaande leiding gebouwd
type: Technologie

Infiltreren
type: Technologie

Mechanisch
type: Technologie

Via onderdruk
type: Technologie

Transport onder overdruk of onderdruk
type: Technologie

Statisch
type: Technologie

Transport door de zwaartekracht
type: Technologie

Verpompen met een vijzel
type: Technologie

Via optische hulpmiddelen
type: Technologie

Aangebracht tijdens fabricage leiding
type: Uitvoering

Afgedopt
type: Uitvoering

Afzonderlijk aangebrachte segmenten
type: Uitvoering

Bak of put
type: Uitvoering

Reservoir zonder lozing
type: Uitvoering

Verdiept terrein met waterdoorlatende bodem
type: Uitvoering

Bekleding buitenzijde object
type: Uitvoering

Bekleding met doek
type: Uitvoering

Beplante/begroeide laagte
type: Uitvoering

Uitgevoerd als leiding
type: Uitvoering

In de berm
type: Uitvoering
type: Toepassing

Beton
label: Concrete @en
author of change: Marinus Vonhof
date of change: 2025-01-16
definition: [IMBOR] Een kunstmatig, steenachtig materiaal dat veelal is samengesteld uit het bindmiddel cement en uit een of meer toeslagmaterialen zoals zand, grind of steenslag.
notation: BET
notation: AG
notation: BETON
type: Uitvoering
type: Mechanisme
type: Materiaal deksel (coll)
type: Materiaal leiding (coll)
type: Materiaal put (coll)

Bevat fysisch reinigende voorziening
type: Uitvoering

Put met speciale voorzieningen
type: Uitvoering

Buis in gebogen vorm
type: Uitvoering

Constructie van enige omvang
type: Uitvoering

Verbonden met de grond
type: Uitvoering

Buis aan binnenzijde leiding
type: Uitvoering

Buis uit één stuk
type: Uitvoering

Buis uit meerdere stukken
type: Uitvoering

Zeer nauw aansluitend op binnenwand
type: Uitvoering

Deel van mechanische transportleiding
type: Uitvoering

Deel van vrijverval transportleiding
type: Uitvoering

Doorlatend
type: Uitvoering

Waterdoorlatende wanden
type: Uitvoering

Met de inlaat aan de boven- en voorzijde
type: Uitvoering

Gegraven of geboorde kokervormige diepte
type: Uitvoering

Geheel van stelsels
type: Uitvoering

Opstelling pomp(en) buiten de ontvangput/kelder
type: Uitvoering

Opstelling pomp(en) in de ontvangput/kelder
type: Uitvoering

Gespoten op binnenwand
type: Uitvoering

Gevuld met grind
type: Uitvoering

Gevuld met lavasteen
type: Uitvoering

Gevuld met steenwol
type: Uitvoering

Gevuld met zand
type: Uitvoering

Heeft U-vormige omranding
type: Uitvoering

In de vorm van een greppel
type: Uitvoering

Onderdeel van de weg
type: Uitvoering

Verbonden met leiding
type: Uitvoering

Verbonden met rioolput
type: Uitvoering

Toegankelijk voor inspectie- en reinigingsapparatuur
type: Uitvoering

Verwijderbaar deksel
type: Uitvoering

Inspectieschacht op leiding
type: Uitvoering

Langere drempel
type: Uitvoering

Naar ander rioolstelsel
type: Uitvoering

Verpompt met een luchtcompressor
type: Uitvoering

Scharnierend
type: Uitvoering

Mantoegankelijk
type: Uitvoering

Staal
label: Steel @en
author of change: Marinus Vonhof
date of change: 2025-01-16
definition: [IMBOR] Een legering die bestaat uit ijzer en een geringe hoeveelheid koolstof, zodanig dat dit metaal gekarakteriseerd wordt door de eigenschap van vervormbaarheid bij verhitting.
notation: AP
notation: STAAL
notation: STL
type: Uitvoering
type: Materiaal deksel (coll)
type: Materiaal leiding (coll)
type: Materiaal put (coll)

Met de inlaat aan de bovenzijde
type: Uitvoering

Met de inlaat aan de voorzijde
type: Uitvoering

Natuurlijk of kunstmatig gebied
type: Uitvoering

Netwerk van verbonden knooppunten
type: Uitvoering

Gelegen onder maaiveld
type: Uitvoering

Uitsparing in wand
type: Uitvoering

Verpompt binnen het bouwwerk
type: Uitvoering

Verticale waterdichte constructie
type: Uitvoering

Spiraalachtige goot
type: Uitvoering

Spiraalvormig gespannen op binnenwand
type: Uitvoering

Verticaal deel aansluitend op inlaat
type: Uitvoering

Tangentiaal inlaten en spiraalsgewijs laten afstromen
type: Uitvoering

Uithardend op binnenwand
type: Uitvoering

Zonder aansluitingen
type: Uitvoering

Vorm van een bak
type: Uitvoering

Vergrote inhoud voor de drempel
type: Uitvoering

Aanvoer van afvalwater
type: Functie

Aanvoer van afvalwater vanaf een perceel
type: Functie

Aanvoer van grondwater
author at start life: Johan Post
date of start life: 2024-05-01
type: Functie

Aanvoer van hemelwater
type: Functie

Aanvoer van hemelwater en vuilwater
type: Functie

Aanvoer van vuilwater
type: Functie

Afdekken
type: Functie

Afdekken put
type: Functie

Afscheiden slib
type: Functie

Afschermen
type: Functie

Afsluiten
type: Functie

Afsluiten van leidingen
type: Functie

Afstroming herstellen
type: Functie

Beschermen tegen begroeiing
type: Functie

Inzameling van afvalwater
type: Functie

Transport van afvalwater
type: Functie

Afvoer naar kolkaansluitleiding
type: Functie

Afvoer van afvalwater naar een RWZI
type: Functie

Afvoer van hemelwater
type: Functie

Afvoeren hemelwater naar de bovengrond
author at start life: Johan Post
date of start life: 2026-05-04
type: Functie

Afvoeren hemelwater naar de ondergrond
type: Functie

Zuiveren afvalwater
see also: [Saniwijzer] Het verwijderen van schadelijke stoffen uit afvalwater
type: Functie

Beluchten of ventileren
type: Functie

Beperken debiet
type: Functie

Bezinken stoffen
type: Functie

Tijdelijke berging van afvalwater
type: Functie

Regeling van de afvoer van het afvalwater
type: Functie

Bij calamiteit afvalwater afvoeren
type: Functie

Bluswater leveren
type: Functie

Verbinden van leidingen in een hoek
type: Functie

Inzamelen hemelwater en afgifte aan ondergrond
type: Functie

Inzameling van grondwater
type: Functie

Inzameling van hemelwater
type: Functie

Transport van grondwater
type: Functie

Transport van hemelwater
type: Functie

Toegankelijk houden
type: Functie

Toegang geven voor doorspoelen
type: Functie

Dragen van licht verkeer
type: Functie

Dragen van zwaar verkeer
type: Functie

Transport van vuilwater
type: Functie

Verbinding tussen oppervlaktewater
type: Functie

Duikers aansluiten
type: Functie

Voorkomen van explosie
type: Functie

Lozen buiten het stelsel
type: Functie

Verpompen van water
type: Functie

Inzameling van vuilwater
type: Functie

Inzameling van hemelwater en vuilwater
type: Functie

Tijdelijke berging van hemelwater en vuilwater
type: Functie

Transport van hemelwater en vuilwater
type: Functie

Hemelwater afvoeren naar ondergrond
type: Functie

Tijdelijke berging van hemelwater
type: Functie

Verbinden aansluitleiding met rioolput of rioolleiding
type: Functie

Toegang geven tot het rioolstelsel
type: Functie

Toegang verschaffen
type: Functie

Lozen binnen het stelsel
type: Functie

Keren van water
type: Functie

Opvang van afstromend hemelwater
type: Functie

Leiding gescheiden laten kruisen
type: Functie

Voorkomen dat stromen elkaar raken
type: Functie

Reinigen afvalwater
type: Functie

Voortgeleiding van materie
type: Functie

Leidingaansluiting verstevigen
type: Functie

Leidingen aansluiten
type: Functie

Lozen afvalwater
type: Functie

Overtollig afvalwater laten wegstromen
type: Functie

Verbinden van twee leidingen
type: Functie

Zonder toestandswijziging
type: Functie

Toegang geven tot aansluitleiding
type: Functie

Opslag van hemelwater
type: Functie

Opslag van water
type: Functie

Overbruggen groot niveauverschil
type: Functie

Overbruggen hoogteverschil
type: Functie

Verbinden van leidingen met verschillend materiaal of verbindingstype
type: Functie

Transport van overstortend afvalwater
type: Functie

Perceelaansluitpunt met inlaat verbinden
type: Functie

Verpompen van afvalwater
type: Functie

Regelen van het debiet om de bergingscapaciteit van het bovenstroomse rioolstelsel te benutten
type: Functie

Verwijderen vervuiling
type: Functie

Rioolleidingen aansluiten
type: Functie

Verpompt spoelwater
type: Functie

Transport van spoelwater
type: Functie

Waterniveau in stelsel regelen
type: Functie

Tijdelijke berging van vuilwater
type: Functie

Verpompt tunnelwater
type: Functie

Uitstroom van afvalwater naar oppervlaktewater
type: Functie

Verbinden van leidingen
type: Functie

Verbinden van leidingen met verschillende diameter
type: Functie

Verminderen vuilbelasting van oppervlaktewater
type: Doel

Verwijderen bezinksel
type: Doel

Goed blijven functioneren
validity context: 5d 11d
type: Doel

Ontstoppen
type: Doel

Perceel aansluiten op rioolstelsel
type: Doel

Tunnel drooghouden
type: Doel

Aansluiting ontbreekt
type: Toepassing

Calamiteit
type: Toepassing

Deel van een op zichzelf staande constructie
type: Toepassing

Onderdeel van een leiding
type: Toepassing

Is overdrachtspunt
type: Toepassing

Sluit aan op RWS-bandprofiel
type: Toepassing

Vulling van de constructie
type: Toepassing

Omstorting van de constructie
type: Toepassing

Gietijzer
label: Cast iron @en
author of change: Marinus Vonhof
date of change: 2025-01-16
definition: [IMBOR] Een in vormen gegoten legering van ijzer, koolstof, mangaan en silicium.
notation: AM
notation: GIJ
type: Materiaal deksel (coll)
type: Materiaal leiding (coll)
type: Materiaal put (coll)

Grijs gietijzer
label: Grey cast iron @en
author of change: Marinus Vonhof
date of change: 2025-01-16
definition: [IMBOR] Een grijskleurig, in vormen gegoten legering van ijzer, koolstof, mangaan en silicium.
notation: AN
type: Materiaal deksel (coll)
type: Materiaal leiding (coll)
type: Materiaal put (coll)

Nodulair gietijzer
label: Ductile cast iron @en
author of change: Marinus Vonhof
date of change: 2025-01-16
definition: [IMBOR] Een materiaal waarin koolstof in gesloten nodulen aanwezig is in het ijzer.
notation: AO
type: Materiaal deksel (coll)
type: Materiaal leiding (coll)
type: Materiaal put (coll)

Roestvast staal
label: Stainless steel @en
author of change: Marinus Vonhof
date of change: 2025-01-16
definition: [IMBOR] Afkorting van roestvast staal, een verzamelnaam voor legeringen die hoofdzakelijk uit ijzer bestaan met minimaal 11 tot 12% chroom en maximaal 1,2% koolstof.
notation: C
alternative label: RVS
alternative label: Roestvaststaal
alternative label: Roestvrijstaal
type: Materiaal deksel (coll)
type: Materiaal leiding (coll)

Dubbele steekmof
author of change: Marinus Vonhof
date of change: 2025-01-16
definition: [IMBOR] Verbindingsstuk waar de te verbinden leidingdelen van tegengestelde kanten in gestoken worden.
comment: Aangepast, hoort niet in collectie LDR (20201027)
type: Verbindingstype (coll)

Flensverbinding
author of change: Marinus Vonhof
date of change: 2025-01-16
definition: [IMBOR] Vlakke, platte uiteinden van de te verbinden delen zijn aaneengeschroefd.
definition: [NEN 3300:1996] verbinding van flenzen van buizen met behulp van bouten, moeren en pakkingring
type: Verbindingstype (coll)

Glijverbinding
author of change: Marinus Vonhof
date of change: 2025-01-16
definition: Mof/spie verbinding met vaste rubberring
definition: [IMBOR] Twee delen zijn verbonden doordat het een deel met een vervormbare rand in het andere glijdt en daarna uitzet en achter de opening haakt.
definition: [NEN 3300:1996] waterdichte buisverbinding met een rubberring die tijdens de totstandkoming van de verbinding is gefixeerd
type: Verbindingstype (coll)

Lasverbinding
author of change: Marinus Vonhof
date of change: 2025-01-16
definition: [IMBOR] Een middels lassen tot stand gebrachte koppeling van twee delen.
definition: [NEN 3300:1996] Verbinding door samensmelting van twee buiseinden
comment: 20151014: NEN3300-definitie aangepast
type: Verbindingstype (coll)

Lijmverbinding
definition: [NEN 3300:1996] Starre verbinding van een mof- en spie-eind door middel van lijm
comment: 20151014: NEN3300-definitie aangepast
type: Verbindingstype (coll)

Mof/spie
author of change: Marinus Vonhof
date of change: 2025-01-16
definition: Algemene mof/spie verbinding, ongeacht extra voorzienigen zoals rubbering
definition: [IMBOR] Een buisdeel dat twee buizen verbindt onder een bepaalde hoek, meestal negentig graden of meer, met een verwijd uiteinde. Een geheel dat waterdicht is, wordt gerealiseerd door een ring gemaakt van rubber om het spie-eind van de buis. Dit uiteinde wordt in mof geduwd, waardoor de ring over het spie-einde de verbinding waterdicht maakt.
notation: B
type: Verbindingstype (coll)

Rolverbinding
author of change: Marinus Vonhof
date of change: 2025-01-16
definition: Mof/spie met rubberring welke rolt binnen een bepaalde afstand kan bewegen afhankelijk van de spelende krachten
definition: [IMBOR] Verbinding op basis van een ring die om een spie wordt aangebracht voor spie-spie of mof-spie verbindingen, waarbij de rolring door de wanden van de ontvangende buis wordt uitgerold en afgevlakt en als zodanig een watervaste verbinding vormt.
definition: [NEN 3300:1996] verbinding met een rubberring die tijdens de totstandkoming van de verbinding tussen mof- en spie-oppervlak rolt
type: Verbindingstype (coll)

Trekvaste koppeling
definition: [NEN 3300:1996] verbinding waarbij de onderdelen door middel van een opsluitconstructie niet uit elkaar kunnen worden getrokken
type: Verbindingstype (coll)

Vaar/moer
definition: De voorloper van de mof/spie verbinding waarbij de verbinding in-situ waterdicht is gemaakt door middel van specie, touw, asfaltband of asbest houdende materialen
notation: A
type: Verbindingstype (coll)

Asfalt
author of change: Marinus Vonhof
date of change: 2025-01-16
definition: [IMBOR] Een samengesteld materiaal met als delen mineraal aggregaat en bitumen. Het is een veelgebruikt materiaal voor wegen en oppervlakteverhardingen.
notation: B
type: Verhardingstype (coll)

Beton (verharding)
notation: C
type: Verhardingstype (coll)

Elementen verharding
type: Verhardingstype (coll)

Kasseien
notation: H
type: Verhardingstype (coll)

Klinkers
notation: A
type: Verhardingstype (coll)

Mager beton
notation: I
type: Verhardingstype (coll)

Onverhard
author of change: Marinus Vonhof
date of change: 2025-01-16
definition: [IMBOR] Type van verhardingsobject: een object zonder specifieke verharding, bestaande uit natuurlijke materialen.
notation: F
type: Verhardingstype (coll)

Steenslag
author of change: Marinus Vonhof
date of change: 2025-01-16
definition: [IMBOR] Een gebroken steen, van zowel natuursteen als puin. Doordat het gesteente gebroken is, heeft het geen rond oppervlak, waardoor de stenen niet zo makkelijk wegglijden.
definition: [IMBOR] Gebroken steen, van zowel natuursteen als puin. Doordat het gesteente gebroken is, heeft het geen rond oppervlak, waardoor de stenen niet zo makkelijk wegglijden. Hierdoor is het goed bruikbaar als oppervlakteverhardingsmateriaal voor wandelpaden.
notation: G
type: Verhardingstype (coll)

Stelconplaten
notation: E
alternative label: Stelconplaat
type: Verhardingstype (coll)

Tegels
notation: D
alternative label: Tegel
type: Verhardingstype (coll)

Eivormig
label: Egg shaped @en
author of change: Marinus Vonhof
date of change: 2025-01-16
definition: Met de brede zijde bovenaan
definition: [IMBOR] Elliptisch.
notation: C
notation: EIV
type: Vorm leiding (coll)

Eivormig omgekeerd
definition: Met de brede zijde onderaan
notation: EIG
type: Vorm leiding (coll)

Heul
label: Arch shaped @en
author of change: Marinus Vonhof
date of change: 2025-01-16
definition: [EN13508-2+A1] Circular soffit and flat invert with parallel sides @en
definition: [EN13508-2+A1] Cirkelvormige bovenkant en vlakke bodem met evenwijdige zijden
definition: [IMBOR] Het object is boogvormig en is met een platte onderzijde aan de ondergrond bevestigd.
notation: E
notation: HEU
type: Vorm leiding (coll)

Muil
label: Mouth profile @en
author of change: Marinus Vonhof
date of change: 2025-01-16
definition: [IMBOR] Het object heeft een liggend ellipsprofiel, waarbij de bovenzijde ronder is dan de onderzijde.
notation: MVR
type: Vorm leiding (coll)

Ovaal
label: Oval @en
author of change: Marinus Vonhof
date of change: 2025-01-16
definition: [EN13508-2+A1] Cirkelvormige bodem en bovenkant (met gelijke middellijn) met evenwijdige zijden
definition: [IMBOR] Een afgeplatte of uitgerekte cirkel.
definition: [Wikipedia] Ellips vorm, gevormd door alle punten waarvoor de som van de afstanden tot twee gekozen punten, de brandpunten, een vaste waarde heeft.
notation: F
notation: OVA
comment: Bron afbeelding: nl.wikipedia.org
type: Vorm leiding (coll)

Rechthoekig
label: Rectangular @en
author of change: Marinus Vonhof
date of change: 2025-01-16
date of change: 2025-12-19
definition: [IMBOR] Een vierhoek met louter rechte hoeken.
notation: B
notation: RHK
alternative label: Kokerprofiel
type: Vorm leiding (coll)
type: Vorm opening (coll)
type: Vorm put (coll)
type: Vorm deksel (coll)

Rond
label: Circular @en
author of change: Marinus Vonhof
author of change: Johan Post
date of change: 2025-01-16
date of change: 2022-09-29
date of change: 2024-04-30
date of change: 2025-12-19
date of change: 2024-07-15
date of change: 2024-05-20
definition: [IMBOR] Cirkelvormig en zonder hoeken.
notation: A
notation: RND
type: Vorm leiding (coll)
type: Vorm opening (coll)
type: Vorm put (coll)
type: Structuur
type: Vorm deksel (coll)

Trapezium
author of change: Marinus Vonhof
date of change: 2026-07-13
definition: In het geval van een leidingvorm: Gesloten of open leidingprofiel. Als er geen profiel-geometrie is meegegeven geldt: de breedte leiding = bodembreedte, de hellingshoek aan beide zijden = 45 graden. De hoogte leiding bepaalt dan de bovenbreedte.
definition: Trapeziumvormig
notation: TPZ
type: Vorm leiding (coll)

U-vorm
label: U-shape @en
author of change: Marinus Vonhof
date of change: 2025-01-16
definition: In het geval van een leidingvorm: Omgekeerd heul profiel, cirkelvormige onderkant
definition: [IMBOR] De vorm van de letter U hebbende.
notation: D
notation: UVR
type: Vorm leiding (coll)

Anders (vorm)
author of change: Marinus Vonhof
date of change: 2025-12-19
definition: Als de vorm van het object niet rechthoeking of rond is. Vul bij de afmeting de grootste waarden in.
type: Vorm opening (coll)
type: Vorm put (coll)

Asbestcement
label: Asbestos cement @en
author of change: Marinus Vonhof
date of change: 2025-01-16
date of change: 2024-08-20
definition: [IMBOR] Een samengeperst en versteend mengsel van cementmateriaal en soms zand waarin 10 tot 15% asbestvezels (golfplaten, vlakke platen) en bij standleidingen 15 tot 30% als versterking verwerkt zijn. (Bron: Wikipedia)
notation: AA
notation: BET
validity context: 16d
type: Materiaal deksel (coll)
type: Materiaal leiding (coll)
type: Materiaal put (coll)

Epoxy
author of change: Marinus Vonhof
date of change: 2025-01-16
definition: [IMBOR] Een thermohardende kunststof waarmee vezelmateriaal geïmpregneerd kan worden.
notation: AT
type: Materiaal deksel (coll)
type: Materiaal leiding (coll)
type: Materiaal put (coll)
type: Materiaal lining (coll)

Glasvezel versterkte kunststof
label: Fibre reinforced plastics @en
author of change: Marinus Vonhof
date of change: 2025-01-16
definition: [IMBOR] Een kunststof die is versterkt met een haarfijne vezel gemaakt van glas.
notation: AL
notation: GVK
alternative label: GVK
type: Materiaal deksel (coll)
type: Materiaal leiding (coll)
type: Materiaal put (coll)
type: Materiaal lining (coll)

Gewapend beton
label: Reinforced concrete @en
author of change: Marinus Vonhof
date of change: 2025-01-16
definition: [IMBOR] Beton waarin een versterkende constructie is aangebracht.
definition: [IMBOR] Beton waarin een versterkende constructie, vaak in de vorm van een metalen raster, is aangebracht.
notation: BET
notation: AH
notation: GBT
type: Materiaal deksel (coll)
type: Materiaal leiding (coll)
type: Materiaal put (coll)

Vezelcement
label: Fibre cement @en
author of change: Marinus Vonhof
date of change: 2025-01-16
definition: [IMBOR] Een voornamelijk uit mineralen bestaand materiaal waar versterkingsvezels in aangebracht zijn en veelal gebruikt wordt voor gevelplaten en gevelstroken.
notation: AK
type: Materiaal deksel (coll)
type: Materiaal leiding (coll)
type: Materiaal put (coll)
type: Materiaal lining (coll)

Polyester
author of change: Marinus Vonhof
date of change: 2025-01-16
definition: [IMBOR] Een polymeer dat bestaat uit een keten van esterbindingen en dat zowel thermoplastisch als thermohardend kan zijn.
notation: HPE
notation: AU
type: Materiaal deksel (coll)
type: Materiaal leiding (coll)
type: Materiaal put (coll)
type: Materiaal lining (coll)

Polyetheen
label: Polyethylene @en
author of change: Marinus Vonhof
date of change: 2025-01-16
definition: [IMBOR] De meest gebruikte kunststof, bestaande uit etheen dat gepolymeriseerd is.
notation: HPE
notation: AV
notation: PE
alternative label: PE
type: Materiaal deksel (coll)
type: Materiaal leiding (coll)
type: Materiaal put (coll)
type: Materiaal lining (coll)

Polypropyleen
label: Polypropylene @en
author of change: Marinus Vonhof
date of change: 2025-01-16
definition: [IMBOR] Een thermoplastisch polymeer dat sterker is dan polyetheen en ontstaat uit de polymerisatie van propeen.
notation: HPE
notation: AW
notation: PP
type: Materiaal deksel (coll)
type: Materiaal leiding (coll)
type: Materiaal put (coll)
type: Materiaal lining (coll)

PVC
label: Polyvinyl chloride @en
author of change: Marinus Vonhof
date of change: 2025-01-16
definition: [IMBOR] Een veelvuldig toegepaste thermoplast die ontstaat na polymerisatie van vinylchloride.
notation: AX
notation: PVC
alternative label: PVC-U @en
alternative label: Polyvinylchloride
type: Materiaal deksel (coll)
type: Materiaal leiding (coll)
type: Materiaal put (coll)
type: Materiaal lining (coll)

Polymeerbeton
label: Polymer concrete @en
author of change: Johan Post
date of change: 2026-05-04
definition: [IMBOR] Beton waarbij kunststof is toegevoegd om het sterker en chemisch bestendiger te maken
type: Materiaal deksel (coll)
type: Materiaal leiding (coll)
type: Materiaal lining (coll)

Gres
author of change: Marinus Vonhof
date of change: 2025-01-16
definition: [IMBOR] Een keramisch materiaal dat gemaakt is van een kleisoort die tegen hoge temperaturen bestand is. (Bron: Wikipedia)
notation: GRE
notation: GRES
type: Materiaal leiding (coll)
type: Materiaal put (coll)

HDPE
author of change: Marinus Vonhof
date of change: 2025-01-16
definition: [IMBOR] Een afkorting van 'high-density polyethylene,' een thermoplastisch polymeer met een goede verhouding tussen de kracht en de dichtheid van het materiaal.
notation: HDPE
notation: HPE
alternative label: Hogedichtheidpolyetheen
type: Materiaal leiding (coll)
type: Materiaal put (coll)
type: Materiaal lining (coll)

Metselwerk (baksteen)
label: Brickwork @en
author of change: Marinus Vonhof
date of change: 2025-01-16
definition: [IMBOR] Gebakken klinkers die met cement of een variant daarop aan elkaar verbonden zijn.
notation: MSW
notation: AD
type: Materiaal leiding (coll)
type: Materiaal put (coll)

Metselwerk (bepleisterd)
label: Masonry (coursed) @en
author of change: Marinus Vonhof
date of change: 2025-01-16
definition: [IMBOR] Gebakken klinkers die met cement of een variant daarop aan elkaar verbonden zijn en waar een pleisterlaag (een smeerbaar materiaal ten behoeve van de afwerking) op is aangebracht.
notation: MSW
notation: AR
type: Materiaal leiding (coll)
type: Materiaal put (coll)

Metselwerk (onbepleisterd)
label: Masonry (uncoursed) @en
author of change: Marinus Vonhof
date of change: 2025-01-16
definition: [IMBOR] Gebakken klinkers die met cement of een variant daarop aan elkaar verbonden zijn en waar geen pleisterlaag (een smeerbaar materiaal ten behoeve van de afwerking) op is aangebracht.
notation: MSW
notation: AS
type: Materiaal leiding (coll)
type: Materiaal put (coll)

Plaatijzer
author of change: Marinus Vonhof
date of change: 2025-01-16
definition: [IMBOR] IJzer dat in de vorm van een plaat is gedrukt.
notation: PIJ
type: Materiaal leiding (coll)

Cementmortel
label: Cement mortar @en
author of change: Marinus Vonhof
date of change: 2025-01-16
definition: [IMBOR] Een mengsel van cement en water.
definition: [IMBOR] Een samenstelling van cement, kalk en zand met water vermengd tot een mortel, welke dient voor het metselen en pleisteren.
notation: B
notation: AF
type: Materiaal leiding (coll)
type: Materiaal put (coll)
type: Voegmateriaal (coll)
type: Materiaal lining (coll)

Beton met stalen kern
type: Materiaal leiding (coll)

Betonnen segmenten
label: Concrete segments @en
notation: AJ
alternative label: Betonnen segment
type: Materiaal leiding (coll)
type: Materiaal put (coll)
type: Materiaal lining (coll)

Bitumen
author of change: Marinus Vonhof
date of change: 2025-01-16
definition: [IMBOR] Een bij kamertemperatuur vast mengsel van koolwaterstoffen die voorkomen in aardolie, dat een belangrijk bestandsdeel van asfalt is.
notation: AB
type: Materiaal leiding (coll)
type: Materiaal put (coll)

Gespoten beton
label: Sprayed concrete @en
definition: [IMBOR] Betonspecie die onder druk door een slang op een dragend oppervlak wordt gespoten, zodat het daarop sterk kan verharden.
notation: AI
type: Materiaal leiding (coll)
type: Materiaal put (coll)

Glad staal
type: Materiaal leiding (coll)

Klei
label: Clay @en
author of change: Marinus Vonhof
date of change: 2025-01-16
definition: [IMBOR] Grond die voor meer dan 25% bestaat uit lutumdeeltjes.
definition: [IMBOR] Verschijningsvorm van grondsoort, grond voor meer dan 25% bestaat uit lutumdeeltjes.
notation: AE
type: Materiaal leiding (coll)
type: Materiaal put (coll)

Zwavelbeton
definition: een betonsoort waarbij het aandeel cement en water vervangen is door gemodificeerd zwavel als bindmiddel. Dit geeft een CO2 reductie en maakt het geschikt voor chemisch agressieve omgevingen
author at start life: Johan Post
date of start life: 2026-07-02
type: Materiaal leiding (coll)
type: Materiaal put (coll)

Mergel
definition: [IMBOR] Een sedimentair gesteente dat voor 25-75% uit kalk bestaat en voor het restant uit klei.
author at start life: Johan Post
date of start life: 2026-05-04
type: Materiaal leiding (coll)
type: Materiaal put (coll)

Rubber
author of change: Marinus Vonhof
date of change: 2025-01-16
definition: [IMBOR] Een polymeer dat voorkomt als een emulsie in het sap van een aantal plantensoorten, zoals sommige bomen uit de familie Hevea.
type: Materiaal leiding (coll)

Voorgespannen Beton
type: Materiaal leiding (coll)
type: Materiaal put (coll)

Dichtingsmassa
author of change: Marinus Vonhof
date of change: 2025-01-16
definition: [IMBOR] Speciale kunststof voor het afdichten van voegen.
notation: A
type: Voegmateriaal (coll)

Voegenkit
author of change: Marinus Vonhof
date of change: 2025-01-16
definition: [IMBOR] Mogelijk asbesthoudend opvulmateriaal.
notation: C
comment: Mogelijk asbesthoudend. Indien de aan/afwezigheid van asbest bekend is, kies dan het specifieke type uit de lijst voegmaterialen.
type: Voegmateriaal (coll)

Compriband
author of change: Marinus Vonhof
date of change: 2025-01-16
definition: [IMBOR] Een band die na aanbrengen uitzet en daardoor de vorm van de omgeving aanneemt.
notation: D
type: Voegmateriaal (coll)

Geen
author of change: Marinus Vonhof
date of change: 2025-01-16
definition: [IMBOR] De waarden uit de suggestielijst of vaste lijst van het attribuut zijn niet van toepassing bij dit specifieke object.
notation: H
type: Voegmateriaal (coll)

Kunststofring
author of change: Marinus Vonhof
date of change: 2025-01-16
definition: [IMBOR] Een ringvormig element van kunststof vult de voeg op.
notation: F
alternative label: Kunststof ring
type: Voegmateriaal (coll)

Rubberring
author of change: Marinus Vonhof
date of change: 2025-01-16
definition: [IMBOR] Een ringvormig element van rubber vult de voeg op.
notation: E
alternative label: Rubberen ring
type: Voegmateriaal (coll)

Voegenkit, asbesthoudend
comment: Werkzaamheden aan asbesthoudende voegenkit vallen onder risicoklasse 1 indien de werkinstructie 'Verwijderen van rioleringselementen met asbesthoudende voegenkit' wordt gevolgd. Zie de website van Stichting RIONED
type: Voegmateriaal (coll)

Voegenkit, (mogelijk) asbesthoudend
author of change: Marinus Vonhof
date of change: 2025-01-16
definition: [IMBOR] Kit die gebruikt wordt voor het voegen van leidingen mogelijk asbesthoudend.
notation: G
comment: Indien de aan/afwezigheid van asbest bekend is, kies dan het specifieke type uit de lijst voegmaterialen.
type: Voegmateriaal (coll)

Voegenkit, niet asbesthoudend
type: Voegmateriaal (coll)

Voegenkit, (mogelijk) teerhoudend
type: Voegmateriaal (coll)

Cilindrische vorm
type: Structuur

Gesloten
type: Structuur

Datatransport (thema)
author of change: Marinus Vonhof
date of change: 2025-01-07
see also: [IMKL: 1.1/2008] De elektronische overdracht van signaalinformatie tussen punten via kabels die deel uitmaken van een net. NB: De aansluitleiding kan ook alleen op (huis)aansluitschetsen voorkomen.
alternative label: Datatransport
type: WIBON thema (coll)

Hoogspanning (thema)
author of change: Marinus Vonhof
date of change: 2025-01-07
see also: [IMKL: 1.1/2008] Toestand waarin het mogelijk is een elektrische stroom te creëren; HS = hoogspanning (36 tot en met 220 kV). Opmerking: In de praktijk kunnen netten vanaf 20 kV t/m 220 kV op de HS themakaart voorkomen.
alternative label: Hoogspanning
type: WIBON thema (coll)

Laagspanning (thema)
author of change: Marinus Vonhof
date of change: 2025-01-07
definition: NB: De aansluitleiding kan ook alleen op (huis)aansluitschetsen voorkomen. Opmerking: In de praktijk kunnen netten tot en met 1000 Volt op de LS themakaart voorkomen.
see also: [IMKL: 1.1/2008] LS kabel bestaat uit hoofdnet en aansluitnet. LS = laagspanning (230 V en 400 V)
alternative label: Laagspanning
type: WIBON thema (coll)

Middenspanning (thema)
author of change: Marinus Vonhof
date of change: 2025-01-07
definition: NB: De aansluitleiding kan ook alleen op (huis)aansluitschetsen voorkomen. Opmerking: In de praktijk kunnen netten van 400 Volt op de MS themakaart voorkomen.
see also: [IMKL: 1.1/2008] MS kabel bestaat uit hoofdnet en aansluitnet. MS = middenspanning (0,4 kV tot 30 kV)
alternative label: Middenspanning
type: WIBON thema (coll)

Riool onder druk (thema)
author of change: Marinus Vonhof
date of change: 2025-01-07
see also: [IMKL: 1.1/2008] Riolering waarbij het transport plaatsvindt door overdruk (uit NEN 3300, Buitenriolering).
alternative label: RioolOnderOverOfOnderdruk
type: WIBON thema (coll)

Riool vrijverval (thema)
author of change: Marinus Vonhof
date of change: 2025-01-07
see also: [IMKL: 1.1/2008] Riool waardoor afvalwater door de zwaartekracht wordt getransporteerd (uit NEN 3300, Buitenriolering).
alternative label: RioolVrijverval
type: WIBON thema (coll)

Wees (thema)
author of change: Marinus Vonhof
date of change: 2025-01-07
see also: [IMKL: 1.1/2008] Alle onbekende leidingen welke bij een eerdere grondroering zijn geconstateerd, die ook na onderzoek niet aan een beheerder waren toe te wijzen en waarvoor de gemeente ingevolge de WIBON de beheerdersverplichtingen vervult.
alternative label: Wees
type: WIBON thema (coll)

Gepland
type: Status maatregel (coll)

In uitvoering
author of change: Marinus Vonhof
date of change: 2025-01-16
definition: [IMBOR] Het project wordt momenteel uitgevoerd.
type: Status maatregel (coll)

In voorbereiding
author of change: Marinus Vonhof
date of change: 2025-01-16
definition: [IMBOR] Gevormd object waarvan de voor vervulling van de functie noodzakelijke reële objecten nog niet gereed zijn.
type: Status maatregel (coll)

Uitgevoerd
author of change: Marinus Vonhof
date of change: 2025-01-16
definition: [IMBOR] De status van het project is dat het project in het verleden is voltooid.
type: Status maatregel (coll)

Vervallen
author of change: Marinus Vonhof
date of change: 2025-01-16
definition: [IMBOR] Het object is in werkelijkheid niet langer aanwezig.
type: Status maatregel (coll)