Deelmodel Kengetallen, filter collectie_DMOTOP_v1.7
type: Ontology
version info: Deelmodel Kengetallen, filter op CoFs DMO TOP, versie=1.7 (2026-08-26T14:11:04)

has as aspect
type: ObjectProperty

has as output (inverse)
type: ObjectProperty
inverse of: has as output

has as aspect (inverse)
type: ObjectProperty
inverse of: has as aspect

has as reference (qualification)
type: ObjectProperty
type: FunctionalProperty

has as part (inverse)
type: ObjectProperty
inverse of: has as part

has as input
type: ObjectProperty

has as output
type: ObjectProperty

has as part
type: ObjectProperty

is connected to
type: ObjectProperty
type: SymmetricProperty

heeft Functie
type: ObjectProperty
range: Functie

has as input (inverse)
type: ObjectProperty
inverse of: has as input

heeft Doel
validity context: 6d
type: ObjectProperty
range: Doel

is represented by
author of change: Marinus Vonhof
date of change: 2026-07-23
comment: Vanaf versie 1.7.0 is deze relatie niet meer functioneel. Documentatie is representatie ipv kenmerk geworden, daarmee kan een subject meerdere representaties (symbool, revisietekening) hebben.
type: ObjectProperty

heeft Uitvoering
validity context: 6d
type: ObjectProperty
range: Uitvoering

heeft Technologie
validity context: 6d
type: ObjectProperty
range: Technologie

heeft Mechanisme
validity context: 6d
type: ObjectProperty
range: Mechanisme

heeft Toepassing
validity context: 6d
type: ObjectProperty
range: Toepassing

heeft Structuur
validity context: 6d
type: ObjectProperty
range: Structuur

is represented by (inverse)
type: ObjectProperty
inverse of: is represented by

author of change
type: AnnotationProperty
range: string

date of change
type: AnnotationProperty
range: date

author at start life
type: AnnotationProperty
range: string

date of start life
type: AnnotationProperty
range: date

units of measurements
type: AnnotationProperty

validity context
type: AnnotationProperty

has as value
type: FunctionalProperty
type: DatatypeProperty

Breedte leiding (datatype)
type: Datatype
equivalent class: Datatype
  on datatype: integer
  with restrictions:
    min inclusive: 63
  with restrictions:
    max inclusive: 4000

Breedte put (datatype)
type: Datatype
equivalent class: Datatype
  on datatype: integer
  with restrictions:
    min inclusive: 300
  with restrictions:
    max inclusive: 4000

Diameter leiding (datatype)
type: Datatype
equivalent class: Datatype
  on datatype: integer
  with restrictions:
    min inclusive: 63
  with restrictions:
    max inclusive: 4000

Hoogte leiding (datatype)
type: Datatype
equivalent class: Datatype
  on datatype: integer
  with restrictions:
    min inclusive: 63
  with restrictions:
    max inclusive: 4000

Hoogte put (datatype)
type: Datatype
equivalent class: Datatype
  on datatype: integer
  with restrictions:
    min inclusive: 500
  with restrictions:
    max inclusive: 4000

Lengte leiding (datatype)
type: Datatype
equivalent class: Datatype
  on datatype: decimal
  with restrictions:
    min inclusive: 1
  with restrictions:
    max inclusive: 75

Lengte put (datatype)
type: Datatype
equivalent class: Datatype
  on datatype: integer
  with restrictions:
    min inclusive: 300
  with restrictions:
    max inclusive: 4000

Wandruwheid (datatype)
type: Datatype
equivalent class: Datatype
  on datatype: integer
  with restrictions:
    min inclusive: 0
  with restrictions:
    max inclusive: 99

Z-coördinaat (datatype)
type: Datatype
equivalent class: Datatype
  on datatype: decimal
  with restrictions:
    min inclusive: -20
  with restrictions:
    max inclusive: 325

Vorm leiding
label: Shape @en
author of change: Marinus Vonhof
date of change: 2015-05-29
definition: [EN13508-2+A1] The shape of the cross-section of the pipeline as follows @en
notation: ACA
notation: GCA
author at start life: Marinus Vonhof
date of start life: 2012-05-01
comment: Intrinsiek aspect
comment: [is aspect]
scope note: Cof TOP
type: Class
subclass of: Vorm
subclass of: Restriction
  author of change: Marinus Vonhof
  date of change: 2015-10-31
  author at start life: Finy Teitsma (Oranjewoud)
  date of start life: 2006-02-25
  validity context: *t
  on class: Leiding
  on property: has as aspect (inverse)
  max qualified cardinality: 1
subclass of: Restriction
  author at start life: Marinus Vonhof
  date of start life: 2015-10-30
  on class: Inwinning
  on property: has as aspect
  max qualified cardinality: 1

Hoogte leiding
label: Height @en
author of change: Marinus Vonhof
date of change: 2019-01-24
definition: De bij het materiaal gebruikelijke aanduiding van de hoogte van een leiding (zie diameter leiding)
definition: [EN13508-2+A1] The height of the section in millimetres @en
notation: ACB
notation: GCB
author at start life: Marinus Vonhof
date of start life: 2011-12-15
units of measurements: mm
comment: Intrinsiek aspect
comment: [is aspect]
scope note: Cof TOP
type: Class
subclass of: Hoogte
subclass of: Restriction
  author of change: Marinus Vonhof
  date of change: 2014-12-03
  author at start life: Marinus Vonhof
  date of start life: 2011-12-15
  validity context: *t
  on class: Leiding
  on property: has as aspect (inverse)
  max qualified cardinality: 1
subclass of: Restriction
  author at start life: Marinus Vonhof
  date of start life: 2024-05-16
  on class: Inwinning
  on property: has as aspect
  max qualified cardinality: 1
subclass of: Restriction
  on property: has as value
  all values from: Hoogte leiding (datatype)

Breedte leiding
label: Width @en
author of change: Marinus Vonhof
date of change: 2019-01-24
definition: De bij het materiaal gebruikelijke aanduiding van de breedte van een leiding (zie diameter leiding)
definition: [EN13508-2+A1] The width of the section in millimetres. (Not required where both dimensions are the same -e.g. circle) @en
notation: ACC
notation: GCC
author at start life: Marinus Vonhof
date of start life: 2013-09-17
units of measurements: mm
comment: Intrinsiek aspect
comment: [is aspect]
scope note: Cof TOP
type: Class
subclass of: Breedte
subclass of: Restriction
  author of change: Marinus Vonhof
  date of change: 2015-05-29
  author at start life: Marinus Vonhof
  date of start life: 2011-12-15
  validity context: *t
  on class: Leiding
  on property: has as aspect (inverse)
  max qualified cardinality: 1
subclass of: Restriction
  author at start life: Marinus Vonhof
  date of start life: 2024-05-16
  on class: Inwinning
  on property: has as aspect
  max qualified cardinality: 1
subclass of: Restriction
  on property: has as value
  all values from: Breedte leiding (datatype)

Materiaal leiding
label: Material sewer @en
author of change: Johan Post
date of change: 2022-09-29
definition: De bouwstof van de leiding
definition: [EN13508-2+A1] The material of the fabric of the sewer, in accordance with Table C.4. Where the pipeline has been lined the material recorded is the material of the original pipeline @en
notation: ACD
notation: GCD
author at start life: Marinus Vonhof
date of start life: 2013-09-17
comment: Intrinsiek aspect
alternative label: Leidingmateriaal
comment: [is aspect]
scope note: Cof TOP
type: Class
subclass of: Materiaal
subclass of: Restriction
  author of change: Marinus Vonhof
  date of change: 2015-06-01
  author at start life: Finy Teitsma (Oranjewoud)
  date of start life: 2006-02-25
  validity context: *t
  on class: Leiding
  on property: has as aspect (inverse)
  max qualified cardinality: 1
subclass of: Restriction
  on property: has as reference (qualification)
  all values from: Materiaal leiding (coll)
subclass of: Restriction
  on class: Inwinning
  on property: has as aspect
  max qualified cardinality: 1

Wijze van inwinning (coll)
author of change: Johan Post
date of change: 2022-11-25
comment: [is coll]
scope note: Cof TOP
type: Class
subclass of: Verzameling soorten
subclass of: Class
  one of: Grondradar
  one of: Afgeleid
  one of: Niet kunnen achterhalen
  one of: Objecttype niet kunnen achterhalen
  one of: Basisregistratie Adressen en Gebouwen (BAG)
  one of: Inmeting
  one of: Inspectie
  one of: CBS
  one of: Luchtfoto
  one of: BGT
  one of: GBKN
  one of: AHN
  one of: AHN1
  one of: AHN2
  one of: AHN3
  one of: AHN4
  one of: GNSS Landmeting
  one of: GNSS Vanuit wagen
  one of: LIDAR 3D
  one of: Plan/Ontwerp
  one of: Revisie
  one of: Sensor (inwinning)
  one of: Schatting
  one of: Aantal i.e.

Technologie
author of change: Marinus Vonhof
date of change: 2021-01-09
definition: Bij activiteit: werkwijze, eisen
author at start life: Nic Roest (Idoro)
date of start life: 2008-03-11
validity context: 6d
comment: Onderscheidend kenmerk
comment: [is aspect]
scope note: Cof TOP
type: Class
subclass of: Onderscheidend kenmerk

Uitvoering
author of change: Marinus Vonhof
date of change: 2021-01-09
definition: Materiaal, afwerking, vorm
author at start life: Nic Roest (Idoro)
date of start life: 2008-03-11
validity context: 6d
comment: Onderscheidend kenmerk
comment: [is aspect]
scope note: Cof TOP
type: Class
subclass of: Onderscheidend kenmerk

NEN 3300 Term
definition: Term uit de NEN 3300:1996 die verder niet wordt toegepast (als activiteit, fysiek object, ...) in dit datamodel
author at start life: Marinus Vonhof
date of start life: 2022-09-30
validity context: *d
scope note: Cof BAS
scope note: Cof DMO
type: Class
subclass of: Informatiedrager

Datum
author of change: Marinus Vonhof
date of change: 2025-01-16
date of change: 2017-11-16
definition: [IMBOR] Aanduiding van een bepaalde dag volgens een kalender.
author at start life: Marinus Vonhof
date of start life: 2015-02-28
units of measurements: yyyy-mm-dd
comment: [is aspect]
scope note: Cof TOP
type: Class
subclass of: Kenmerk
subclass of: Restriction
  on property: has as value
  all values from: date

Afstand
author of change: Marinus Vonhof
date of change: 2015-02-28
author at start life: Nic Roest (Idoro)
date of start life: 2006-03-03
comment: [is aspect]
scope note: Cof TOP
type: Class
subclass of: Kenmerk

Aansluiting
author of change: Marinus Vonhof
date of change: 2018-10-17
definition: Het geheel van overdrachtspunt, leiding en inlaat voor de aanvoer van afvalwater
author at start life: Marinus Vonhof
date of start life: 2015-02-28
validity context: 3d 5d 10f 11d 13d 14f 15d
scope note: Cof TOP
type: Class
subclass of: Fysiek object
subclass of: Restriction
  author of change: Marinus Vonhof
  date of change: 2016-04-22
  author at start life: Marinus Vonhof
  date of start life: 2014-03-15
  on class: Vrijverval rioolstelsel
  on property: has as part (inverse)
  qualified cardinality: 1
subclass of: Restriction
  author of change: Marinus Vonhof
  date of change: 2020-02-17
  author at start life: Marinus Vonhof
  date of start life: 2019-05-15
  on class: Registratief gebied
  on property: has as part (inverse)
  max qualified cardinality: 1
subclass of: Restriction
  author at start life: Marinus Vonhof
  date of start life: 2019-05-15
  on class: Ondergrond
  on property: has as part (inverse)
  max qualified cardinality: 1
subclass of: Restriction
  author at start life: Marinus Vonhof
  date of start life: 2019-05-15
  on class: Straat
  on property: has as part (inverse)
  max qualified cardinality: 1
subclass of: Restriction
  author at start life: Marinus Vonhof
  date of start life: 2024-07-16
  on class: Maaiveldoriëntatie
  on property: is connected to
  max qualified cardinality: 1
subclass of: Restriction
  on property: heeft Functie
  has value: Aanvoer van afvalwater

Maatregel
author of change: Marinus Vonhof
date of change: 2018-12-10
definition: [IRIS-RIOKEN:2012] Activiteiten die worden uitgevoerd ter verbetering van werken
author at start life: Marinus Vonhof
date of start life: 2013-03-26
validity context: 1f 3f 5d 10f 11d 12f 14f
scope note: Cof TOP
type: Class
subclass of: Activiteit
subclass of: Restriction
  author of change: Marinus Vonhof
  date of change: 2018-05-01
  author at start life: Marinus Vonhof
  date of start life: 2013-03-26
  validity context: 1t 3t 12t
  on class: Datum maatregel
  on property: has as aspect
  max qualified cardinality: 1

Kenmerk
author of change: Marinus Vonhof
author of change: Wouter van Riel
date of change: 2024-04-22
date of change: 2017-11-16
definition: Eigenschap van iets
definition: [Gellish] Is an individual object that is a phenomenon that is possessed by a totality and cannot exist without the existence of its possessor. It is an intrinsic, non-separable facet of its possessor @en
author at start life: Marinus Vonhof
date of start life: 2013-09-03
validity context: *f
scope note: Cof TOP
type: Class

Verzameling soorten
author of change: Marinus Vonhof
date of change: 2017-11-16
author at start life: Marinus Vonhof
date of start life: 2014-07-11
comment: collection of qualitative aspects is specialisatie van collection of classes
alternative label: Collectie kenmerkwaarden
alternative label: Domeinwaarden
alternative label: Verzameling kenmerkwaarden
scope note: Cof TOP
type: Class

Activiteit
author of change: Marinus Vonhof
date of change: 2025-01-16
date of change: 2016-09-16
definition: [Gellish] Is a deed (a performance by changing a state of affairs) by carrying out an action or pattern of behavior. @en
definition: [IMBOR] Iets dat mogelijk of daadwerkelijke gebeurt in ruimte en tijd.
author at start life: Marinus Vonhof
date of start life: 2011-12-02
validity context: 1f 3f 5d 6d 10f 11d 12f 14f 15d
scope note: Cof TOP
type: Class

Functie
author of change: Marinus Vonhof
date of change: 2025-01-16
date of change: 2021-01-09
definition: Wat doet het
definition: [IMBOR] Een activiteit die het externe gedrag beschrijft van het object die de activiteit uitvoert.
author at start life: Marinus Vonhof
date of start life: 2013-09-03
comment: Onderscheidend kenmerk
comment: [is aspect]
scope note: Cof TOP
type: Class
subclass of: Onderscheidend kenmerk

Doel
author of change: Marinus Vonhof
date of change: 2021-01-09
definition: Bij activiteit: wat te bereiken
author at start life: Marinus Vonhof
date of start life: 2014-04-29
validity context: 6d
comment: Onderscheidend kenmerk
comment: [is aspect]
scope note: Cof TOP
type: Class
subclass of: Onderscheidend kenmerk

Hoogte t.o.v. NAP
author of change: Marinus Vonhof
author of change: Eric van Gorkom
date of change: 2015-05-29
date of change: 2024-05-13
date of change: 2024-05-20
date of change: 2024-07-12
definition: Conform coordinatenstelsel EPSG:5709
definition: Hoogte aangegeven t.o.v. NAP
author at start life: Nic Roest (Idoro)
date of start life: 2006-02-21
units of measurements: m
alternative label: Normaal Amsterdams Peil
comment: [is aspect]
scope note: Cof TOP
type: Class
subclass of: Kenmerk
subclass of: Restriction
  on property: has as value
  all values from: Z-coördinaat (datatype)

Pomp
author of change: Marinus Vonhof
author of change: Johan Post
date of change: 2017-08-31
date of change: 2024-04-30
definition: Een technische installatie die het afvalwater onder druk transporteert.
notation: PMP
author at start life: Finy Teitsma (Oranjewoud)
date of start life: 2007-10-23
validity context: 1d 10d 12d
see also: Vervallen link: https://imgeo.geostandaarden.nl/def/imgeo-object/installatie/pomp-niet-bgt
see also: [IHW:20130706] Werktuig dat door middel van een verschil in druk vloeistoffen of gassen verplaatst
see also: [IMGeo:1.0/2007] Werktuig dat door middel van een verschil in druk vloeistoffen of gassen verplaatst.
see also: [IRIS-RIOKEN:2012] Werktuig dat door middel van een verschil in druk vloeistoffen of gassen verplaatst.
alternative label: Pomp (type installatie)
scope note: Cof MDS
scope note: Cof REV
scope note: Cof HYD
scope note: Cof RGM
scope note: Cof DMO
type: Class
subclass of: Constructieonderdeel
subclass of: Restriction
  author of change: Marinus Vonhof
  date of change: 2016-04-15
  author at start life: Finy Teitsma (Oranjewoud)
  date of start life: 2006-02-25
  on class: Pompput
  on property: has as part (inverse)
  max qualified cardinality: 1
subclass of: Restriction
  author of change: Marinus Vonhof
  date of change: 2017-08-19
  author at start life: Finy Teitsma (Oranjewoud)
  date of start life: 2006-02-25
  on class: Gemaal
  on property: has as part (inverse)
  max qualified cardinality: 1
subclass of: Restriction
  author of change: Marinus Vonhof
  date of change: 2018-05-03
  author at start life: Marinus Vonhof
  date of start life: 2012-04-22
  validity context: 5t 11t 14t
  on class: Onderdeeloriëntatie
  on property: has as aspect
  max qualified cardinality: 1
subclass of: Restriction
  on property: heeft Technologie
  has value: Door middel van drukverschil
subclass of: Restriction
  on property: heeft Technologie
  has value: Mechanisch
subclass of: Restriction
  on property: heeft Functie
  has value: Verplaatsen van water

Toepassing
author of change: Marinus Vonhof
date of change: 2021-01-09
definition: Proces waarin iets gebruikt wordt, waarom
author at start life: Nic Roest (Idoro)
date of start life: 2008-03-11
validity context: 6d
comment: Onderscheidend kenmerk
comment: [is aspect]
scope note: Cof TOP
type: Class
subclass of: Onderscheidend kenmerk

Fysiek object
label: Physical object @en
author of change: Eric van Gorkom
date of change: 2021-10-01
definition: [Gellish] That is a distribution of matter or energy in time and space that satisfies the laws of physics. All kinds of physical objects are subtypes of this class. It is the top of the hierarchical network of specializations of kinds of physical objects. @en
definition: [NEN 2660] Een object dat bestaat of kan bestaan binnen de fysieke 4D ruimte-tijd. Het vormt een manifestatie en een afbakening van materie en/of energie, en is (in)direct waarneembaar door de zintuigen.
author at start life: Marinus Vonhof
date of start life: 2013-09-03
validity context: *f
scope note: Cof TOP
type: Class
subclass of: Restriction
  author of change: Marinus Vonhof
  date of change: 2017-05-31
  date of change: 2023-01-16
  author at start life: Marinus Vonhof
  date of start life: 2015-07-27
  on class: Rioleringsbeheerder
  on property: has as input (inverse)
  max qualified cardinality: 1
subclass of: Restriction
  author at start life: Marinus Vonhof
  date of start life: 2013-09-28
  validity context: 14t 15t
  on class: Begindatum
  on property: has as aspect
  max qualified cardinality: 1
subclass of: Restriction
  author at start life: Marinus Vonhof
  date of start life: 2013-09-28
  on class: Einddatum
  on property: has as aspect
  max qualified cardinality: 1
subclass of: Restriction
  author at start life: Marinus Vonhof
  date of start life: 2017-05-31
  on class: Eigenaar
  on property: has as input (inverse)
  max qualified cardinality: 1
subclass of: Restriction
  author at start life: Marinus Vonhof
  date of start life: 2023-01-16
  on class: Gegevensbeheerder
  on property: has as input (inverse)
  max qualified cardinality: 1
subclass of: Restriction
  on property: has as part
  all values from: Class
    union of: Ruimte
    union of: Fysiek object
disjoint with: Ruimte

Vrijverval rioolstelsel
label: Name of sewer system @en
author of change: Marinus Vonhof
author of change: Johan Post
author of change: Eric van Gorkom
author of change: Wouter van Riel
date of change: 2026-05-01
date of change: 2024-04-22
date of change: 2026-07-17
date of change: 2024-05-13
definition: Een rioolstelsel waarbij het transport door middel van de zwaartekracht plaatsvindt
definition: [EN13508-2+A1] The name of the sewer system, or a sewer system reference as specified by the employing authority @en
definition: [NEN-EN 752:2008] systeem van aansluitleidingen of een buitenriolering waarin het afvalwater door de zwaartekracht wordt getransporteerd en waar de leiding is ontworpen om onder normale omstandigheden deels gevuld te zijn [EN 1085:2007, definitie 2260]
notation: AAP
notation: CAP
notation: GAP
notation: JAP
author at start life: Finy Teitsma (Oranjewoud)
date of start life: 2006-02-17
validity context: *f
comment: 20151014: NEN3300-definitie aangepast
alternative label: Stelsel onder vrij verval
scope note: Cof TOP
type: Class
subclass of: Rioolstelsel
subclass of: Restriction
  author of change: Marinus Vonhof
  date of change: 2016-04-22
  author at start life: Marinus Vonhof
  date of start life: 2014-03-15
  comment: 20160415: Inverse = optioneel, niet elke specialisatie zit in vv stelsel
  on class: Aansluiting
  on property: has as part
  min qualified cardinality: 1
subclass of: Restriction
  author at start life: Johan Post
  date of start life: 2026-05-01
  on class: Vrijverval transportleiding
  on property: has as part
  min qualified cardinality: 0
subclass of: Restriction
  author at start life: Marinus Vonhof
  date of start life: 2024-05-16
  on class: Overnamepunt
  on property: has as part
  max qualified cardinality: 1
subclass of: Restriction
  on property: heeft Functie
  has value: Tijdelijke berging van afvalwater
subclass of: Restriction
  on property: heeft Technologie
  has value: Transport door de zwaartekracht

Registratief gebied
author of change: Marinus Vonhof
date of change: 2015-10-30
author at start life: Marinus Vonhof
author at start life: Nic Roest (Idoro)
date of start life: 2007-11-29
validity context: 1f 3f 5d 10f 11d 12f 14f
comment: [VervallenLink http://definities.geostandaarden.nl/concepten/imgeo/doc/begrip/RegistratiefGebied]
see also: [IMGeo:1.0/2007] Op basis van wet- en regelgeving afgebakend gebied dat als eenheid geldt van politiek/bestuurlijke verantwoordelijkheid of voor bedrijfsvoering.
see also: [NEN 3610:2010] Op basis van wet- of regelgeving afgebakend gebied dat als eenheid geldt van politiek/bestuurlijke verantwoordelijkheid of voor bedrijfsvoering.
alternative label: Registratieve ruimte
scope note: Cof BAS
scope note: Cof DMO
type: Class
subclass of: Gebied
subclass of: Restriction
  author of change: Marinus Vonhof
  date of change: 2020-02-17
  author at start life: Marinus Vonhof
  date of start life: 2019-05-15
  on class: Aansluiting
  on property: has as part
  min qualified cardinality: 0
subclass of: Restriction
  author at start life: Marinus Vonhof
  date of start life: 2018-12-12
  on class: Bouwwerk
  on property: has as part
  min qualified cardinality: 0
subclass of: Restriction
  author at start life: Marinus Vonhof
  date of start life: 2018-12-12
  on class: Leiding
  on property: has as part
  min qualified cardinality: 0
subclass of: Restriction
  author at start life: Marinus Vonhof
  date of start life: 2018-12-12
  on class: Put
  on property: has as part
  min qualified cardinality: 0
subclass of: Restriction
  author at start life: Marinus Vonhof
  date of start life: 2019-05-15
  on class: Stelsel
  on property: has as part
  min qualified cardinality: 0

Ondergrond
author at start life: Marinus Vonhof
date of start life: 2013-10-05
validity context: 1d 3d 5d 10d 11d 12d 14d 16d
comment: De ruimte 'ondergrond' bevat leiding/put, via ondergrond verwijzen naar grondsoort enz
alternative label: Bodem
scope note: Cof TOP
type: Class
subclass of: Ruimte
subclass of: Restriction
  author at start life: Marinus Vonhof
  date of start life: 2018-09-03
  on class: Bouwwerk
  on property: has as part
  min qualified cardinality: 0
subclass of: Restriction
  author at start life: Marinus Vonhof
  date of start life: 2018-09-03
  on class: Leiding
  on property: has as part
  min qualified cardinality: 0
subclass of: Restriction
  author at start life: Marinus Vonhof
  date of start life: 2018-09-03
  on class: Put
  on property: has as part
  min qualified cardinality: 0
subclass of: Restriction
  author at start life: Marinus Vonhof
  date of start life: 2019-05-15
  on class: Aansluiting
  on property: has as part
  min qualified cardinality: 0

Straat
author of change: Marinus Vonhof
author of change: Johan Post
date of change: 2025-01-16
date of change: 2018-12-05
date of change: 2026-04-30
date of change: 2024-11-26
definition: [IMBOR] Deze wegverbinding is al dan niet een openbare weg.
author at start life: Marinus Vonhof
date of start life: 2013-03-26
comment: Ruimte Straat bevat leiding,put, op die manier koppelen aan leiding enz
alternative label: Openbare weg
scope note: Cof TOP
type: Class
subclass of: Bovengrond
subclass of: Restriction
  author of change: Marinus Vonhof
  date of change: 2018-12-05
  author at start life: Marinus Vonhof
  date of start life: 2018-09-03
  on class: Bouwwerk
  on property: has as part
  min qualified cardinality: 0
subclass of: Restriction
  author of change: Marinus Vonhof
  date of change: 2018-12-11
  author at start life: Marinus Vonhof
  date of start life: 2013-10-05
  on class: Type bebouwing
  on property: has as aspect
  max qualified cardinality: 1
subclass of: Restriction
  author at start life: Marinus Vonhof
  date of start life: 2019-05-15
  on class: Aansluiting
  on property: has as part
  min qualified cardinality: 0

Maaiveldoriëntatie
author of change: Marinus Vonhof
date of change: 2018-12-05
definition: Een topologisch element dat het punt (vertex) op het maaiveld beschrijft
author at start life: Marinus Vonhof
date of start life: 2012-04-22
scope note: Cof TOP
type: Class
subclass of: Vertex
subclass of: Restriction
  author of change: Marinus Vonhof
  date of change: 2017-08-21
  author at start life: Marinus Vonhof
  date of start life: 2017-08-19
  on class: Bouwwerkoriëntatie
  on property: is connected to
  max qualified cardinality: 1
subclass of: Restriction
  author of change: Marinus Vonhof
  date of change: 2017-12-12
  author at start life: Marinus Vonhof
  date of start life: 2015-11-07
  validity context: 5t 11t
  on class: Putoriëntatie
  on property: is connected to
  max qualified cardinality: 1
subclass of: Restriction
  author of change: Marinus Vonhof
  date of change: 2018-12-12
  author at start life: Marinus Vonhof
  date of start life: 2012-04-22
  comment: Temporeel kenmerk, met kenmerk Inwinning
  on class: Maaiveldhoogte
  on property: has as aspect
  min qualified cardinality: 1
subclass of: Restriction
  author of change: Marinus Vonhof
  date of change: 2020-04-18
  author at start life: Marinus Vonhof
  date of start life: 2018-12-12
  comment: Temporeel kenmerk, met kenmerk Inwinning
  on class: Punt
  on property: has as aspect
  max qualified cardinality: 1

Kolk
author of change: Marinus Vonhof
date of change: 2019-04-04
definition: Een reservoir bestemd voor de opvang van hemelwater afkomstig van erop aangesloten oppervlakken, het laten bezinken van in dit water meegevoerde bezinkbare stoffen en de afvoer van dit water naar een rioolstelsel of naar de ondergrond
definition: [NEN 3300:1996] ingegraven bak voor de opvang van neerslag afkomstig van erop aangesloten oppervlakken, voor het laten bezinken van in dit water meegevoerde bezinkbare stoffen en voor de afvoer van dit water naar de riolering
notation: EAA
author at start life: Nic Roest (Idoro)
date of start life: 2006-03-23
validity context: 5d 11d 13d 15d
see also: Vervallen link: https://imgeo.geostandaarden.nl/def/imgeo-object/put/kolk-niet-bgt
see also: [IMGeo:1.0/2007] Open hemelwater afvoer, aangesloten op het transportnet van hemelwater.
alternative label: Afvoerput
scope note: Cof TOP
type: Class
subclass of: Put
subclass of: Restriction
  on property: heeft Functie
  has value: Bezinken stoffen
subclass of: Restriction
  on property: heeft Functie
  has value: Opvang van afstromend hemelwater

Spuikolk
definition: Een bovengrondse uitstroomvoorziening die hemelwater vanuit een ondergrondse leiding aan het maaiveld aanbiedt.
notation: EAA
author at start life: Johan Post
date of start life: 2026-05-04
alternative label: Hemelwaterbrievenbus
scope note: Cof TOP
type: Class
subclass of: Put
subclass of: Restriction
  on property: heeft Functie
  has value: Afvoeren hemelwater naar de bovengrond

Aansluitleiding
label: Drain (EN) @en
author of change: Marinus Vonhof
date of change: 2019-03-20
definition: Een leiding voor de aanvoer van afvalwater.
definition: [EN 16323:2014] pipeline, usually underground, designed to carry wastewater from a source to a sewer @en
definition: [NEN 3300:1996] Leiding tussen een gebouw of een kolk en een knooppunt of leiding
definition: [NEN-EN 752:2008] gewoonlijk ondergrondse leiding die afvalwater van een gebouw of een kolk naar een riool voert [EN 1085:2007, definitie 2250]
author at start life: Finy Teitsma (Oranjewoud)
date of start life: 2006-02-20
validity context: 5d 11d 13d 14f 15d
comment: 20151014: NEN3300-definitie aangepast
scope note: Cof TOP
type: Class
subclass of: Leiding
subclass of: Restriction
  on property: heeft Functie
  has value: Aanvoer van afvalwater

Leiding
author of change: Johan Post
author of change: Eric van Gorkom
author of change: Wouter van Riel
date of change: 2024-05-01
date of change: 2026-05-01
date of change: 2021-11-23
date of change: 2024-04-23
date of change: 2026-05-13
date of change: 2026-04-30
definition: Een geheel van geleiders welke voorzien zijn van 1 ommanteling en bestemd is voor transport van materie
author at start life: Finy Teitsma (Oranjewoud)
date of start life: 2006-02-24
validity context: *f
see also: [IMKL:1.1/2008] Holle leiding voor het doorstromen van gassen, vloeistoffen of capsules, bestemd om hetzij gas, een vloeistof of capsules te transporteren, hetzij een vloeistof als intermediair te gebruiken voor het transport van warmte of een opgeloste of verpulverde stof.
see also: [NEN 3610:2010] (Ongeldig) Buis of kabel bestemd voor de voortgeleiding van energie of materie.
alternative label: Buis
alternative label: Pijp
scope note: Cof TOP
type: Class
subclass of: Fysiek object
subclass of: Restriction
  author of change: Marinus Vonhof
  author of change: Johan Post
  date of change: 2018-12-05
  date of change: 2026-04-30
  author at start life: Marinus Vonhof
  date of start life: 2018-09-03
  on class: Bovengrond
  on property: has as part (inverse)
  max qualified cardinality: 1
subclass of: Restriction
  author of change: Marinus Vonhof
  date of change: 2015-06-01
  author at start life: Finy Teitsma (Oranjewoud)
  date of start life: 2006-02-25
  validity context: *t
  on class: Materiaal leiding
  on property: has as aspect
  max qualified cardinality: 1
subclass of: Restriction
  author of change: Marinus Vonhof
  date of change: 2015-08-24
  author at start life: Finy Teitsma (Oranjewoud)
  date of start life: 2006-02-25
  validity context: *t
  on class: Lengte leiding
  on property: has as aspect
  max qualified cardinality: 1
subclass of: Restriction
  author of change: Marinus Vonhof
  date of change: 2015-10-31
  author at start life: Finy Teitsma (Oranjewoud)
  date of start life: 2006-02-25
  validity context: *t
  on class: Vorm leiding
  on property: has as aspect
  max qualified cardinality: 1
subclass of: Restriction
  author of change: Marinus Vonhof
  date of change: 2014-12-03
  author at start life: Marinus Vonhof
  date of start life: 2011-12-15
  validity context: *t
  on class: Hoogte leiding
  on property: has as aspect
  max qualified cardinality: 1
subclass of: Restriction
  author of change: Marinus Vonhof
  date of change: 2015-04-20
  author at start life: Marinus Vonhof
  date of start life: 2014-12-03
  on class: Risicogebied
  on property: has as part (inverse)
  max qualified cardinality: 1
subclass of: Restriction
  author of change: Marinus Vonhof
  date of change: 2015-05-29
  author at start life: Marinus Vonhof
  date of start life: 2011-12-15
  validity context: *t
  on class: Breedte leiding
  on property: has as aspect
  max qualified cardinality: 1
subclass of: Restriction
  author of change: Marinus Vonhof
  date of change: 2015-06-01
  author at start life: Marinus Vonhof
  date of start life: 2011-12-15
  on class: Wandruwheid
  on property: has as aspect
  max qualified cardinality: 1
subclass of: Restriction
  author of change: Marinus Vonhof
  date of change: 2015-09-20
  author at start life: Marinus Vonhof
  date of start life: 2013-10-01
  on class: Diameter leiding
  on property: has as aspect
  max qualified cardinality: 1
subclass of: Restriction
  author at start life: Finy Teitsma (Oranjewoud)
  date of start life: 2006-02-25
  on property: has as aspect
  some values from: Lengte leiding
subclass of: Restriction
  author at start life: Finy Teitsma (Oranjewoud)
  date of start life: 2006-02-25
  on property: has as aspect
  some values from: Materiaal leiding
subclass of: Restriction
  author at start life: Finy Teitsma (Oranjewoud)
  date of start life: 2006-02-25
  on property: has as aspect
  some values from: Vorm leiding
subclass of: Restriction
  author at start life: Johan Post
  date of start life: 2026-05-13
  on class: Inwinning
  on property: has as aspect
  max qualified cardinality: 1
subclass of: Restriction
  author at start life: Marinus Vonhof
  date of start life: 2011-12-15
  on property: has as aspect
  some values from: Breedte leiding
subclass of: Restriction
  author at start life: Marinus Vonhof
  date of start life: 2011-12-15
  on property: has as aspect
  some values from: Hoogte leiding
subclass of: Restriction
  author at start life: Marinus Vonhof
  date of start life: 2012-04-22
  validity context: *t
  on class: Leidingoriëntatie
  on property: has as aspect
  max qualified cardinality: 1
subclass of: Restriction
  author at start life: Marinus Vonhof
  date of start life: 2013-02-05
  on class: Wandruwheid binnenboven
  on property: has as aspect
  max qualified cardinality: 1
subclass of: Restriction
  author at start life: Marinus Vonhof
  date of start life: 2013-02-05
  on class: Wandruwheid binnenonder
  on property: has as aspect
  max qualified cardinality: 1
subclass of: Restriction
  author at start life: Marinus Vonhof
  date of start life: 2013-10-01
  on property: has as aspect
  some values from: Diameter leiding
subclass of: Restriction
  author at start life: Marinus Vonhof
  date of start life: 2014-12-02
  on class: Status functioneren
  on property: has as aspect
  max qualified cardinality: 1
subclass of: Restriction
  author at start life: Marinus Vonhof
  date of start life: 2018-09-03
  on class: Ondergrond
  on property: has as part (inverse)
  max qualified cardinality: 1
subclass of: Restriction
  author at start life: Marinus Vonhof
  date of start life: 2018-12-12
  on class: Registratief gebied
  on property: has as part (inverse)
  max qualified cardinality: 1
subclass of: Restriction
  author at start life: Marinus Vonhof
  date of start life: 2020-04-17
  on class: WIBON thema
  on property: has as aspect
  max qualified cardinality: 1
subclass of: Restriction
  author at start life: Marinus Vonhof
  date of start life: 2026-07-20
  on class: Binnendiameter
  on property: has as aspect
  max qualified cardinality: 1
subclass of: Restriction
  author at start life: Marinus Vonhof
  date of start life: 2026-07-20
  on class: Buitendiameter
  on property: has as aspect
  max qualified cardinality: 1
subclass of: Restriction
  author at start life: Wouter van Riel
  date of start life: 2022-05-03
  on class: Afvoerpunt gebied
  on property: has as part
  max qualified cardinality: 1
subclass of: Restriction
  on property: heeft Functie
  has value: Voortgeleiding van materie

Aansluitpunt
definition: Een topologisch element (knooppunt) met de aansluitlocatie tussen leidingen, putten en open water. Een aansluitpunt kan ook de koppeling vormen tussen een leiding en een hydraulisch element (zoals een klep), het is dan het knooppunt tussen twee verbindingen.
author at start life: Marinus Vonhof
date of start life: 2017-12-12
scope note: Cof TOP
type: Class
subclass of: Knooppunt
subclass of: Restriction
  on property: heeft Functie
  has value: Aanvoer van afvalwater

Knooppunt
label: Node @en
author of change: Marinus Vonhof
author of change: Wouter van Riel
date of change: 2024-04-22
date of change: 2022-10-01
date of change: 2020-11-24
definition: De knoop binnen de netwerkdefinitie, waar verbindingen bij elkaar komen
definition: [NEN 3300:1996] Begin- of eindpunt van 1 of meer leidingen, meestal gevormd door een fysieke constructie
author at start life: Marinus Vonhof
date of start life: 2013-09-03
see also: [GFO/RIO2] Begin- of eindpunt van 1 of meer leidingen, meestal gevormd door een fysieke constructie
alternative label: Knoop
scope note: Cof TOP
type: Class
subclass of: Vertex
subclass of: Restriction
  author of change: Marinus Vonhof
  date of change: 2022-10-01
  author at start life: Marinus Vonhof
  date of start life: 2011-12-02
  on class: Beginpunt leiding
  on property: is connected to
  min qualified cardinality: 0
subclass of: Restriction
  author of change: Marinus Vonhof
  date of change: 2022-10-01
  author at start life: Marinus Vonhof
  date of start life: 2011-12-02
  on class: Eindpunt leiding
  on property: is connected to
  min qualified cardinality: 0
subclass of: Restriction
  author at start life: Wouter van Riel
  date of start life: 2022-05-04
  on class: Punt
  on property: has as aspect
  max qualified cardinality: 1

Put
author of change: Johan Post
author of change: Eric van Gorkom
date of change: 2022-09-27
date of change: 2024-05-01
date of change: 2026-05-01
date of change: 2024-05-13
date of change: 2026-04-30
date of change: 20262-05-13
author at start life: Marinus Vonhof
date of start life: 2013-07-18
validity context: *f
see also: Vervallen link: https://imgeo.geostandaarden.nl/def/imgeo-object/put
see also: [IMGeo:1.0/2007] Gegraven of geboorde kokervormige diepte waarin zich (vloei)stoffen bevinden.
scope note: Cof TOP
type: Class
subclass of: Fysiek object
subclass of: Restriction
  author of change: Johan Post
  date of change: 2018-12-05
  date of change: 2026-04-30
  author at start life: Marinus Vonhof
  date of start life: 2018-09-03
  on class: Bovengrond
  on property: has as part (inverse)
  max qualified cardinality: 1
subclass of: Restriction
  author of change: Marinus Vonhof
  date of change: 2014-08-01
  author at start life: Finy Teitsma (Oranjewoud)
  date of start life: 2006-02-25
  validity context: *t
  on class: Breedte put
  on property: has as aspect
  max qualified cardinality: 1
subclass of: Restriction
  author of change: Marinus Vonhof
  date of change: 2014-08-01
  author at start life: Finy Teitsma (Oranjewoud)
  date of start life: 2006-02-25
  validity context: *t
  on class: Hoogte put
  on property: has as aspect
  max qualified cardinality: 1
subclass of: Restriction
  author of change: Marinus Vonhof
  date of change: 2014-08-01
  author at start life: Finy Teitsma (Oranjewoud)
  date of start life: 2006-02-25
  validity context: *t
  on class: Lengte put
  on property: has as aspect
  max qualified cardinality: 1
subclass of: Restriction
  author of change: Marinus Vonhof
  date of change: 2015-06-01
  author at start life: Finy Teitsma (Oranjewoud)
  date of start life: 2007-10-24
  validity context: 5t 10t 12t 14t
  on class: Materiaal put
  on property: has as aspect
  max qualified cardinality: 1
subclass of: Restriction
  author of change: Marinus Vonhof
  date of change: 2021-08-06
  author at start life: Finy Teitsma (Oranjewoud)
  date of start life: 2006-02-25
  validity context: *t
  on class: Vorm put
  on property: has as aspect
  max qualified cardinality: 1
subclass of: Restriction
  author of change: Marinus Vonhof
  date of change: 2015-04-20
  author at start life: Marinus Vonhof
  date of start life: 2014-12-03
  on class: Risicogebied
  on property: has as part (inverse)
  max qualified cardinality: 1
subclass of: Restriction
  author at start life: Finy Teitsma (Oranjewoud)
  date of start life: 2006-02-25
  on property: has as aspect
  some values from: Breedte put
subclass of: Restriction
  author at start life: Finy Teitsma (Oranjewoud)
  date of start life: 2006-02-25
  on property: has as aspect
  some values from: Hoogte put
subclass of: Restriction
  author at start life: Finy Teitsma (Oranjewoud)
  date of start life: 2006-02-25
  on property: has as aspect
  some values from: Lengte put
subclass of: Restriction
  author at start life: Finy Teitsma (Oranjewoud)
  date of start life: 2006-02-25
  on property: has as aspect
  some values from: Vorm put
subclass of: Restriction
  author at start life: Finy Teitsma (Oranjewoud)
  date of start life: 2007-10-24
  on property: has as aspect
  some values from: Materiaal put
subclass of: Restriction
  author at start life: Johan Post
  date of start life: 2026-05-13
  on class: Inwinning
  on property: has as aspect
  max qualified cardinality: 1
subclass of: Restriction
  author at start life: Marinus Vonhof
  date of start life: 2012-04-22
  validity context: *t
  on class: Putoriëntatie
  on property: has as aspect
  max qualified cardinality: 1
subclass of: Restriction
  author at start life: Marinus Vonhof
  date of start life: 2014-12-02
  on class: Status functioneren
  on property: has as aspect
  max qualified cardinality: 1
subclass of: Restriction
  author at start life: Marinus Vonhof
  date of start life: 2018-09-03
  on class: Ondergrond
  on property: has as part (inverse)
  max qualified cardinality: 1
subclass of: Restriction
  author at start life: Marinus Vonhof
  date of start life: 2018-12-12
  on class: Registratief gebied
  on property: has as part (inverse)
  max qualified cardinality: 1
subclass of: Restriction
  author at start life: Marinus Vonhof
  date of start life: 2020-04-17
  on class: WIBON thema
  on property: has as aspect
  max qualified cardinality: 1
subclass of: Restriction
  author at start life: Marinus Vonhof
  date of start life: 2020-05-28
  on class: Adresgegevens
  on property: has as aspect
  max qualified cardinality: 1
subclass of: Restriction
  author at start life: Wouter van Riel
  date of start life: 2022-05-03
  on class: Afvoerpunt gebied
  on property: has as part
  max qualified cardinality: 1
subclass of: Restriction
  on property: heeft Uitvoering
  has value: Gegraven of geboorde kokervormige diepte

Aantal inwoners
author at start life: Marinus Vonhof
date of start life: 2021-05-10
units of measurements: pcs
comment: [is aspect]
scope note: Cof DMO
type: Class
subclass of: Kengetal
subclass of: Restriction
  author at start life: Marinus Vonhof
  date of start life: 2021-05-10
  on class: Afvoerpunt gebied
  on property: has as aspect (inverse)
  max qualified cardinality: 1
subclass of: Restriction
  author at start life: Marinus Vonhof
  date of start life: 2021-05-14
  on class: Inwinning
  on property: has as aspect
  max qualified cardinality: 1
subclass of: Restriction
  on property: has as value
  all values from: integer

Kengetal
author of change: Marinus Vonhof
date of change: 2022-10-04
author at start life: Johan Post
date of start life: 2022-05-03
comment: [is aspect]
scope note: Cof DMO
type: Class
subclass of: Kenmerk

Afvoerpunt gebied
author of change: Johan Post
date of change: 2022-10-03
date of change: 2022-11-27
date of change: 2022-10-06
date of change: 2020-12-09
definition: Een afvoerpunt dat een gebied, stelsel of systeem schematiseert door middel van kentallen over dat gebied, stelsel of systeem.
author at start life: Marinus Vonhof
date of start life: 2020-11-23
validity context: 1d 10d 12d
scope note: Cof DMO
type: Class
subclass of: Afvoerpunt
subclass of: Restriction
  author of change: Johan Post
  date of change: 2022-03-27
  author at start life: Marinus Vonhof
  date of start life: 2014-12-01
  on class: Maatgevend niveau voor berging
  on property: has as aspect
  max qualified cardinality: 1
subclass of: Restriction
  author of change: Marinus Vonhof
  date of change: 2020-11-23
  author at start life: Marinus Vonhof
  date of start life: 2018-12-17
  on class: Aantal v.e. totaal
  on property: has as aspect
  max qualified cardinality: 1
subclass of: Restriction
  author of change: Marinus Vonhof
  date of change: 2020-11-23
  author at start life: Marinus Vonhof
  date of start life: 2018-12-17
  on class: Pompovercapaciteit
  on property: has as aspect
  max qualified cardinality: 1
subclass of: Restriction
  author of change: Marinus Vonhof
  date of change: 2020-11-25
  author at start life: Marinus Vonhof
  date of start life: 2014-12-01
  on class: Verloren berging
  on property: has as aspect
  max qualified cardinality: 1
subclass of: Restriction
  author of change: Marinus Vonhof
  date of change: 2020-11-25
  author at start life: Marinus Vonhof
  date of start life: 2018-12-17
  on class: Afvoerend oppervlak
  on property: has as aspect
  max qualified cardinality: 1
subclass of: Restriction
  author of change: Marinus Vonhof
  date of change: 2020-11-25
  author at start life: Marinus Vonhof
  date of start life: 2018-12-17
  on class: DWA debiet totaal
  on property: has as aspect
  max qualified cardinality: 1
subclass of: Restriction
  author of change: Marinus Vonhof
  date of change: 2021-05-10
  author at start life: Marinus Vonhof
  date of start life: 2014-12-01
  on class: Netto berging
  on property: has as aspect
  max qualified cardinality: 1
subclass of: Restriction
  author of change: Marinus Vonhof
  date of change: 2021-05-10
  author at start life: Marinus Vonhof
  date of start life: 2014-12-01
  on class: Netto berging randvoorzieningen
  on property: has as aspect
  max qualified cardinality: 1
subclass of: Restriction
  author at start life: Johan Post
  date of start life: 2022-05-03
  on class: Invoer gebied
  on property: has as aspect
  max qualified cardinality: 1
subclass of: Restriction
  author at start life: Johan Post
  date of start life: 2022-11-27
  on class: Afvoerend oppervlak bedrijven
  on property: has as aspect
  max qualified cardinality: 1
subclass of: Restriction
  author at start life: Johan Post
  date of start life: 2022-11-27
  on class: Afvoerend oppervlak woningen
  on property: has as aspect
  max qualified cardinality: 1
subclass of: Restriction
  author at start life: Marinus Vonhof
  date of start life: 2021-05-10
  on class: Aantal inwoners
  on property: has as aspect
  max qualified cardinality: 1
subclass of: Restriction
  author at start life: Marinus Vonhof
  date of start life: 2021-05-10
  on class: Aantal v.e. bedrijven
  on property: has as aspect
  max qualified cardinality: 1
subclass of: Restriction
  author at start life: Marinus Vonhof
  date of start life: 2021-05-10
  on class: Aantal v.e. inwoners
  on property: has as aspect
  max qualified cardinality: 1
subclass of: Restriction
  author at start life: Marinus Vonhof
  date of start life: 2021-05-10
  on class: Aantal v.e. recreatie
  on property: has as aspect
  max qualified cardinality: 1
subclass of: Restriction
  author at start life: Marinus Vonhof
  date of start life: 2021-05-10
  on class: DWA debiet bedrijven
  on property: has as aspect
  max qualified cardinality: 1
subclass of: Restriction
  author at start life: Marinus Vonhof
  date of start life: 2021-05-10
  on class: DWA debiet inwoners
  on property: has as aspect
  max qualified cardinality: 1
subclass of: Restriction
  author at start life: Marinus Vonhof
  date of start life: 2021-05-10
  on class: DWA debiet recreatie
  on property: has as aspect
  max qualified cardinality: 1
subclass of: Restriction
  author at start life: Marinus Vonhof
  date of start life: 2021-05-10
  on class: Afvoercapaciteit
  on property: has as aspect
  min qualified cardinality: 0
subclass of: Restriction
  author at start life: Wouter van Riel
  date of start life: 2022-05-03
  on class: Gebied
  on property: has as part (inverse)
  max qualified cardinality: 1
subclass of: Restriction
  author at start life: Wouter van Riel
  date of start life: 2022-05-03
  on class: Gemaal
  on property: has as part (inverse)
  max qualified cardinality: 1
subclass of: Restriction
  author at start life: Wouter van Riel
  date of start life: 2022-05-03
  on class: Leiding
  on property: has as part (inverse)
  max qualified cardinality: 1
subclass of: Restriction
  author at start life: Wouter van Riel
  date of start life: 2022-05-03
  on class: Put
  on property: has as part (inverse)
  max qualified cardinality: 1
subclass of: Restriction
  author at start life: Wouter van Riel
  date of start life: 2022-05-03
  on class: Reservoir
  on property: has as part (inverse)
  max qualified cardinality: 1
subclass of: Restriction
  author at start life: Wouter van Riel
  date of start life: 2022-05-03
  on class: Stelsel
  on property: has as part (inverse)
  max qualified cardinality: 1
subclass of: Restriction
  author at start life: Wouter van Riel
  date of start life: 2022-05-03
  on class: Systeem
  on property: has as part (inverse)
  max qualified cardinality: 1
subclass of: Restriction
  author at start life: Wouter van Riel
  date of start life: 2022-12-19
  on class: HWA afvoer
  on property: has as aspect
  max qualified cardinality: 1
subclass of: Restriction
  on class: Ledigingstijd
  on property: has as aspect
  max qualified cardinality: 1
subclass of: Restriction
  on class: Vultijd
  on property: has as aspect
  max qualified cardinality: 1

Inwinning
author of change: Johan Post
date of change: 2022-11-25
date of change: 2024-05-02
definition: Informatie over het verzamelen van gegevens
author at start life: Marinus Vonhof
date of start life: 2015-10-29
comment: Kenmerken van kenmerk
alternative label: Inwinning-informatie
comment: [is aspect]
scope note: Cof TOP
type: Class
subclass of: Kenmerk
subclass of: Restriction
  author of change: Marinus Vonhof
  date of change: 2015-11-03
  author at start life: Marinus Vonhof
  date of start life: 2013-03-29
  on class: Lengte leiding
  on property: has as aspect (inverse)
  max qualified cardinality: 1
subclass of: Restriction
  author of change: Marinus Vonhof
  date of change: 2017-05-17
  author at start life: Marinus Vonhof
  date of start life: 2015-10-29
  on class: B.o.b. beginpunt leiding
  on property: has as aspect (inverse)
  max qualified cardinality: 1
subclass of: Restriction
  author of change: Marinus Vonhof
  date of change: 2017-05-17
  author at start life: Marinus Vonhof
  date of start life: 2015-10-30
  on class: Vorm put
  on property: has as aspect (inverse)
  max qualified cardinality: 1
subclass of: Restriction
  author of change: Marinus Vonhof
  date of change: 2019-04-25
  author at start life: Marinus Vonhof
  date of start life: 2015-10-29
  on class: Datum inwinning
  on property: has as aspect
  max qualified cardinality: 1
subclass of: Restriction
  author of change: Marinus Vonhof
  date of change: 2019-04-25
  author at start life: Marinus Vonhof
  date of start life: 2015-10-29
  on class: Wijze van inwinning
  on property: has as aspect
  max qualified cardinality: 1
subclass of: Restriction
  author of change: Marinus Vonhof
  date of change: 2019-04-25
  author at start life: Marinus Vonhof
  date of start life: 2015-11-03
  on class: Capaciteit
  on property: has as aspect (inverse)
  max qualified cardinality: 1
subclass of: Restriction
  author at start life: Johan Post
  date of start life: 2022-05-03
  on class: Invoer gebied
  on property: has as aspect (inverse)
  max qualified cardinality: 1
subclass of: Restriction
  author at start life: Marinus Vonhof
  date of start life: 2015-10-29
  on class: B.o.b. eindpunt leiding
  on property: has as aspect (inverse)
  max qualified cardinality: 1
subclass of: Restriction
  author at start life: Marinus Vonhof
  date of start life: 2015-10-30
  on class: Vorm leiding
  on property: has as aspect (inverse)
  max qualified cardinality: 1
subclass of: Restriction
  author at start life: Marinus Vonhof
  date of start life: 2015-11-07
  on class: Maaiveldhoogte
  on property: has as aspect (inverse)
  max qualified cardinality: 1
subclass of: Restriction
  author at start life: Marinus Vonhof
  date of start life: 2016-11-09
  on class: Geometrie
  on property: has as aspect (inverse)
  max qualified cardinality: 1
subclass of: Restriction
  author at start life: Marinus Vonhof
  date of start life: 2021-05-14
  on class: Aantal inwoners
  on property: has as aspect (inverse)
  max qualified cardinality: 1
subclass of: Restriction
  author at start life: Marinus Vonhof
  date of start life: 2021-05-14
  on class: Afvoer DWA-situatie
  on property: has as aspect (inverse)
  min qualified cardinality: 0
subclass of: Restriction
  author at start life: Marinus Vonhof
  date of start life: 2021-05-14
  on class: Afvoer HWA-situatie
  on property: has as aspect (inverse)
  min qualified cardinality: 0
subclass of: Restriction
  author at start life: Marinus Vonhof
  date of start life: 2023-01-10
  on class: Status functioneren
  on property: has as aspect (inverse)
  max qualified cardinality: 1
subclass of: Restriction
  author at start life: Marinus Vonhof
  date of start life: 2024-05-16
  on class: Breedte leiding
  on property: has as aspect (inverse)
  max qualified cardinality: 1
subclass of: Restriction
  author at start life: Marinus Vonhof
  date of start life: 2024-05-16
  on class: Diameter leiding
  on property: has as aspect (inverse)
  max qualified cardinality: 1
subclass of: Restriction
  author at start life: Marinus Vonhof
  date of start life: 2024-05-16
  on class: Hoogte leiding
  on property: has as aspect (inverse)
  max qualified cardinality: 1
subclass of: Restriction
  on class: Afvoerend oppervlak
  on property: has as aspect (inverse)
  max qualified cardinality: 1
subclass of: Restriction
  on class: DWA debiet bedrijven
  on property: has as aspect (inverse)
  max qualified cardinality: 1
subclass of: Restriction
  on class: DWA debiet inwoners
  on property: has as aspect (inverse)
  max qualified cardinality: 1
subclass of: Restriction
  on class: DWA debiet recreatie
  on property: has as aspect (inverse)
  max qualified cardinality: 1
subclass of: Restriction
  on class: DWA debiet totaal
  on property: has as aspect (inverse)
  max qualified cardinality: 1
subclass of: Restriction
  on class: Leiding
  on property: has as aspect (inverse)
  max qualified cardinality: 1
subclass of: Restriction
  on class: Materiaal leiding
  on property: has as aspect (inverse)
  max qualified cardinality: 1
subclass of: Restriction
  on class: Put
  on property: has as aspect (inverse)
  max qualified cardinality: 1

Aantal inwoners gemeente
author at start life: Marinus Vonhof
date of start life: 2014-12-01
units of measurements: pcs
comment: [is aspect]
scope note: Cof DMO
type: Class
subclass of: Kenmerk
subclass of: Restriction
  author of change: Marinus Vonhof
  date of change: 2015-03-01
  author at start life: Marinus Vonhof
  date of start life: 2014-12-01
  on class: Gemeente
  on property: has as aspect (inverse)
  max qualified cardinality: 1
subclass of: Restriction
  on property: has as value
  all values from: integer

Gemeente
author of change: Marinus Vonhof
date of change: 2025-01-16
date of change: 2020-04-18
definition: [IMBOR] De bestuurslaag onder de Nederlandse provincie bestaande uit een verzameling woonkernen met het bijbehorende gebied.
author at start life: Marinus Vonhof
date of start life: 2014-11-29
see also: [IRIS-RIOKEN:2012] Een van de Nederlandse gemeenten. Het gebied van een zelfstandig onderdeel van de staat, onder bestuur van een raad, een burgemeester en wethouders.
see also: [Saniwijzer] Kleinste eenheid van openbaar bestuur, bestuurd door een gemeenteraad en B en W (bron definitie: Van Dale)
scope note: Cof BAS
scope note: Cof PLI
scope note: Cof DMO
type: Class
subclass of: Levensvorm
subclass of: Restriction
  author of change: Marinus Vonhof
  date of change: 2015-03-01
  author at start life: Marinus Vonhof
  date of start life: 2014-12-01
  on class: Aantal inwoners gemeente
  on property: has as aspect
  max qualified cardinality: 1
subclass of: Restriction
  author of change: Marinus Vonhof
  date of change: 2015-03-01
  author at start life: Marinus Vonhof
  date of start life: 2014-12-01
  on class: Aantal woningen gemeente
  on property: has as aspect
  max qualified cardinality: 1
subclass of: Restriction
  author of change: Marinus Vonhof
  date of change: 2015-10-26
  author at start life: Marinus Vonhof
  date of start life: 2014-11-30
  on class: Gemeentelijk gebied
  on property: is connected to
  qualified cardinality: 1

Aantal v.e. bedrijven
definition: Aantal vervuilingseenheden afkomstig van bedrijven
author at start life: Marinus Vonhof
date of start life: 2021-05-10
units of measurements: pcs
comment: [is aspect]
scope note: Cof DMO
type: Class
subclass of: Kengetal
subclass of: Restriction
  author at start life: Marinus Vonhof
  date of start life: 2021-05-10
  on class: Afvoerpunt gebied
  on property: has as aspect (inverse)
  max qualified cardinality: 1
subclass of: Restriction
  on property: has as value
  all values from: integer

Aantal v.e. inwoners
definition: Aantal vervuilingseenheden afkomstig van inwoners
author at start life: Marinus Vonhof
date of start life: 2021-05-10
units of measurements: pcs
comment: [is aspect]
scope note: Cof DMO
type: Class
subclass of: Kengetal
subclass of: Restriction
  author at start life: Marinus Vonhof
  date of start life: 2021-05-10
  on class: Afvoerpunt gebied
  on property: has as aspect (inverse)
  max qualified cardinality: 1
subclass of: Restriction
  on property: has as value
  all values from: integer

Aantal v.e. recreatie
definition: Aantal vervuilingseenheden afkomstig van recreatie
author at start life: Marinus Vonhof
date of start life: 2021-05-10
units of measurements: pcs
comment: [is aspect]
scope note: Cof DMO
type: Class
subclass of: Kengetal
subclass of: Restriction
  author at start life: Marinus Vonhof
  date of start life: 2021-05-10
  on class: Afvoerpunt gebied
  on property: has as aspect (inverse)
  max qualified cardinality: 1
subclass of: Restriction
  on property: has as value
  all values from: integer

Aantal v.e. totaal
author of change: Marinus Vonhof
author of change: Johan Post
date of change: 2022-09-29
date of change: 2023-01-14
definition: Aantal vervuilingseenheden
author at start life: Marinus Vonhof
date of start life: 2020-11-23
units of measurements: pcs
comment: Bij uitwisseling van kentallen alleen vullen als één of meer details (v.e. bedrijven, inwoners, recreatie) onbekend zijn
comment: [is aspect]
scope note: Cof DMO
type: Class
subclass of: Kengetal
subclass of: Restriction
  author of change: Marinus Vonhof
  date of change: 2020-11-23
  author at start life: Marinus Vonhof
  date of start life: 2018-12-17
  on class: Afvoerpunt gebied
  on property: has as aspect (inverse)
  max qualified cardinality: 1
subclass of: Restriction
  on property: has as value
  all values from: integer

Rioolput
author of change: Marinus Vonhof
author of change: Johan Post
author of change: Wouter van Riel
date of change: 2016-08-26
date of change: 2026-05-01
date of change: 2022-12-19
date of change: 2024-04-22
definition: Een put met een verwijderbare deksel, dat toegang geeft tot de aangesloten rioolleidingen
definition: [EN13508-2+A1] The node reference of the manhole or inspection chamber as specified by the employing authority. @en
definition: [NEN 3300:1996] constructie toegang gevend tot het rioolstelsel
notation: CAA
notation: JAA
author at start life: Marinus Vonhof
date of start life: 2013-03-31
validity context: *f
alternative label: Node reference @en
scope note: Cof MLD
scope note: Cof TOP
type: Class
subclass of: Put
subclass of: Restriction
  author of change: Marinus Vonhof
  date of change: 2018-05-03
  author at start life: Finy Teitsma (Oranjewoud)
  date of start life: 2006-02-25
  on class: Breedte toegang
  on property: has as aspect
  max qualified cardinality: 1
subclass of: Restriction
  author of change: Marinus Vonhof
  date of change: 2017-03-06
  author at start life: Marinus Vonhof
  date of start life: 2014-04-29
  validity context: *t
  on class: Vrijverval rioolleiding
  on property: is connected to
  min qualified cardinality: 1
subclass of: Restriction
  author of change: Marinus Vonhof
  date of change: 2018-05-03
  date of change: 2022-10-02
  author at start life: Marinus Vonhof
  date of start life: 2014-12-02
  on class: Afvoerend oppervlak
  on property: has as aspect
  max qualified cardinality: 12
subclass of: Restriction
  author of change: Marinus Vonhof
  date of change: 2019-04-04
  author at start life: Marinus Vonhof
  date of start life: 2014-12-23
  on class: Reinigen rioolput
  on property: has as input (inverse)
  qualified cardinality: 1
subclass of: Restriction
  author at start life: Finy Teitsma (Oranjewoud)
  date of start life: 2006-02-25
  on property: has as aspect
  some values from: Breedte toegang
subclass of: Restriction
  author at start life: Marinus Vonhof
  date of start life: 2014-12-23
  validity context: *t
  comment: Relatie (kardinaliteit) uitgeschakeld voor CFK's (SHACL-syntax) (20260403) (20260824)
  on class: Reinigen rioolput
  on property: has as output (inverse)
  qualified cardinality: 1
subclass of: Restriction
  on property: heeft Functie
  has value: Leidingen aansluiten
subclass of: Restriction
  on property: heeft Functie
  has value: Rioolleidingen aansluiten
subclass of: Restriction
  on property: heeft Uitvoering
  has value: Verticale waterdichte constructie

Aantal woningen gemeente
author at start life: Marinus Vonhof
date of start life: 2014-12-01
units of measurements: pcs
comment: [is aspect]
scope note: Cof DMO
type: Class
subclass of: Kenmerk
subclass of: Restriction
  author of change: Marinus Vonhof
  date of change: 2015-03-01
  author at start life: Marinus Vonhof
  date of start life: 2014-12-01
  on class: Gemeente
  on property: has as aspect (inverse)
  max qualified cardinality: 1
subclass of: Restriction
  on property: has as value
  all values from: integer

Aantal i.e.
definition: [NEN 3300:1996] berekeningseenheid om de hoeveelheid vervuiling in afvalwater per inwoner per dag aan te geven
author at start life: Marinus Vonhof
date of start life: 2016-04-24
units of measurements: pcs
validity context: 15d
see also: [IRIS-RIOKEN:2012] Maat voor de belasting van het afvalwater met organische bestanddelen die een inwoner gemiddeld per dag produceert. Ook het afvalwater van bedrijven wordt in deze maat uitgedrukt.
alternative label: Aantal inwonerequivalenten
comment: [is aspect]
scope note: Cof BAS
scope note: Cof HYD
scope note: Cof DMO
type: Class
subclass of: Kenmerk
subclass of: Restriction
  on property: has as value
  all values from: integer

Bedrijfslocatie
author of change: Marinus Vonhof
date of change: 2017-12-07
author at start life: Marinus Vonhof
date of start life: 2014-11-30
scope note: Cof RRB
scope note: Cof LDR
scope note: Cof BAS
scope note: Cof DMO
type: Class
subclass of: Perceel

Absoluut rioolstelsel
author of change: Johan Post
date of change: 2021-10-01
definition: [NEN 3300:1996] een gemengd rioolstelsel zonder overstort, eventueel voorzien van een nooduitlaat
author at start life: Marinus Vonhof
date of start life: 2012-04-29
scope note: Cof MDS
scope note: Cof REV
scope note: Cof HYD
scope note: Cof DMO
type: Class
subclass of: Gemengd rioolstelsel
subclass of: Restriction
  on property: heeft Doel
  has value: Verminderen vuilbelasting van oppervlaktewater

Gemengd rioolstelsel
author of change: Marinus Vonhof
author of change: Johan Post
author of change: Eric van Gorkom
date of change: 2024-05-16
date of change: 2021-10-01
date of change: 2024-05-13
definition: Een vrijverval rioolstelsel bestemd voor de inzameling, het transport en de tijdelijke berging van afvalwater.
definition: [NEN 3300:1996] Rioolstelsel, waarbij afvalwater door 1 leidingstelsel wordt getransporteerd
definition: [NEN-EN 752:2008] riolering ontworpen om zowel verontreinigd afvalwater als afgestroomd hemelwater in 1 leidingstelsel te transporteren [EN 1085:2007, definitie 2110]
author at start life: Finy Teitsma (Oranjewoud)
date of start life: 2007-10-23
comment: 20151014: NEN3300-definitie aangepast
alternative label: GWA stelsel
alternative label: Gemengd stelsel
scope note: Cof TOP
type: Class
subclass of: Vrijverval rioolstelsel
subclass of: Restriction
  author at start life: Marinus Vonhof
  date of start life: 2014-11-30
  on class: Ledigingstijd
  on property: has as aspect
  max qualified cardinality: 1
subclass of: Restriction
  author at start life: Marinus Vonhof
  date of start life: 2020-05-26
  on class: Rioolgemaal
  on property: has as part
  min qualified cardinality: 0
subclass of: Restriction
  author at start life: Marinus Vonhof
  date of start life: 2021-05-10
  on class: Vultijd
  on property: has as aspect
  max qualified cardinality: 1
subclass of: Restriction
  author at start life: Marinus Vonhof
  date of start life: 2024-05-16
  on class: Externe overstortput
  on property: has as part
  min qualified cardinality: 0
subclass of: Restriction
  on property: heeft Functie
  has value: Inzameling van hemelwater en vuilwater
subclass of: Restriction
  on property: heeft Functie
  has value: Tijdelijke berging van hemelwater en vuilwater
subclass of: Restriction
  on property: heeft Functie
  has value: Transport van hemelwater en vuilwater

Levensvorm
author of change: Marinus Vonhof
date of change: 2016-04-24
definition: Iets dat in staat is tot leven
author at start life: Marinus Vonhof
date of start life: 2014-11-29
validity context: *f 15d
scope note: Cof TOP
type: Class

Waterschap
author of change: Marinus Vonhof
date of change: 2025-01-16
date of change: 2016-08-25
definition: [IMBOR] Een regionaal overheidsorgaan dat bestuurlijk verantwoordelijk is voor de waterhuishouding in een gebied.
author at start life: Marinus Vonhof
date of start life: 2014-11-30
validity context: 1d
see also: Vervallen link: https://imgeo.geostandaarden.nl/def/imgeo-object/waterschap
scope note: Cof MLD
scope note: Cof BAS
scope note: Cof PLI
scope note: Cof DMO
type: Class
subclass of: Levensvorm
subclass of: Restriction
  author at start life: Marinus Vonhof
  date of start life: 2014-12-13
  on class: Meldpunt
  on property: has as part
  max qualified cardinality: 1

Activiteit met raakvlak riolering
author of change: Marinus Vonhof
date of change: 2016-10-25
author at start life: Marinus Vonhof
date of start life: 2014-09-25
scope note: Cof DMO
type: Class
subclass of: Activiteit

Activiteit met raakvlak transportsysteem
author at start life: Marinus Vonhof
date of start life: 2014-10-22
scope note: Cof DMO
type: Class
subclass of: Activiteit

Adresgegevens
author of change: Marinus Vonhof
author of change: Johan Post
date of change: 2018-12-05
date of change: 2026-05-01
author at start life: Marinus Vonhof
date of start life: 2013-03-29
validity context: 5d 11d 15d 16d
comment: BAG / StUF-berichten - ADR Adres
see also: [NEN 5826:2002] de verzameling van gegevens voor de aanduiding van een individuele woon- of bedrijfseenheid dan wel de aanduiding van een bestemming
alternative label: Adres-informatie
comment: [is aspect]
scope note: Cof TOP
type: Class
subclass of: Kenmerk
subclass of: Restriction
  author of change: Marinus Vonhof
  date of change: 2017-12-07
  author at start life: Marinus Vonhof
  date of start life: 2013-03-29
  on class: Perceel
  on property: has as aspect (inverse)
  max qualified cardinality: 1
subclass of: Restriction
  author at start life: Eric van Gorkom
  date of start life: 2021-11-23
  on class: Gebouw
  on property: has as aspect (inverse)
  max qualified cardinality: 1
subclass of: Restriction
  author at start life: Eric van Gorkom
  date of start life: 2021-11-23
  on class: Gemaal
  on property: has as aspect (inverse)
  max qualified cardinality: 1
subclass of: Restriction
  author at start life: Eric van Gorkom
  date of start life: 2021-11-23
  on class: RWZI
  on property: has as aspect (inverse)
  max qualified cardinality: 1
subclass of: Restriction
  author at start life: Marinus Vonhof
  date of start life: 2019-05-15
  on class: Perceelaansluitpunt
  on property: has as aspect (inverse)
  max qualified cardinality: 1
subclass of: Restriction
  author at start life: Marinus Vonhof
  date of start life: 2020-05-28
  on class: Put
  on property: has as aspect (inverse)
  max qualified cardinality: 1
subclass of: Restriction
  on class: Gebouwaansluitpunt
  on property: has as aspect (inverse)
  max qualified cardinality: 1
subclass of: Restriction
  on class: Overnamepunt
  on property: has as aspect (inverse)
  max qualified cardinality: 1

Perceel
author of change: Johan Post
date of change: 2026-05-01
date of change: 2021-09-22
author at start life: Marinus Vonhof
date of start life: 2016-10-07
scope note: Cof MLD
scope note: Cof RRB
scope note: Cof LDR
scope note: Cof BAS
scope note: Cof DMO
type: Class
subclass of: Ruimte
subclass of: Restriction
  author of change: Marinus Vonhof
  date of change: 2017-12-07
  author at start life: Marinus Vonhof
  date of start life: 2013-03-29
  on class: Adresgegevens
  on property: has as aspect
  max qualified cardinality: 1
subclass of: Restriction
  author at start life: Marinus Vonhof
  date of start life: 2017-12-07
  on class: Perceelaansluitpunt
  on property: has as part
  max qualified cardinality: 1
subclass of: Restriction
  on class: Gebouwaansluitpunt
  on property: has as part
  min qualified cardinality: 0

Gebouw
author of change: Marinus Vonhof
author of change: Eric van Gorkom
date of change: 2025-01-16
date of change: 2024-05-13
date of change: 2021-12-24
definition: [IMBOR] Overdekte en geheel of gedeeltelijk met wanden omsloten constructief zelfstandige eenheid bedoeld voor het in een afgeschermde omgeving onderbrengen van mensen, dieren of voorwerpen of voor de productie van goederen.
author at start life: Nic Roest (Idoro)
date of start life: 2007-11-29
validity context: *d
see also: [NEN 3610:2010] Vrijstaande, overdekte en geheel of gedeeltelijke met wanden omsloten toegankelijke ruimte, die direct of indirect met de grond is verbonden.
scope note: Cof TOP
type: Class
subclass of: Bouwwerk
subclass of: Restriction
  author at start life: Eric van Gorkom
  date of start life: 2021-11-23
  on class: Adresgegevens
  on property: has as aspect
  max qualified cardinality: 1
subclass of: Restriction
  on property: heeft Uitvoering
  has value: Vrijstaand, overdekt, omsloten en toegankelijk

Gemaal
label: Pumping station @en
author of change: Johan Post
author of change: Eric van Gorkom
date of change: 2021-11-23
date of change: 2026-05-18
definition: Een constructie ten behoeve van het verplaatsen van water
definition: [EN 16323:2014] buildings, structures and equipment used to transfer wastewater through a rising main or otherwise to raise the wastewater @en
author at start life: Marinus Vonhof
date of start life: 2014-03-18
validity context: *f
scope note: Cof TOP
type: Class
subclass of: Bouwwerk
subclass of: Restriction
  author of change: Marinus Vonhof
  date of change: 2017-08-19
  author at start life: Finy Teitsma (Oranjewoud)
  date of start life: 2006-02-25
  comment: per definitie
  on class: Pomp
  on property: has as part
  min qualified cardinality: 1
subclass of: Restriction
  author of change: Marinus Vonhof
  date of change: 2019-07-11
  author at start life: Finy Teitsma (Oranjewoud)
  date of start life: 2006-02-25
  on class: Pompschakeling
  on property: has as aspect
  max qualified cardinality: 1
subclass of: Restriction
  author of change: Marinus Vonhof
  date of change: 2018-12-12
  author at start life: Marinus Vonhof
  date of start life: 2018-12-06
  comment: Temporeel kenmerk, met kenmerk Inwinning
  on class: Capaciteit gemaal
  on property: has as aspect
  min qualified cardinality: 1
subclass of: Restriction
  author at start life: Eric van Gorkom
  date of start life: 2021-11-23
  on class: Adresgegevens
  on property: has as aspect
  max qualified cardinality: 1
subclass of: Restriction
  author at start life: Marinus Vonhof
  date of start life: 2020-04-18
  on class: Ontwerpcapaciteit gemaal
  on property: has as aspect
  qualified cardinality: 1
subclass of: Restriction
  author at start life: Wouter van Riel
  date of start life: 2022-05-03
  on class: Afvoerpunt gebied
  on property: has as part
  max qualified cardinality: 1
subclass of: Restriction
  on property: heeft Functie
  has value: Verpompen van water

RWZI
author of change: Marinus Vonhof
author of change: Eric van Gorkom
date of change: 2021-11-23
date of change: 2021-11-30
definition: [NEN 3300:1996] Het totaal van de grond, gebouwen en apparatuur voor de zuivering van afvalwater
author at start life: Marinus Vonhof
date of start life: 2014-11-28
validity context: 1d
see also: [IRIS-RIOKEN:2012] Rioolwaterzuiveringinrichting. Het totaal van grond, bouwwerken en installaties ten behoeve van het zuiveren van afvalwater.
alternative label: AWZI
scope note: Cof BAS
scope note: Cof DMO
type: Class
subclass of: Bouwwerk
subclass of: Restriction
  author at start life: Eric van Gorkom
  date of start life: 2021-11-23
  on class: Adresgegevens
  on property: has as aspect
  max qualified cardinality: 1
subclass of: Restriction
  author at start life: Marinus Vonhof
  date of start life: 2015-06-02
  on class: Zuiveringseenheid
  on property: has as part (inverse)
  qualified cardinality: 1
subclass of: Restriction
  author at start life: Marinus Vonhof
  date of start life: 2015-07-23
  on class: Code
  on property: has as aspect
  max qualified cardinality: 1
subclass of: Restriction
  author at start life: Marinus Vonhof
  date of start life: 2020-11-25
  on class: Afvoerpunt
  on property: has as part
  max qualified cardinality: 1
subclass of: Restriction
  on property: heeft Functie
  has value: Zuiveren afvalwater

Perceelaansluitpunt
author of change: Marinus Vonhof
author of change: Johan Post
date of change: 2021-08-05
date of change: 2026-05-01
definition: Het punt dat de grens tussen de beheerverantwoordelijkheden van gemeente en de eigenaar van de terrein- en of gebouwriolering markeert
author at start life: Finy Teitsma (Oranjewoud)
date of start life: 2006-02-20
scope note: Cof BAS
scope note: Cof DMO
type: Class
subclass of: Aansluitpunt
subclass of: Restriction
  author at start life: Marinus Vonhof
  date of start life: 2013-02-05
  on class: Lozingsvergunninghouder
  on property: has as aspect
  max qualified cardinality: 1
subclass of: Restriction
  author at start life: Marinus Vonhof
  date of start life: 2013-02-05
  on class: Lozingsvergunningnummer
  on property: has as aspect
  max qualified cardinality: 1
subclass of: Restriction
  author at start life: Marinus Vonhof
  date of start life: 2017-12-07
  on class: Perceel
  on property: has as part (inverse)
  max qualified cardinality: 1
subclass of: Restriction
  author at start life: Marinus Vonhof
  date of start life: 2019-05-15
  on class: Adresgegevens
  on property: has as aspect
  max qualified cardinality: 1
subclass of: Restriction
  author at start life: Marinus Vonhof
  date of start life: 2020-04-18
  on class: Lozingseisen
  on property: has as aspect
  max qualified cardinality: 1

Gebouwaansluitpunt
definition: [NTR 3216:2012] Buiten het gebouw gelegen overgang van de gebouwriolering op de buitenriolering, gelegen op een afstand van maximaal 0,5 m vanaf het Gebouw of zoveel korter dan een zettingsconstructie in de buitenriolering vereist.
author at start life: Johan Post
date of start life: 2026-05-01
alternative label: gebouwaansluiting
scope note: Cof BAS
scope note: Cof DMO
type: Class
subclass of: Aansluitpunt
subclass of: Restriction
  author at start life: Marinus Vonhof
  date of start life: 2013-02-05
  on class: Lozingsvergunninghouder
  on property: has as aspect
  max qualified cardinality: 1
subclass of: Restriction
  author at start life: Marinus Vonhof
  date of start life: 2013-02-05
  on class: Lozingsvergunningnummer
  on property: has as aspect
  max qualified cardinality: 1
subclass of: Restriction
  author at start life: Marinus Vonhof
  date of start life: 2017-12-07
  on class: Perceel
  on property: has as part (inverse)
  max qualified cardinality: 1
subclass of: Restriction
  author at start life: Marinus Vonhof
  date of start life: 2019-05-15
  on class: Adresgegevens
  on property: has as aspect
  max qualified cardinality: 1
subclass of: Restriction
  author at start life: Marinus Vonhof
  date of start life: 2020-04-18
  on class: Lozingseisen
  on property: has as aspect
  max qualified cardinality: 1

Overnamepunt
author of change: Marinus Vonhof
author of change: Johan Post
date of change: 2026-07-15
date of change: 2024-10-21
date of change: 2024-04-27
date of change: 2024-05-14
definition: [NEN 3300:1996] locatie waar de overdracht plaatsvindt van het water uit de riolering aan de beheerder van de afvalwaterzuiveringinrichting
author at start life: Marinus Vonhof
date of start life: 2012-04-29
see also: [IRIS-RIOKEN:2012] Het punt waar de verantwoording over het afvalwater overgaat van een gemeente/bedrijf op het waterschap of omgekeerd van het waterschap naar een gemeente
alternative label: Afgiftepunt
alternative label: Inprikpunt
alternative label: Overdrachtspunt
scope note: Cof BAS
scope note: Cof DMO
type: Class
subclass of: Aansluitpunt
subclass of: Extra objecttype (rol)
subclass of: Restriction
  author of change: Marinus Vonhof
  date of change: 2015-03-01
  author at start life: Marinus Vonhof
  date of start life: 2014-10-14
  on class: Transportstelsel
  on property: has as part (inverse)
  max qualified cardinality: 1
subclass of: Restriction
  author of change: Marinus Vonhof
  date of change: 2024-05-16
  author at start life: Marinus Vonhof
  date of start life: 2015-03-01
  on class: Vrijverval rioolstelsel
  on property: has as part (inverse)
  max qualified cardinality: 1
subclass of: Restriction
  author at start life: Marinus Vonhof
  date of start life: 2024-05-16
  on class: Mechanisch rioolstelsel
  on property: has as part (inverse)
  max qualified cardinality: 1
subclass of: Restriction
  author at start life: Marinus Vonhof
  date of start life: 2026-07-14
  on class: Riooleindgemaal
  on property: has as part (inverse)
  max qualified cardinality: 1
subclass of: Restriction
  on class: Adresgegevens
  on property: has as aspect
  max qualified cardinality: 1
subclass of: Restriction
  on class: Afnameverplichting
  on property: has as aspect
  max qualified cardinality: 1
subclass of: Restriction
  on class: Lozingseisen
  on property: has as aspect
  max qualified cardinality: 1
subclass of: Restriction
  on class: Lozingsvergunninghouder
  on property: has as aspect
  max qualified cardinality: 1
subclass of: Restriction
  on class: Lozingsvergunningnummer
  on property: has as aspect
  max qualified cardinality: 1
subclass of: Restriction
  on class: Organisatie afname
  on property: has as aspect
  max qualified cardinality: 1
subclass of: Restriction
  on class: Rioleringsgebied
  on property: has as part (inverse)
  max qualified cardinality: 1
subclass of: Restriction
  on class: Transportleiding
  on property: has as part (inverse)
  max qualified cardinality: 1

Afdekking
author of change: Eric van Gorkom
date of change: 2022-09-27
author at start life: Marinus Vonhof
date of start life: 2016-04-15
validity context: 5d 10d 11d 12f 13d 14f
scope note: Cof TOP
type: Class
subclass of: Constructieonderdeel
subclass of: Restriction
  author at start life: Finy Teitsma (Oranjewoud)
  date of start life: 2006-02-25
  on property: has as aspect
  some values from: Materiaal afdekking
subclass of: Restriction
  validity context: 12t 14t
  on class: Materiaal afdekking
  on property: has as aspect
  max qualified cardinality: 1
subclass of: Restriction
  on property: heeft Functie
  has value: Afdekken

Constructieonderdeel
author of change: Marinus Vonhof
author of change: Johan Post
date of change: 2025-01-16
date of change: 2015-10-22
date of change: 2024-05-01
definition: [IMBOR] Een onderdeel van een objecttype dat als zelfstandig objecttype beheerd kan worden.
author at start life: Marinus Vonhof
date of start life: 2013-09-28
validity context: *f 15d
scope note: Cof TOP
type: Class
subclass of: Fysiek object
subclass of: Restriction
  on property: heeft Toepassing
  has value: Deel van een op zichzelf staande constructie

Materiaal afdekking
label: Material of cover @en
author of change: Marinus Vonhof
author of change: Eric van Gorkom
date of change: 2016-04-23
date of change: 2022-09-27
definition: [EN13508-2+A1] The material in accordance with Table C.4 @en
notation: CCP
notation: JCP
author at start life: Marinus Vonhof
date of start life: 2014-09-16
comment: Intrinsiek aspect
comment: [is aspect]
scope note: Cof TOP
type: Class
subclass of: Materiaal
subclass of: Restriction
  author of change: Marinus Vonhof
  date of change: 2015-02-22
  author at start life: Finy Teitsma (Oranjewoud)
  date of start life: 2006-02-25
  on class: Afdekking
  on property: has as aspect (inverse)
  max qualified cardinality: 1
subclass of: Restriction
  on property: has as reference (qualification)
  all values from: Materiaal deksel (coll)

Vrijverval rioolleiding
author of change: Johan Post
author of change: Eric van Gorkom
author of change: Wouter van Riel
date of change: 2021-11-23
date of change: 2024-04-23
date of change: 2024-10-21
definition: Een gesloten rioolleiding waarin het afvalwater door de zwaartekracht wordt getransporteerd.
definition: [NEN 3300:1996] riool waardoor afvalwater door middel van de zwaartekracht wordt getransporteerd
definition: [NEN-EN 752:2008] leiding of andere constructie, gewoonlijk ondergronds, die afvalwater vanuit meer één dan lozingspunt transporteert [EN 1085:2007, definitie 2270]
notation: AAA
notation: GAA
author at start life: Finy Teitsma (Oranjewoud)
date of start life: 2006-11-29
validity context: *f 13d
see also: [IMKL:1.1/2008] Riool waardoor afvalwater door de zwaartekracht wordt getransporteerd (uit NEN 3300, Buitenriolering).
see also: [NEN 3398:2004] verzameling buizen tussen twee putten
alternative label: Inzamelleiding
alternative label: Vrijvervalriool
scope note: Cof TOP
type: Class
subclass of: Rioolleiding
subclass of: Restriction
  author of change: Marinus Vonhof
  date of change: 2017-03-06
  author at start life: Marinus Vonhof
  date of start life: 2014-04-29
  validity context: *t
  on class: Rioolput
  on property: is connected to
  min qualified cardinality: 1
subclass of: Restriction
  author of change: Marinus Vonhof
  date of change: 2017-03-06
  author at start life: Marinus Vonhof
  date of start life: 2014-04-29
  on class: Rioolput
  on property: is connected to
  max qualified cardinality: 2
subclass of: Restriction
  author of change: Marinus Vonhof
  date of change: 2019-04-04
  author at start life: Marinus Vonhof
  date of start life: 2014-12-23
  validity context: 2t
  on class: Reinigen vrijverval leiding
  on property: has as input (inverse)
  qualified cardinality: 1
subclass of: Restriction
  author of change: Marinus Vonhof
  date of change: 2016-04-15
  author at start life: Nic Roest (Idoro)
  date of start life: 2007-11-29
  validity context: 1t 10t 12t
  on class: Vrijverval rioolstelsel
  on property: has as part (inverse)
  qualified cardinality: 1
subclass of: Restriction
  author at start life: Marinus Vonhof
  date of start life: 2014-12-23
  validity context: *t
  comment: Relatie (kardinaliteit) uitgeschakeld voor CFK's (SHACL-syntax) (20260403) (20260824)
  on class: Reinigen vrijverval leiding
  on property: has as output (inverse)
  qualified cardinality: 1
subclass of: Restriction
  on property: heeft Structuur
  has value: Gesloten
subclass of: Restriction
  on property: heeft Technologie
  has value: Transport door de zwaartekracht

Mechanisme
author of change: Marinus Vonhof
date of change: 2021-01-09
definition: Bij activiteit: waarmee
author at start life: Marinus Vonhof
date of start life: 2014-04-29
validity context: 6d
comment: Onderscheidend kenmerk
comment: [is aspect]
scope note: Cof TOP
type: Class
subclass of: Onderscheidend kenmerk

Afkoppelplan
author of change: Marinus Vonhof
date of change: 2018-12-06
definition: Een plan dat beschrijft hoe en wanneer het afvoerend oppervlak op de riolering wordt beperkt
author at start life: Marinus Vonhof
date of start life: 2014-12-01
scope note: Cof DMO
type: Class
subclass of: Informatiedrager
subclass of: Restriction
  author of change: Marinus Vonhof
  date of change: 2014-12-11
  author at start life: Marinus Vonhof
  date of start life: 2014-12-01
  on class: Basisrioleringsplan
  on property: has as part (inverse)
  max qualified cardinality: 1

Informatiedrager
author of change: Marinus Vonhof
date of change: 2013-12-01
definition: [Gellish] Is a medium intended or actually carrying physical objects from that properties information can be deducted. Typically paper that carries ink, magnetic fields on a disk or tape, electrically or optically modulated substances of electricity or light. @en
author at start life: Marinus Vonhof
date of start life: 2013-09-28
validity context: 10d 11d 12d 13d 14d 15d
scope note: Cof TOP
type: Class

Basisrioleringsplan
author of change: Marinus Vonhof
date of change: 2024-05-16
date of change: 2018-12-12
definition: [NEN 3300:1996] Voor een vergunningaanvraag opgesteld document (tekening + toelichting en berekeningen) met de huidige situatie van de riolering en de uit te voeren verbeteringsmaatregelen
definition: [Omgevingswet] Een plan waarin op gedetailleerde wijze wordt aangegeven hoe de inzameling en afvoer van afvalwater en neerslag binnen een gebied dient te gebeuren
author at start life: Marinus Vonhof
date of start life: 2014-11-29
comment: Het Basisrioleringsplan is vervangen door het Systeemoverzicht Stedelijk Water, het Basisrioleringsplan wordt daar onderdeel van
see also: [IRIS-RIOKEN:2012] Een plan waarin op gedetailleerde wijze wordt aangegeven hoe de inzameling en afvoer van afvalwater en neerslag binnen een gebied dient te gebeuren. Het BRP is de basis voor het GRP.
alternative label: BRP
scope note: Cof BAS
scope note: Cof DMO
type: Class
subclass of: Rioleringsplan
subclass of: Restriction
  author of change: Marinus Vonhof
  date of change: 2014-12-11
  author at start life: Marinus Vonhof
  date of start life: 2014-12-01
  on class: Afkoppelplan
  on property: has as part
  max qualified cardinality: 1
subclass of: Restriction
  author of change: Marinus Vonhof
  date of change: 2014-12-11
  author at start life: Marinus Vonhof
  date of start life: 2014-12-01
  on class: Infiltratiekansenkaart
  on property: has as part
  max qualified cardinality: 1
subclass of: Restriction
  author of change: Marinus Vonhof
  date of change: 2018-12-13
  author at start life: Marinus Vonhof
  date of start life: 2014-11-29
  on class: Planvorming rioleringsbeheer
  on property: has as output (inverse)
  qualified cardinality: 1
subclass of: Restriction
  author at start life: Marinus Vonhof
  date of start life: 2014-12-11
  on class: Tewor-toets
  on property: has as input (inverse)
  max qualified cardinality: 1
subclass of: Restriction
  author at start life: Marinus Vonhof
  date of start life: 2015-03-01
  on class: Locaties afgekoppeld verhard oppervlak
  on property: has as part
  max qualified cardinality: 1

Afleveringspunt
author of change: Marinus Vonhof
date of change: 2022-10-03
definition: Het laatste afvoerpunt van een afvoernetwerk als onderdeel van een RWZI
definition: [NEN 3300:1996] Locatie waar de overdracht plaatsvindt van het afvalwater uit de riolering op een zuiveringstechnisch werk
author at start life: Marinus Vonhof
date of start life: 2020-11-25
scope note: Cof DMO
type: Class
subclass of: Afvoerpunt

Afvoerpunt
author of change: Marinus Vonhof
author of change: Wouter van Riel
date of change: 2022-10-03
date of change: 2022-08-12
date of change: 2022-12-19
definition: Het begin- of eindpunt van een afvoerrelatie binnen een afvoernetwerk
author at start life: Marinus Vonhof
date of start life: 2020-11-23
validity context: 1d 10d 12d
scope note: Cof DMO
type: Class
subclass of: Knooppunt
subclass of: Restriction
  author of change: Marinus Vonhof
  date of change: 2021-05-10
  author at start life: Marinus Vonhof
  date of start life: 2020-11-23
  on class: Beginpunt afvoerrelatie
  on property: is connected to
  min qualified cardinality: 0
subclass of: Restriction
  author of change: Marinus Vonhof
  date of change: 2021-05-10
  author at start life: Marinus Vonhof
  date of start life: 2020-11-23
  on class: Eindpunt afvoerrelatie
  on property: is connected to
  min qualified cardinality: 0
subclass of: Restriction
  author of change: Marinus Vonhof
  date of change: 2021-05-10
  author at start life: Marinus Vonhof
  date of start life: 2020-11-23
  on class: Afvoernetwerk
  on property: has as part (inverse)
  qualified cardinality: 1
subclass of: Restriction
  author at start life: Wouter van Riel
  date of start life: 2022-05-03
  on class: Eigenaar
  on property: has as input (inverse)
  max qualified cardinality: 1
subclass of: Restriction
  author at start life: Wouter van Riel
  date of start life: 2022-05-03
  on class: RWZI
  on property: has as part (inverse)
  max qualified cardinality: 1

Afnameverplichting
definition: De hoeveelheid afvalwater die verplicht afgenomen wordt
author at start life: Marinus Vonhof
date of start life: 2026-07-15
units of measurements: m3/h
comment: [is aspect]
scope note: Cof BAS
scope note: Cof DMO
type: Class
subclass of: Capaciteit
subclass of: Restriction
  on class: Overnamepunt
  on property: has as aspect (inverse)
  max qualified cardinality: 1

Capaciteit
author of change: Marinus Vonhof
date of change: 2025-01-16
date of change: 2015-05-29
definition: [IMBOR] Vermogen tot opslaan of verwerken.
author at start life: Nic Roest (Idoro)
date of start life: 2006-02-21
validity context: 15d
comment: [is aspect]
scope note: Cof TOP
type: Class
subclass of: Kenmerk
subclass of: Restriction
  date of change: 2019-04-25
  author at start life: Marinus Vonhof
  date of start life: 2015-11-03
  on class: Inwinning
  on property: has as aspect
  max qualified cardinality: 1

Mechanische afsluiter
author of change: Marinus Vonhof
author of change: Johan Post
author of change: Wouter van Riel
date of change: 2026-05-21
date of change: 2024-04-22
date of change: 2019-07-11
definition: Een doorlaat met een voorziening om de stroming te regelen
author at start life: Marinus Vonhof
date of start life: 2019-05-15
validity context: 14f
alternative label: Mechanische doorlaat
scope note: Cof MDS
scope note: Cof REV
scope note: Cof PLI
scope note: Cof HYD
scope note: Cof DMO
type: Class
subclass of: Doorlaat
subclass of: Restriction
  author of change: Marinus Vonhof
  date of change: 2019-05-15
  author at start life: Marinus Vonhof
  date of start life: 2013-02-05
  on class: Identificatie telemetriesysteem
  on property: has as aspect
  max qualified cardinality: 1
subclass of: Restriction
  author of change: Marinus Vonhof
  date of change: 2020-04-17
  author at start life: Marinus Vonhof
  date of start life: 2014-12-02
  on class: Transportleiding
  on property: is connected to
  max qualified cardinality: 2
subclass of: Restriction
  author at start life: Wouter van Riel
  date of start life: 2022-09-26
  on class: Overstortput
  on property: has as part (inverse)
  max qualified cardinality: 1
subclass of: Restriction
  on property: heeft Technologie
  has value: Mechanisch

Afvalwater
label: Wastewater @en
author of change: Marinus Vonhof
author of change: Johan Post
date of change: 2017-09-08
date of change: 2024-04-30
definition: [EN 16323:2014] Water composed of any combination of water discharged from domestic, industrial or commercial premises, surface run-off and accidentally any sewer infiltration water @en
definition: [NEN 3300:1996] Alle water waarvan de houder zich - met het oog op de verwijdering daarvan - ontdoet, voornemens is zich te ontdoen of zich moet ontdoen (Opmerking: hieronder wordt dus ook afvloeiend regenwater begrepen)
definition: [NEN-EN 752:2008] Water dat is samengesteld uit een willekeurige combinatie van water dat uit woningen of uit industriële of commerciële gebouwen wordt geloosd, afstromend hemelwater en water dat onbedoeld in de riolering binnendringt [EN 1085:2007, definitie 1010]
author at start life: Marinus Vonhof
date of start life: 2014-11-29
scope note: Cof BAS
scope note: Cof DMO
type: Class
subclass of: Water
subclass of: Restriction
  author at start life: Marinus Vonhof
  date of start life: 2014-11-30
  on class: Vervuilingswaarde
  on property: has as aspect
  max qualified cardinality: 1

Water
author of change: Marinus Vonhof
date of change: 2017-09-08
author at start life: Marinus Vonhof
date of start life: 2014-11-30
scope note: Cof MDS
scope note: Cof DMO
type: Class
subclass of: Materie

Vervuilingswaarde
definition: [NEN 3300:1996] Som van het aantal inwonerequivalenten en/of het aantal vervuilingseenheden die dient als maatstaf voor de berekening van de aanslag voor de zuiveringsheffing en de belasting van de AWZI
author at start life: Marinus Vonhof
date of start life: 2014-11-30
comment: 20151014: NEN3300-definitie aangepast
see also: [IRIS-RIOKEN:2012] De hoeveelheid verontreiniging van zuurstofbindende bestanddelen en metalen in afvalwater. De vervuilingswaarde kan worden uitgedrukt in vervuilingseenheden (ve) of inwoner equivalenten (ie, alleen bij vervuiling door zuurstofbindende stoffen). afkomstig van bedrijven of huishoudens.
comment: [is aspect]
scope note: Cof DMO
type: Class
subclass of: Kenmerk
subclass of: Restriction
  author at start life: Marinus Vonhof
  date of start life: 2014-11-30
  on class: Afvalwater
  on property: has as aspect (inverse)
  max qualified cardinality: 1

Systeem
author of change: Marinus Vonhof
date of change: 2015-05-25
date of change: 2022-10-01
definition: De fysieke samenstelling van stelsels en inrichtingen die een functionele eenheid vormen
author at start life: Marinus Vonhof
date of start life: 2013-10-02
validity context: *f 10d 13d 14d 15d
scope note: Cof TOP
type: Class
subclass of: Fysiek object
subclass of: Restriction
  author at start life: Marinus Vonhof
  date of start life: 2020-04-20
  on class: Gebiedsoriëntatie
  on property: has as aspect
  max qualified cardinality: 1
subclass of: Restriction
  author at start life: Wouter van Riel
  date of start life: 2022-05-03
  on class: Afvoerpunt gebied
  on property: has as part
  max qualified cardinality: 1
subclass of: Restriction
  on property: heeft Uitvoering
  has value: Geheel van stelsels

Gescheiden systeem
author of change: Eric van Gorkom
date of change: 2022-09-27
definition: Een samengesteld vrijverval rioolstelsel waarin het vuilwater en hemelwater gescheiden van elkaar wordt ingezameld en getransporteerd.
definition: [NEN 3300:1996] rioolstelsel, waarbij afvalwater exclusief neerslag door een leidingstelsel wordt getransporteerd en neerslag door een afzonderlijk leidingstelsel rechtstreeks naar oppervlaktewater wordt afgevoerd
definition: [NEN-EN 752:2008] riolering die gewoonlijk bestaat uit twee leidingstelsels, waarbij het ene stelsel afvalwater en het andere afgestroomd hemelwater transporteert [EN1085:2007, definitie 2120]
author at start life: Nic Roest (Idoro)
date of start life: 2007-11-29
alternative label: Gescheiden rioolstelsel
alternative label: Volledig gescheiden stelsel
scope note: Cof BAS
scope note: Cof DMO
type: Class
subclass of: Systeem
subclass of: Restriction
  author of change: Marinus Vonhof
  date of change: 2018-12-13
  author at start life: Finy Teitsma (Oranjewoud)
  date of start life: 2007-11-29
  on class: Hemelwaterstelsel
  on property: has as part
  min qualified cardinality: 1
subclass of: Restriction
  author of change: Marinus Vonhof
  date of change: 2016-04-22
  author at start life: Nic Roest (Idoro)
  date of start life: 2007-11-29
  on class: Vuilwaterstelsel
  on property: has as part
  min qualified cardinality: 1
subclass of: Restriction
  on property: heeft Uitvoering
  has value: Gescheiden
subclass of: Restriction
  on property: heeft Doel
  has value: Verminderen vuilbelasting van oppervlaktewater

Transportstelsel
author of change: Marinus Vonhof
date of change: 2025-01-16
date of change: 2024-05-16
date of change: 2022-10-01
definition: [IMBOR] Voorzieningen voor het transport van afvalwater.
author at start life: Marinus Vonhof
date of start life: 2014-12-02
validity context: *f
scope note: Cof TOP
type: Class
subclass of: Stelsel
subclass of: Restriction
  author of change: Marinus Vonhof
  date of change: 2015-03-01
  author at start life: Marinus Vonhof
  date of start life: 2014-10-14
  on class: Overnamepunt
  on property: has as part
  max qualified cardinality: 1
subclass of: Restriction
  author at start life: Marinus Vonhof
  date of start life: 2018-12-06
  on class: Zuiveringseenheid
  on property: has as part (inverse)
  max qualified cardinality: 1
subclass of: Restriction
  on property: heeft Functie
  has value: Transport van afvalwater

Rioolstelsel
label: Sewer system @en
definition: [EN 16323:2014] network of pipelines and ancillary works that conveys wastewater from drains to a treatment plant or other place of disposal @en
definition: [NEN 3300:1996] Het geheel aan voorzieningen voor de inzameling en het transport van afvalwater met uitzondering van zuiveringstechnische werken
definition: [NEN 3300:1996] Samenhangend geheel van riolen en rioolputten en de bijbehorende voorzieningen voor de inzameling en het transport van afvalwater
author at start life: Marinus Vonhof
date of start life: 2014-12-02
validity context: *f
alternative label: Riolering
alternative label: Rioleringsnet
scope note: Cof TOP
type: Class
subclass of: Stelsel
subclass of: Restriction
  author of change: Marinus Vonhof
  date of change: 2016-04-24
  author at start life: Marinus Vonhof
  date of start life: 2014-11-30
  on class: Rioleringsgebied
  on property: has as part (inverse)
  max qualified cardinality: 1
subclass of: Restriction
  on property: heeft Functie
  has value: Inzameling van afvalwater
subclass of: Restriction
  on property: heeft Functie
  has value: Transport van afvalwater

Drukriolering
author of change: Johan Post
date of change: 2021-10-01
date of change: 2026-05-18
definition: [NEN 3300:1996] Overdrukriolering is synoniem van drukriolering
definition: [NEN 3300:1996] Riolering waarbij het transport plaatsvindt door middel van overdruk
author at start life: Marinus Vonhof
date of start life: 2012-04-29
validity context: 1d 12d
see also: [NEN-EN 1671:1996] Een systeem voor transport van vervuild huishoudelijk afvalwater met een enkele drukleiding of een netwerk van drukleidingen. Het punt van lozen is het punt waar het totale debiet van het drukrioleringssysteem terugkeert naar atmosferische druk
alternative label: Drukrioleringsstelsel
alternative label: Overdrukriolering
scope note: Cof MDS
scope note: Cof RGM
scope note: Cof DMO
type: Class
subclass of: Mechanisch rioolstelsel
subclass of: Restriction
  author of change: Marinus Vonhof
  date of change: 2020-04-17
  author at start life: Marinus Vonhof
  date of start life: 2013-09-14
  on class: Pompunit
  on property: has as part
  min qualified cardinality: 1
subclass of: Restriction
  on property: heeft Technologie
  has value: Transport onder overdruk

Luchtpersriolering
author of change: Marinus Vonhof
author of change: Johan Post
date of change: 2021-08-05
date of change: 2026-05-18
author at start life: Marinus Vonhof
date of start life: 2014-10-29
validity context: 1d 12d
see also: [NEN-EN 1671:1996 (in de lijn van)] Een systeem voor transport van vervuild huishoudelijk afvalwater en bedrijfs- afvalwater waarbij het afvalwater met behulp van lucht onder overdruk in een enkele drukleiding of een netwerk van drukleidingen wordt gebracht. Het punt van lozen is het punt waar het totale debiet van het drukrioleringssysteem terugkeert naar atmosferische druk.
scope note: Cof MDS
scope note: Cof RGM
scope note: Cof DMO
type: Class
subclass of: Mechanisch rioolstelsel
subclass of: Restriction
  author of change: Marinus Vonhof
  date of change: 2018-11-07
  author at start life: Marinus Vonhof
  date of start life: 2018-05-03
  on class: Luchtpersgemaal
  on property: has as part
  qualified cardinality: 1
subclass of: Restriction
  on property: heeft Technologie
  has value: Transport onder overdruk

Persleidingstelsel
author of change: Johan Post
date of change: 2026-05-21
date of change: 2021-10-01
date of change: 2024-04-30
definition: Een netwerk met een enkele persleiding of meerdere persleidingen voor transport van afvalwater.
author at start life: Marinus Vonhof
date of start life: 2014-12-02
validity context: 1d 12d
alternative label: Persleidingsysteem
scope note: Cof MDS
scope note: Cof PLI
scope note: Cof RGM
scope note: Cof DMO
type: Class
subclass of: Transportstelsel
subclass of: Restriction
  author at start life: Marinus Vonhof
  date of start life: 2014-12-02
  on class: Persleiding
  on property: has as part
  min qualified cardinality: 1
subclass of: Restriction
  author at start life: Marinus Vonhof
  date of start life: 2014-12-02
  on class: Rioolgemaal
  on property: has as part
  min qualified cardinality: 1
subclass of: Restriction
  on property: heeft Technologie
  has value: Transport onder overdruk

Vacuümriolering
author of change: Johan Post
date of change: 2021-10-01
date of change: 2026-05-18
definition: [NEN 3300:1996] Onderdrukriolering is synoniem van vacuümriolering
definition: [NEN 3300:1996] Riolering waarbij het transport plaatsvindt door onderdruk
author at start life: Marinus Vonhof
date of start life: 2012-04-29
validity context: 1d 12d
comment: 20151014: NEN3300-definitie aangepast
see also: [NEN-EN 1671:1996 (in de lijn van)] Een systeem voor transport van vervuild huishoudelijk afvalwater en bedrijfs- afvalwater met een enkele onderdrukleiding of een netwerk van onderdrukleidingen. Het punt van lozen is het punt waar het totale debiet van het vacuümrioleringssysteem terugkeert naar atmosferische druk
alternative label: Onderdrukriolering
scope note: Cof MDS
scope note: Cof RGM
scope note: Cof DMO
type: Class
subclass of: Mechanisch rioolstelsel
subclass of: Restriction
  author at start life: Marinus Vonhof
  date of start life: 2013-09-14
  on class: Vacuümpompstation
  on property: has as part
  min qualified cardinality: 1
subclass of: Restriction
  on property: heeft Technologie
  has value: Transport onder onderdruk

Afvloeiend hemelwater
author of change: Marinus Vonhof
author of change: Eric van Gorkom
date of change: 2021-09-11
date of change: 2022-12-24
definition: [NEN 3300:1996] de hoeveelheid afvalwater die per tijdseenheid in een regenweersituatie via het rioolstelsel wordt afgevoerd
definition: [NEN-EN 752:2008] water afkomstig van neerslag die van een oppervlak naar een aansluitleiding, riool of ontvangend water stroomt
definition: [Waterwet] Soort afvalwater
notation: HWA
author at start life: Finy Teitsma (Oranjewoud)
date of start life: 2007-10-24
alternative label: Afstromend hemelwater
alternative label: Blauw afvalwater
alternative label: HWA
alternative label: Hemelwaterafvoer
alternative label: RWA
scope note: Cof BAS
scope note: Cof DMO
type: Class
subclass of: Afvalwater

Afvoer DWA-situatie
author of change: Johan Post
date of change: 2022-11-27
date of change: 2024-05-02
definition: Som van DWA-debiet en DWA-debiet van invoerende afvoerpunten
author at start life: Marinus Vonhof
date of start life: 2020-11-25
units of measurements: m3/h
validity context: 10d 15d
comment: [is aspect]
scope note: Cof BAS
scope note: Cof PLI
scope note: Cof DMO
type: Class
subclass of: Kenmerk
subclass of: Restriction
  author of change: Marinus Vonhof
  date of change: 2021-05-10
  author at start life: Marinus Vonhof
  date of start life: 2020-11-25
  on class: Afvoerrelatie
  on property: has as aspect (inverse)
  max qualified cardinality: 1
subclass of: Restriction
  author at start life: Marinus Vonhof
  date of start life: 2021-05-14
  on class: Inwinning
  on property: has as aspect
  max qualified cardinality: 1
subclass of: Restriction
  on property: has as value
  all values from: decimal
subclass of: Restriction
  on class: Transportleiding
  on property: has as aspect (inverse)
  max qualified cardinality: 1

Afvoerrelatie
author of change: Marinus Vonhof
author of change: Wouter van Riel
date of change: 2022-10-04
date of change: 2022-08-12
definition: Een schematische niet-fysieke verbinding tussen twee afvoerpunten
author at start life: Marinus Vonhof
date of start life: 2020-11-23
validity context: 1d 10d 12d
scope note: Cof DMO
type: Class
subclass of: Verbinding
subclass of: Restriction
  author of change: Marinus Vonhof
  date of change: 2021-05-10
  author at start life: Marinus Vonhof
  date of start life: 2020-11-25
  on class: Afvoer DWA-situatie
  on property: has as aspect
  max qualified cardinality: 1
subclass of: Restriction
  author of change: Marinus Vonhof
  date of change: 2021-05-10
  author at start life: Marinus Vonhof
  date of start life: 2020-11-25
  on class: Afvoer HWA-situatie
  on property: has as aspect
  max qualified cardinality: 1
subclass of: Restriction
  author at start life: Marinus Vonhof
  date of start life: 2020-11-23
  on class: Afvoernetwerk
  on property: has as part (inverse)
  qualified cardinality: 1
subclass of: Restriction
  author at start life: Marinus Vonhof
  date of start life: 2020-11-23
  on class: Beginpunt afvoerrelatie
  on property: has as part
  qualified cardinality: 1
subclass of: Restriction
  author at start life: Marinus Vonhof
  date of start life: 2020-11-23
  on class: Eindpunt afvoerrelatie
  on property: has as part
  qualified cardinality: 1
subclass of: Restriction
  author at start life: Wouter van Riel
  date of start life: 2022-05-04
  on class: Lijn
  on property: has as aspect
  max qualified cardinality: 1
subclass of: Restriction
  author at start life: Wouter van Riel
  date of start life: 2022-05-05
  on class: Eigenaar
  on property: has as input (inverse)
  max qualified cardinality: 1

Transportleiding
author of change: Marinus Vonhof
author of change: Johan Post
author of change: Wouter van Riel
date of change: 2025-01-16
date of change: 2024-04-23
date of change: 2026-05-13
date of change: 2025-04-02
definition: [IMBOR] Leiding met als functie de voortgeleiding van materie met mechanische en vrijverval leidingen als subtypen.
author at start life: Marinus Vonhof
date of start life: 2014-12-02
validity context: *f
scope note: Cof TOP
type: Class
subclass of: Leiding
subclass of: Restriction
  author of change: Marinus Vonhof
  date of change: 2020-04-17
  author at start life: Marinus Vonhof
  date of start life: 2014-12-02
  on class: Mechanische afsluiter
  on property: is connected to
  max qualified cardinality: 2
subclass of: Restriction
  author at start life: Marinus Vonhof
  date of start life: 2024-05-16
  on class: Drukklasse
  on property: has as aspect
  max qualified cardinality: 1
subclass of: Restriction
  author at start life: Marinus Vonhof
  date of start life: 2026-07-20
  on class: Doorlaat
  on property: has as part
  min qualified cardinality: 0
subclass of: Restriction
  validity context: 13t 14t
  on class: Afvoer DWA-situatie
  on property: has as aspect
  min qualified cardinality: 0
subclass of: Restriction
  validity context: 13t 14t
  on class: Afvoer HWA-situatie
  on property: has as aspect
  min qualified cardinality: 0
subclass of: Restriction
  on property: heeft Functie
  has value: Transport van afvalwater
subclass of: Restriction
  on class: Overnamepunt
  on property: has as part
  max qualified cardinality: 1

Afvoer HWA-situatie
author of change: Marinus Vonhof
author of change: Johan Post
date of change: 2022-11-27
date of change: 2024-05-02
date of change: 2023-01-13
definition: Dit is de gesommeerde afvoer van het DWA-debiet, pompovercapaciteit en invoerende afvoerpunten
author at start life: Marinus Vonhof
date of start life: 2020-11-25
units of measurements: m3/h
validity context: 10d 15d
comment: [is aspect]
scope note: Cof BAS
scope note: Cof PLI
scope note: Cof DMO
type: Class
subclass of: Kenmerk
subclass of: Restriction
  author of change: Marinus Vonhof
  date of change: 2021-05-10
  author at start life: Marinus Vonhof
  date of start life: 2020-11-25
  on class: Afvoerrelatie
  on property: has as aspect (inverse)
  max qualified cardinality: 1
subclass of: Restriction
  author at start life: Marinus Vonhof
  date of start life: 2021-05-14
  on class: Inwinning
  on property: has as aspect
  max qualified cardinality: 1
subclass of: Restriction
  on property: has as value
  all values from: decimal
subclass of: Restriction
  on class: Transportleiding
  on property: has as aspect (inverse)
  max qualified cardinality: 1

Afvoercapaciteit
author of change: Johan Post
date of change: 2022-09-29
definition: (Aanwezige) capaciteit van de fysieke afvoerconstructie bij het afvoerpunt
author at start life: Marinus Vonhof
date of start life: 2021-05-10
units of measurements: m3/h
comment: [is aspect]
scope note: Cof DMO
type: Class
subclass of: Kengetal
subclass of: Restriction
  author at start life: Marinus Vonhof
  date of start life: 2021-05-10
  on class: Afvoerpunt gebied
  on property: has as aspect (inverse)
  max qualified cardinality: 1
subclass of: Restriction
  on property: has as value
  all values from: decimal
subclass of: Restriction
  on class: Type capaciteit
  on property: has as aspect
  max qualified cardinality: 1

Type capaciteit
definition: Bron waaruit capaciteit is afgeleid
author at start life: Johan Post
date of start life: 2022-03-27
comment: Kenmerken van kenmerk
comment: [is aspect]
scope note: Cof DMO
type: Class
subclass of: Kenmerk
subclass of: Restriction
  author of change: Marinus Vonhof
  date of change: 2019-04-25
  author at start life: Marinus Vonhof
  date of start life: 2015-10-29
  on class: Datum inwinning
  on property: has as aspect
  max qualified cardinality: 1
subclass of: Restriction
  author of change: Marinus Vonhof
  date of change: 2019-04-25
  author at start life: Marinus Vonhof
  date of start life: 2015-10-29
  on class: Wijze van afleiden
  on property: has as aspect
  max qualified cardinality: 1
subclass of: Restriction
  author at start life: Marinus Vonhof
  date of start life: 2021-05-14
  on class: Afvoercapaciteit
  on property: has as aspect (inverse)
  max qualified cardinality: 1
subclass of: Restriction
  author at start life: Marinus Vonhof
  date of start life: 2021-05-14
  on class: Pompovercapaciteit
  on property: has as aspect (inverse)
  max qualified cardinality: 1

Stuwmuur
author of change: Marinus Vonhof
author of change: Johan Post
date of change: 2025-01-16
date of change: 2024-05-01
date of change: 2015-07-28
date of change: 2026-07-02
definition: [IMBOR] Een onderdeel bestaande uit muur die als functie heeft het keren van water.
author at start life: Marinus Vonhof
date of start life: 2013-09-28
comment: Als de stuwmuur geen drempniveau heeft is er geen overstort mogelijk, er wordt van uitgegaan dat de muur tot aan de bovenzijde van de put reikt.
scope note: Cof MDS
scope note: Cof REV
scope note: Cof HYD
scope note: Cof DMO
type: Class
subclass of: Wand
subclass of: Restriction
  author at start life: Marinus Vonhof
  date of start life: 2017-03-29
  on class: Stuwconstructie
  on property: has as part (inverse)
  qualified cardinality: 1
subclass of: Restriction
  on property: heeft Functie
  has value: Keren van water

Overstortdrempel
author of change: Marinus Vonhof
author of change: Johan Post
date of change: 2025-01-16
date of change: 2024-05-01
date of change: 2026-07-02
definition: [IMBOR] De bovenste rand van een constructie om pieken in water toevoer te regelen, door water over deze rand te storten wanneer de toegevoerde waterhoeveelheid een bepaald volume overschrijdt.
notation: OVS
author at start life: Marinus Vonhof
date of start life: 2011-12-15
validity context: 1d
scope note: Cof MDS
scope note: Cof REV
scope note: Cof HYD
scope note: Cof DMO
type: Class
subclass of: Wand
subclass of: Restriction
  author of change: Marinus Vonhof
  date of change: 2021-08-06
  author at start life: Finy Teitsma (Oranjewoud)
  date of start life: 2006-02-25
  on class: Overstortput
  on property: has as part (inverse)
  qualified cardinality: 1
subclass of: Restriction
  on property: heeft Functie
  has value: Keren van water

Afvoerend oppervlak
label: Catchment area @en
author of change: Marinus Vonhof
author of change: Wouter van Riel
date of change: 2014-05-11
date of change: 2024-04-20
definition: Het oppervlak van de bovenlaag dat water afvoert naar het object
definition: [EN 16323:2014] area draining to a drain, sewer or watercourse @en
definition: [NEN 3300:1996] het naar de riolering afwaterende oppervlak
author at start life: Marinus Vonhof
date of start life: 2011-12-15
units of measurements: m2
validity context: 1d 3d 10d 12d 15d
comment: [is aspect]
scope note: Cof MDS
scope note: Cof HYD
scope note: Cof DMO
type: Class
subclass of: Kenmerk
subclass of: Restriction
  author of change: Marinus Vonhof
  date of change: 2018-05-03
  author at start life: Marinus Vonhof
  date of start life: 2014-12-02
  validity context: 5t 11t
  on class: Rioolput
  on property: has as aspect (inverse)
  max qualified cardinality: 1
subclass of: Restriction
  author of change: Marinus Vonhof
  date of change: 2020-11-25
  author at start life: Marinus Vonhof
  date of start life: 2018-12-17
  on class: Afvoerpunt gebied
  on property: has as aspect (inverse)
  max qualified cardinality: 1
subclass of: Restriction
  date of change: 2022-11-25
  on class: Inwinning
  on property: has as aspect
  max qualified cardinality: 1
subclass of: Restriction
  on property: has as value
  all values from: decimal

Afvoerend oppervlak bedrijven
author at start life: Johan Post
date of start life: 2022-11-27
units of measurements: m2
comment: [is aspect]
scope note: Cof DMO
type: Class
subclass of: Afvoerend oppervlak
subclass of: Restriction
  on property: has as value
  all values from: decimal

Afvoerend oppervlak woningen
author at start life: Johan Post
date of start life: 2022-11-27
units of measurements: m2
comment: [is aspect]
scope note: Cof DMO
type: Class
subclass of: Afvoerend oppervlak
subclass of: Restriction
  on property: has as value
  all values from: decimal

Afvoerend oppervlak, niet aangesloten
author of change: Johan Post
author of change: Wouter van Riel
date of change: 2024-04-20
date of change: 2022-10-06
definition: Afvoerend oppervlak, niet aangesloten
author at start life: Marinus Vonhof
date of start life: 2020-11-23
units of measurements: m2
comment: [is aspect]
scope note: Cof DMO
type: Class
subclass of: Kenmerk
subclass of: Restriction
  on property: has as value
  all values from: decimal

Afvoernetwerk
author of change: Marinus Vonhof
date of change: 2022-10-03
date of change: 2024-07-17
definition: Verzameling van aaneengesloten afvoerpunten en afvoerrelaties bedoeld om een afvalwatersysteem met bijbehorende kentallen te schematiseren
author at start life: Marinus Vonhof
date of start life: 2020-11-23
scope note: Cof DMO
type: Class
subclass of: Representatie fysiek object
subclass of: Restriction
  author of change: Marinus Vonhof
  date of change: 2021-05-10
  author at start life: Marinus Vonhof
  date of start life: 2020-11-23
  on class: Afvoerpunt
  on property: has as part
  min qualified cardinality: 2
subclass of: Restriction
  author at start life: Marinus Vonhof
  date of start life: 2020-11-23
  on class: Afvoerrelatie
  on property: has as part
  min qualified cardinality: 1
subclass of: Restriction
  author at start life: Wouter van Riel
  date of start life: 2022-05-03
  on class: Zuiveringseenheid
  on property: has as part (inverse)
  qualified cardinality: 1

Representatie fysiek object
author of change: Marinus Vonhof
date of change: 2017-12-12
date of change: 2024-07-17
definition: Een topologisch element met als enige functie het dragen van de geometrie voor het representeren van fysieke objecten. Het vormt dus geen onderdeel van een netwerkdefinitie
author at start life: Marinus Vonhof
date of start life: 2013-02-03
scope note: Cof TOP
type: Class
subclass of: Topologisch element

Zuiveringseenheid
author of change: Johan Post
date of change: 2024-05-01
date of change: 2021-10-01
author at start life: Marinus Vonhof
date of start life: 2015-06-02
validity context: 1d
comment: Voorkeursterm was Zuiveringsgebied (t/m versie 1.4). URI blijft Zuiveringsgebied
see also: [SWWB] Een afbakening van de zone, waarbinnen al het afvalwater naar eenzelfde rioolwaterzuivering wordt afgevoerd om daar gezuiverd te worden. Locaties die niet op het riool zijn aangesloten vallen binnen het vlak, maar zijn dus in werkelijkheid niet aangesloten. De grenzen van het gebied hoeven zich niet te beperken tot de gemeente- en waterschapsgrenzen.
alternative label: Zuiveringsgebied
alternative label: Zuiveringskring
scope note: Cof BAS
scope note: Cof DMO
type: Class
subclass of: Gebied
subclass of: Restriction
  author of change: Marinus Vonhof
  date of change: 2018-12-06
  author at start life: Marinus Vonhof
  date of start life: 2015-06-02
  on class: Rioleringsgebied
  on property: has as part
  min qualified cardinality: 1
subclass of: Restriction
  author at start life: Marinus Vonhof
  date of start life: 2015-06-02
  on class: RWZI
  on property: has as part
  qualified cardinality: 1
subclass of: Restriction
  author at start life: Marinus Vonhof
  date of start life: 2015-07-23
  on class: Code
  on property: has as aspect
  max qualified cardinality: 1
subclass of: Restriction
  author at start life: Marinus Vonhof
  date of start life: 2018-12-06
  on class: Transportstelsel
  on property: has as part
  min qualified cardinality: 0
subclass of: Restriction
  author at start life: Wouter van Riel
  date of start life: 2022-05-03
  on class: Afvoernetwerk
  on property: has as part
  max qualified cardinality: 1

Beginpunt afvoerrelatie
definition: Startpunt stromingsrichting in afvoerrelatie (vanaf)
author at start life: Marinus Vonhof
date of start life: 2020-11-23
validity context: 1d 10d 12d
scope note: Cof DMO
type: Class
subclass of: Vertex
subclass of: Restriction
  author of change: Marinus Vonhof
  date of change: 2021-05-10
  author at start life: Marinus Vonhof
  date of start life: 2020-11-23
  on class: Afvoerpunt
  on property: is connected to
  qualified cardinality: 1
subclass of: Restriction
  author at start life: Marinus Vonhof
  date of start life: 2020-11-23
  on class: Afvoerrelatie
  on property: has as part (inverse)
  qualified cardinality: 1

Eindpunt afvoerrelatie
definition: Eindpunt stromingsrichting in afvoerrelatie (naar)
author at start life: Marinus Vonhof
date of start life: 2020-11-23
scope note: Cof DMO
type: Class
subclass of: Vertex
subclass of: Restriction
  author of change: Marinus Vonhof
  date of change: 2021-05-10
  author at start life: Marinus Vonhof
  date of start life: 2020-11-23
  on class: Afvoerpunt
  on property: is connected to
  qualified cardinality: 1
subclass of: Restriction
  author at start life: Marinus Vonhof
  date of start life: 2020-11-23
  on class: Afvoerrelatie
  on property: has as part (inverse)
  qualified cardinality: 1

Eigenaar
author of change: Marinus Vonhof
author of change: Wouter van Riel
date of change: 2025-01-16
date of change: 2022-08-12
definition: Degene die als natuurlijk persoon handelende in de uitoefening van een beroep of bedrijf dan wel als rechtspersoon iets in eigendom heeft
definition: [IMBOR] (Rechts)persoon die het meest omvattend recht op een zaak heeft. De typen eigenaren zijn conform de indeling in bronhouders (BGT).
author at start life: Marinus Vonhof
date of start life: 2017-05-31
scope note: Cof BAS
scope note: Cof DMO
type: Class
subclass of: Levensvorm
subclass of: Restriction
  author at start life: Marinus Vonhof
  date of start life: 2017-05-31
  on class: Fysiek object
  on property: has as input
  min qualified cardinality: 0

Maatgevend niveau voor berging
author of change: Johan Post
date of change: 2022-11-27
definition: De hoogte op basis waarvan de stelselberging wordt bepaald, het maatgevend niveau ten opzichte van een referentiepeil
author at start life: Marinus Vonhof
date of start life: 2020-11-23
units of measurements: m
comment: [is aspect]
scope note: Cof DMO
type: Class
subclass of: Hoogte t.o.v. NAP
subclass of: Restriction
  author of change: Marinus Vonhof
  date of change: 2021-05-10
  author at start life: Marinus Vonhof
  date of start life: 2014-12-01
  on class: Afvoerpunt gebied
  on property: has as aspect (inverse)
  max qualified cardinality: 1
subclass of: Restriction
  on property: has as value
  all values from: decimal

Pompovercapaciteit
definition: [NEN 3300:1996] Het deel van de pompcapaciteit dat beschikbaar is voor de regenwaterafvoer
author at start life: Marinus Vonhof
date of start life: 2020-11-23
units of measurements: m3/h
see also: [IRIS-RIOKEN:2012] Het deel van de capaciteit van een rioolgemaal dat beschikbaar is voor de afvoer van ingezamelde neerslag.
alternative label: POC
comment: [is aspect]
scope note: Cof DMO
type: Class
subclass of: Kengetal
subclass of: Restriction
  author of change: Marinus Vonhof
  date of change: 2020-11-23
  author at start life: Marinus Vonhof
  date of start life: 2018-12-17
  on class: Afvoerpunt gebied
  on property: has as aspect (inverse)
  max qualified cardinality: 1
subclass of: Restriction
  on property: has as value
  all values from: decimal
subclass of: Restriction
  on class: Type capaciteit
  on property: has as aspect
  max qualified cardinality: 1

Verloren berging
author of change: Johan Post
date of change: 2022-11-27
definition: Dat deel van de inhoud van het rioolstelsel die permanent is gevuld, en dus niet bijdraagt aan de effectieve berging
author at start life: Marinus Vonhof
date of start life: 2020-11-23
units of measurements: m3
comment: [is aspect]
scope note: Cof DMO
type: Class
subclass of: Kengetal
subclass of: Restriction
  author of change: Marinus Vonhof
  date of change: 2020-11-25
  author at start life: Marinus Vonhof
  date of start life: 2014-12-01
  on class: Afvoerpunt gebied
  on property: has as aspect (inverse)
  max qualified cardinality: 1
subclass of: Restriction
  on property: has as value
  all values from: decimal

DWA debiet totaal
author of change: Marinus Vonhof
author of change: Wouter van Riel
date of change: 2023-01-14
date of change: 2020-11-25
date of change: 2022-12-19
definition: Totaal DWA debiet (gemiddelde dagafvoer): huishoudelijk + bedrijfsafvalwater + recreatie + rioolvreemd water
author at start life: Marinus Vonhof
date of start life: 2020-11-23
units of measurements: m3/h
comment: Bij uitwisseling van kentallen alleen vullen als één of meer details (debiet bedrijven, inwoners, recreatie) onbekend zijn
comment: [is aspect]
scope note: Cof DMO
type: Class
subclass of: Kengetal
subclass of: Restriction
  author of change: Marinus Vonhof
  date of change: 2020-11-25
  author at start life: Marinus Vonhof
  date of start life: 2018-12-17
  on class: Afvoerpunt gebied
  on property: has as aspect (inverse)
  max qualified cardinality: 1
subclass of: Restriction
  author at start life: Johan Post
  date of start life: 2022-03-27
  on class: Inwinning
  on property: has as aspect
  max qualified cardinality: 1
subclass of: Restriction
  on property: has as value
  all values from: decimal

Netto berging
author of change: Marinus Vonhof
author of change: Wouter van Riel
date of change: 2021-05-10
date of change: 2022-12-19
definition: De statische berging, rekening houdend met het bergingsverlies vanwege permanente vulling.
author at start life: Marinus Vonhof
date of start life: 2020-11-23
units of measurements: m3
comment: [is aspect]
scope note: Cof DMO
type: Class
subclass of: Kengetal
subclass of: Restriction
  author of change: Marinus Vonhof
  date of change: 2021-05-10
  author at start life: Marinus Vonhof
  date of start life: 2014-12-01
  on class: Afvoerpunt gebied
  on property: has as aspect (inverse)
  max qualified cardinality: 1
subclass of: Restriction
  on property: has as value
  all values from: decimal

Netto berging randvoorzieningen
author of change: Wouter van Riel
date of change: 2022-12-19
definition: De netto berging in randvoorzieningen, rekening houdend met het bergingsverlies vanwege permanente vulling.
author at start life: Marinus Vonhof
date of start life: 2020-11-23
units of measurements: m3
comment: [is aspect]
scope note: Cof DMO
type: Class
subclass of: Kengetal
subclass of: Restriction
  author of change: Marinus Vonhof
  date of change: 2021-05-10
  author at start life: Marinus Vonhof
  date of start life: 2014-12-01
  on class: Afvoerpunt gebied
  on property: has as aspect (inverse)
  max qualified cardinality: 1
subclass of: Restriction
  on property: has as value
  all values from: decimal

Invoer gebied
definition: som van alle invoeren van inprikkende gebieden en bovenstroomse afvoerconstructies
author at start life: Wouter van Riel
date of start life: 2022-12-19
units of measurements: m3/h
comment: [is aspect]
scope note: Cof DMO
type: Class
subclass of: Kengetal
subclass of: Restriction
  author at start life: Johan Post
  date of start life: 2022-05-03
  on class: Afvoerpunt gebied
  on property: has as aspect (inverse)
  max qualified cardinality: 1
subclass of: Restriction
  on property: has as value
  all values from: decimal
subclass of: Restriction
  on class: Inwinning
  on property: has as aspect
  max qualified cardinality: 1

DWA debiet bedrijven
author of change: Wouter van Riel
date of change: 2022-12-19
definition: DWA-debiet afkomstig van bedrijven + rioolvreemd water (gemiddelde dagafvoer)
author at start life: Marinus Vonhof
date of start life: 2021-05-10
units of measurements: m3/h
comment: [is aspect]
scope note: Cof DMO
type: Class
subclass of: Kengetal
subclass of: Restriction
  author at start life: Johan Post
  date of start life: 2022-03-27
  on class: Inwinning
  on property: has as aspect
  max qualified cardinality: 1
subclass of: Restriction
  author at start life: Marinus Vonhof
  date of start life: 2021-05-10
  on class: Afvoerpunt gebied
  on property: has as aspect (inverse)
  max qualified cardinality: 1
subclass of: Restriction
  on property: has as value
  all values from: decimal

DWA debiet inwoners
author of change: Wouter van Riel
date of change: 2022-12-19
definition: DWA-debiet afkomstig van inwoners + rioolvreemd water (gemiddelde dagafvoer)
author at start life: Marinus Vonhof
date of start life: 2021-05-10
units of measurements: m3/h
comment: [is aspect]
scope note: Cof DMO
type: Class
subclass of: Kengetal
subclass of: Restriction
  author at start life: Johan Post
  date of start life: 2022-03-27
  on class: Inwinning
  on property: has as aspect
  max qualified cardinality: 1
subclass of: Restriction
  author at start life: Marinus Vonhof
  date of start life: 2021-05-10
  on class: Afvoerpunt gebied
  on property: has as aspect (inverse)
  max qualified cardinality: 1
subclass of: Restriction
  on property: has as value
  all values from: decimal

DWA debiet recreatie
author of change: Wouter van Riel
date of change: 2022-12-19
definition: DWA-debiet afkomstig van recreatie + rioolvreemd water (gemiddelde dagafvoer)
author at start life: Marinus Vonhof
date of start life: 2021-05-10
units of measurements: m3/h
comment: [is aspect]
scope note: Cof DMO
type: Class
subclass of: Kengetal
subclass of: Restriction
  author at start life: Johan Post
  date of start life: 2022-03-27
  on class: Inwinning
  on property: has as aspect
  max qualified cardinality: 1
subclass of: Restriction
  author at start life: Marinus Vonhof
  date of start life: 2021-05-10
  on class: Afvoerpunt gebied
  on property: has as aspect (inverse)
  max qualified cardinality: 1
subclass of: Restriction
  on property: has as value
  all values from: decimal

Gebied
author of change: Marinus Vonhof
date of change: 2017-11-16
date of change: 2024-11-22
author at start life: Marinus Vonhof
date of start life: 2014-11-29
validity context: *f
see also: [IRIS-RIOKEN:2012] Het geheel van virtuele en fysieke (aanwijsbare) opdelingen en indelingen van het aardoppervlak.
alternative label: Ruimtelijk gebied
scope note: Cof TOP
type: Class
subclass of: Ruimte
subclass of: Restriction
  author of change: Marinus Vonhof
  date of change: 2016-11-09
  author at start life: Marinus Vonhof
  date of start life: 2015-07-28
  on class: Gebiedsoriëntatie
  on property: has as aspect
  max qualified cardinality: 1
subclass of: Restriction
  author at start life: Wouter van Riel
  date of start life: 2022-05-03
  on class: Afvoerpunt gebied
  on property: has as part
  max qualified cardinality: 1

Reservoir
author of change: Marinus Vonhof
author of change: Wouter van Riel
date of change: 2025-01-16
date of change: 2024-04-22
date of change: 2017-08-21
definition: Constructies met een specifieke functie binnen het rioolstelsel.
definition: Een natuurlijk of kunstmatig gebied dat gebruikt wordt om water op te slaan
author at start life: Marinus Vonhof
date of start life: 2013-03-30
validity context: *f 12f 13d
scope note: Cof TOP
type: Class
subclass of: Bouwwerk
subclass of: Restriction
  author at start life: Marinus Vonhof
  date of start life: 2026-07-24
  on class: WIBON thema
  on property: has as aspect
  max qualified cardinality: 1
subclass of: Restriction
  author at start life: Wouter van Riel
  date of start life: 2022-05-03
  on class: Afvoerpunt gebied
  on property: has as part
  max qualified cardinality: 1
subclass of: Restriction
  on property: heeft Uitvoering
  has value: Natuurlijk of kunstmatig gebied
subclass of: Restriction
  on property: heeft Functie
  has value: Opslag van water

Stelsel
author of change: Marinus Vonhof
date of change: 2025-01-16
date of change: 2014-12-02
date of change: 2022-10-01
definition: Een netwerk van leidingen en aanverwante constructies
author at start life: Marinus Vonhof
date of start life: 2012-04-29
validity context: *f
scope note: Cof TOP
type: Class
subclass of: Fysiek object
subclass of: Restriction
  author at start life: Marinus Vonhof
  date of start life: 2019-05-15
  on class: Registratief gebied
  on property: has as part (inverse)
  max qualified cardinality: 1
subclass of: Restriction
  author at start life: Marinus Vonhof
  date of start life: 2020-04-20
  validity context: 14t
  on class: Gebiedsoriëntatie
  on property: has as aspect
  max qualified cardinality: 1
subclass of: Restriction
  author at start life: Wouter van Riel
  date of start life: 2022-05-03
  on class: Afvoerpunt gebied
  on property: has as part
  max qualified cardinality: 1
subclass of: Restriction
  on property: heeft Uitvoering
  has value: Netwerk van verbonden knooppunten

HWA afvoer
definition: De gesommeerde afvoer van het DWA debiet, (pomp)overcapaciteit en invoeren
author at start life: Wouter van Riel
date of start life: 2022-12-19
units of measurements: m3/h
comment: [is aspect]
scope note: Cof DMO
type: Class
subclass of: Kengetal
subclass of: Restriction
  author at start life: Johan Post
  date of start life: 2022-03-27
  on class: Inwinning
  on property: has as aspect
  max qualified cardinality: 1
subclass of: Restriction
  author at start life: Wouter van Riel
  date of start life: 2022-12-19
  on class: Afvoerpunt gebied
  on property: has as aspect (inverse)
  max qualified cardinality: 1
subclass of: Restriction
  on property: has as value
  all values from: decimal

Ledigingstijd
author of change: Johan Post
date of change: 2022-11-27
definition: De tijd die nodig is om de volledig gevulde onderdrempelberging te ledigen met alleen het DWA-debiet als belasting en een afvoer die maximaal is
definition: [NEN 3300:1996] de tijd die nodig is om het in een rioolstelsel geborgen volume afvalwater af te voeren
author at start life: Marinus Vonhof
date of start life: 2014-11-30
units of measurements: h
see also: [IRIS-RIOKEN:2012] De tijd (in uur) die een rioolgemaal nodig heeft om een vol gevuld rioolstelsel te ledigen bij niet opeenvolgende buien in een rioleringsgebied
comment: [is aspect]
scope note: Cof DMO
type: Class
subclass of: Kenmerk
subclass of: Restriction
  author at start life: Marinus Vonhof
  date of start life: 2014-11-30
  on class: Gemengd rioolstelsel
  on property: has as aspect (inverse)
  max qualified cardinality: 1
subclass of: Restriction
  on property: has as value
  all values from: decimal
subclass of: Restriction
  on class: Afvoerpunt gebied
  on property: has as aspect (inverse)
  max qualified cardinality: 1

Vultijd
author of change: Johan Post
date of change: 2022-11-27
definition: De tijd die nodig is om de onderdrempelberging te vullen met alleen het DWA-debiet terwijl er geen afvoer plaatsvindt
author at start life: Marinus Vonhof
date of start life: 2015-03-01
units of measurements: h
comment: [is aspect]
scope note: Cof DMO
type: Class
subclass of: Kenmerk
subclass of: Restriction
  author at start life: Marinus Vonhof
  date of start life: 2021-05-10
  on class: Gemengd rioolstelsel
  on property: has as aspect (inverse)
  max qualified cardinality: 1
subclass of: Restriction
  on property: has as value
  all values from: decimal
subclass of: Restriction
  on class: Afvoerpunt gebied
  on property: has as aspect (inverse)
  max qualified cardinality: 1

Verbinding
author of change: Marinus Vonhof
date of change: 2024-07-17
date of change: 2017-12-22
definition: De verbinding van de knopen binnen de netwerkdefinitie
author at start life: Marinus Vonhof
date of start life: 2013-09-03
see also: [SUF-HYD 1.10] Een stroomvoerend element
scope note: Cof TOP
type: Class
subclass of: Edge

Lijn
author of change: Marinus Vonhof
author of change: Johan Post
date of change: 2019-05-15
date of change: 2024-05-02
definition: Eéndimensionaal geometrisch element. Voor geografische beschrijvingen conform het coordinatenstelsel EPSG:7415 (x/y conform EPSG:28992, optioneel z conform EPSG:5709).
author at start life: Marinus Vonhof
date of start life: 2016-11-09
units of measurements: gml
comment: [is aspect]
scope note: Cof TOP
type: Class
subclass of: Geometrie
subclass of: Restriction
  author of change: Marinus Vonhof
  date of change: 2020-04-18
  author at start life: Marinus Vonhof
  date of start life: 2016-11-09
  on class: Leidingoriëntatie
  on property: has as aspect (inverse)
  max qualified cardinality: 1
subclass of: Restriction
  on property: has as value
  all values from: gmlLiteral

Afvoerrelatie mechanisch
definition: Afvoer via persleiding
author at start life: Marinus Vonhof
date of start life: 2020-11-25
validity context: 1d 10d 12d
scope note: Cof DMO
type: Class
subclass of: Afvoerrelatie

Afvoerrelatie vrijverval
definition: Afvoer via vrijverval transportleiding
author at start life: Marinus Vonhof
date of start life: 2020-11-25
validity context: 1d 10d 12d
scope note: Cof DMO
type: Class
subclass of: Afvoerrelatie

Code
author of change: Marinus Vonhof
date of change: 2015-07-23
definition: Unieke verkorte aanduiding
author at start life: Nic Roest (Idoro)
date of start life: 2006-02-21
validity context: 15d
comment: [is aspect]
scope note: Cof MDS
scope note: Cof DMO
type: Class
subclass of: Unieke identificatie
subclass of: Restriction
  author at start life: Marinus Vonhof
  date of start life: 2015-07-23
  on class: Rioleringsgebied
  on property: has as aspect (inverse)
  max qualified cardinality: 1
subclass of: Restriction
  author at start life: Marinus Vonhof
  date of start life: 2015-07-23
  on class: Zuiveringseenheid
  on property: has as aspect (inverse)
  max qualified cardinality: 1
subclass of: Restriction
  author at start life: Marinus Vonhof
  date of start life: 2015-07-23
  on class: RWZI
  on property: has as aspect (inverse)
  qualified cardinality: 1

Bouwwerk
author of change: Marinus Vonhof
author of change: Johan Post
author of change: Eric van Gorkom
date of change: 2025-01-16
date of change: 2024-05-01
date of change: 2021-11-23
definition: [IMBOR] Gegevens die specifiek zijn voor een met de aarde verbonden duurzaam constructie, dat niet valt onder de definities van een pand of kunstwerk.
definition: [Omgevingswet] Constructie van enige omvang van hout, steen, metaal of ander materiaal, die op de plaats van bestemming hetzij direct of indirect met de grond verbonden is, hetzij direct of indirect steun vindt in of op de grond, bedoeld om ter plaatse te functioneren, met inbegrip van de daarvan deel uitmakende bouwwerkgebonden installaties
author at start life: Marinus Vonhof
date of start life: 2016-04-20
validity context: *f
scope note: Cof TOP
type: Class
subclass of: Fysiek object
subclass of: Restriction
  author of change: Marinus Vonhof
  date of change: 2018-05-03
  author at start life: Marinus Vonhof
  date of start life: 2017-08-19
  validity context: 5t 10t 11t 14t
  on class: Bouwwerkoriëntatie
  on property: has as aspect
  max qualified cardinality: 1
subclass of: Restriction
  author of change: Marinus Vonhof
  date of change: 2018-12-05
  author at start life: Marinus Vonhof
  date of start life: 2018-09-03
  on class: Straat
  on property: has as part (inverse)
  max qualified cardinality: 1
subclass of: Restriction
  author of change: Marinus Vonhof
  date of change: 2018-12-06
  author at start life: Marinus Vonhof
  date of start life: 2014-12-02
  on class: Status functioneren
  on property: has as aspect
  max qualified cardinality: 1
subclass of: Restriction
  author at start life: Marinus Vonhof
  date of start life: 2018-09-03
  on class: Ondergrond
  on property: has as part (inverse)
  max qualified cardinality: 1
subclass of: Restriction
  author at start life: Marinus Vonhof
  date of start life: 2018-12-12
  on class: Registratief gebied
  on property: has as part (inverse)
  max qualified cardinality: 1
subclass of: Restriction
  on property: heeft Uitvoering
  has value: Constructie van enige omvang
subclass of: Restriction
  on property: heeft Uitvoering
  has value: Verbonden met de grond

Reinigen vrijverval leiding
author of change: Marinus Vonhof
date of change: 2018-05-01
author at start life: Marinus Vonhof
date of start life: 2014-12-23
scope note: Cof MDS
scope note: Cof RRB
scope note: Cof LDR
scope note: Cof MTR
scope note: Cof DMO
type: Class
subclass of: Reinigen
subclass of: Restriction
  author of change: Marinus Vonhof
  date of change: 2019-04-04
  author at start life: Marinus Vonhof
  date of start life: 2014-12-23
  validity context: 2t
  on class: Vrijverval rioolleiding
  on property: has as input
  qualified cardinality: 1
subclass of: Restriction
  author at start life: Marinus Vonhof
  date of start life: 2014-12-23
  validity context: *t
  comment: Relatie (kardinaliteit) uitgeschakeld voor CFK's (SHACL-syntax) (20260403) (20260824)
  on class: Vrijverval rioolleiding
  on property: has as output
  qualified cardinality: 1
subclass of: Restriction
  on property: heeft Functie
  has value: Afstroming herstellen

Reinigen rioolput
author of change: Marinus Vonhof
date of change: 2018-05-01
author at start life: Marinus Vonhof
date of start life: 2014-12-23
scope note: Cof MDS
scope note: Cof RRB
scope note: Cof LDR
scope note: Cof MTR
scope note: Cof DMO
type: Class
subclass of: Reinigen
subclass of: Restriction
  author of change: Marinus Vonhof
  date of change: 2019-04-04
  author at start life: Marinus Vonhof
  date of start life: 2014-12-23
  on class: Rioolput
  on property: has as input
  qualified cardinality: 1
subclass of: Restriction
  author at start life: Marinus Vonhof
  date of start life: 2014-12-23
  validity context: *t
  comment: Relatie (kardinaliteit) uitgeschakeld voor CFK's (SHACL-syntax) (20260403) (20260824)
  on class: Rioolput
  on property: has as output
  qualified cardinality: 1
subclass of: Restriction
  author at start life: Marinus Vonhof
  date of start life: 2015-02-02
  on class: Breedte toegang
  on property: has as output
  max qualified cardinality: 1
subclass of: Restriction
  on property: heeft Functie
  has value: Afstroming herstellen

Analyseren hydraulisch functioneren
author of change: Marinus Vonhof
date of change: 2014-10-01
author at start life: Marinus Vonhof
date of start life: 2014-09-25
scope note: Cof DMO
type: Class
subclass of: Activiteit met raakvlak riolering
subclass of: Restriction
  author of change: Marinus Vonhof
  date of change: 2014-10-01
  author at start life: Marinus Vonhof
  date of start life: 2014-09-25
  on class: Beheer oppervlaktewaterkwantiteit
  on property: has as part (inverse)
  qualified cardinality: 1

Beheer oppervlaktewaterkwantiteit
author of change: Marinus Vonhof
date of change: 2014-10-01
author at start life: Marinus Vonhof
date of start life: 2014-09-25
scope note: Cof DMO
type: Class
subclass of: Activiteit
subclass of: Restriction
  author of change: Marinus Vonhof
  date of change: 2014-10-01
  author at start life: Marinus Vonhof
  date of start life: 2014-09-25
  on class: Analyseren hydraulisch functioneren
  on property: has as part
  qualified cardinality: 1
subclass of: Restriction
  author of change: Marinus Vonhof
  date of change: 2014-10-06
  author at start life: Marinus Vonhof
  date of start life: 2014-10-04
  on class: Waterschapstaak TRI
  on property: has as part (inverse)
  qualified cardinality: 1
subclass of: Restriction
  author at start life: Marinus Vonhof
  date of start life: 2014-11-23
  on class: Bewaking peilbesluiten
  on property: has as part
  qualified cardinality: 1
subclass of: Restriction
  author at start life: Marinus Vonhof
  date of start life: 2014-12-12
  on class: Optimaliseren afvalwaterketen
  on property: has as part
  qualified cardinality: 1

Ander afvalwater
author of change: Marinus Vonhof
date of change: 2016-04-07
definition: [Waterwet] Datgene wat niet onder een van voorgaande begrippen is te vatten. De wetgever beoogt niet om met bovenstaande begrippen alle soorten afvalwater uitputtend te omschrijven. Een voorbeeld van ‘ander afvalwater’ is ‘ zwembadwater’ bij een particulier huishouden dat geloosd moet worden. Te lozen zwembadwater van een professioneel zwembad is bedrijfsafvalwater
author at start life: Marinus Vonhof
date of start life: 2015-03-29
scope note: Cof BAS
scope note: Cof DMO
type: Class
subclass of: Afvalwater

Vorm opening (coll)
comment: [is coll]
scope note: Cof TOP
type: Class
subclass of: Verzameling soorten
subclass of: Class
  one of: Rechthoekig
  one of: Rond
  one of: Anders (vorm)

Vorm put (coll)
comment: [is coll]
scope note: Cof TOP
type: Class
subclass of: Verzameling soorten
subclass of: Class
  one of: Rechthoekig
  one of: Rond
  one of: Anders (vorm)

Apparatuur
author of change: Marinus Vonhof
author of change: Johan Post
author of change: Wouter van Riel
date of change: 2025-01-16
date of change: 2024-05-01
date of change: 2017-05-31
date of change: 2024-04-22
date of change: 2024-12-16
definition: De apparatuur bestemd voor meten, regelen, controleren en onderhouden van het transport van afvalwater.
definition: [IMBOR] Een (vaak compact) mechanisch of elektronisch ding dat is gemaakt of toegepast voor een specifieke toepassing en doorgaans in één behuizing gevat is.
author at start life: Marinus Vonhof
date of start life: 2016-04-20
validity context: 1d 3d 10d 11d 12d 13d 14f 15d
alternative label: Apparaat
scope note: Cof TOP
type: Class
subclass of: Fysiek object
subclass of: Restriction
  on property: heeft Functie
  has value: Meten, regelen, controleren en onderhouden

Punt
author of change: Marinus Vonhof
date of change: 2026-07-24
definition: Nuldimensionaal element van geografische informatie. Conform coordinatenstelsel EPSG:7415 (x/y conform EPSG:28992, optioneel z conform EPSG:5709).
author at start life: Marinus Vonhof
date of start life: 2016-11-09
units of measurements: gml
comment: [is aspect]
scope note: Cof TOP
type: Class
subclass of: Geometrie
subclass of: Restriction
  author of change: Marinus Vonhof
  date of change: 2020-04-18
  author at start life: Marinus Vonhof
  date of start life: 2016-11-09
  on class: Aansluitpunt
  on property: has as aspect (inverse)
  qualified cardinality: 1
subclass of: Restriction
  author of change: Marinus Vonhof
  date of change: 2020-04-18
  author at start life: Marinus Vonhof
  date of start life: 2016-11-09
  on class: Knooppunt
  on property: has as aspect (inverse)
  qualified cardinality: 1
subclass of: Restriction
  author of change: Marinus Vonhof
  date of change: 2020-04-18
  author at start life: Marinus Vonhof
  date of start life: 2016-11-09
  on class: Putoriëntatie
  on property: has as aspect (inverse)
  qualified cardinality: 1
subclass of: Restriction
  author of change: Marinus Vonhof
  date of change: 2020-04-18
  author at start life: Marinus Vonhof
  date of start life: 2018-12-12
  on class: Maaiveldoriëntatie
  on property: has as aspect (inverse)
  max qualified cardinality: 1
subclass of: Restriction
  on property: has as value
  all values from: gmlLiteral

Materiaal deksel (coll)
author of change: Marinus Vonhof
date of change: 2025-12-19
comment: [is coll]
scope note: Cof TOP
type: Class
subclass of: Verzameling soorten
subclass of: Class

Materiaal leiding (coll)
author of change: Marinus Vonhof
author of change: Johan Post
date of change: 2026-05-04
date of change: 2025-12-19
comment: [is coll]
scope note: Cof TOP
type: Class
subclass of: Verzameling soorten
subclass of: Class

Materiaal put (coll)
author of change: Marinus Vonhof
author of change: Johan Post
author of change: Eric van Gorkom
date of change: 2026-05-04
date of change: 2022-10-03
date of change: 2026-05-21
date of change: 2024-05-13
author at start life: Marinus Vonhof
date of start life: 2026-05-01
comment: [is coll]
scope note: Cof TOP
type: Class
subclass of: Verzameling soorten
subclass of: Class

Assetmanagement transportstelsel
author of change: Marinus Vonhof
date of change: 2014-10-22
author at start life: Marinus Vonhof
date of start life: 2014-09-25
see also: [WSH 20141028] Voorkomen risico's op het gebied van schade, gezondheid. In stand houden van het systeem met betrekking tot functioneren en constructie
scope note: Cof DMO
type: Class
subclass of: Activiteit met raakvlak transportsysteem

Unieke identificatie
label: Resource identifier @en
author of change: Marinus Vonhof
date of change: 2025-01-16
date of change: 2015-08-24
date of change: 2024-11-22
definition: [IMBOR] Een ondubbelzinnige en unieke aanduiding van een object.
author at start life: Nic Roest (Idoro)
date of start life: 2006-03-23
comment: [is aspect]
scope note: Cof TOP
type: Class
subclass of: Kenmerk

Materiaal
author of change: Marinus Vonhof
date of change: 2015-06-01
author at start life: Marinus Vonhof
date of start life: 2013-09-03
validity context: 15d
comment: [is aspect]
scope note: Cof TOP
type: Class
subclass of: Kenmerk

Materiaal lining (coll)
author at start life: Marinus Vonhof
date of start life: 2026-07-17
comment: [is coll]
scope note: Cof TOP
type: Class
subclass of: Verzameling soorten
subclass of: Class
  one of:
    rest:
      rest:
        first: Glasvezel versterkte kunststof

Rioolleiding
label: Pipeline (EN) @en
author of change: Johan Post
author of change: Eric van Gorkom
author of change: Wouter van Riel
date of change: 2022-09-27
date of change: 2024-04-23
date of change: 2026-05-13
definition: [EN 16323:2014] hollow structure for transporting wastewater between manholes or other structures @en
definition: [EN 16323:2014] pipeline or other construction, usually underground, designed to carry wastewater from more than one source @en
definition: [NEN 3300:1996] samenstel van buizen tussen twee putten bestemd voor de inzameling en/of het transport van afvalwater
author at start life: Marinus Vonhof
date of start life: 2014-04-28
validity context: *f
alternative label: Riool
alternative label: Rioolstreng
alternative label: Sewer @en
alternative label: Streng
scope note: Cof TOP
type: Class
subclass of: Leiding
subclass of: Restriction
  author at start life: Marinus Vonhof
  date of start life: 2024-05-16
  on class: Drukklasse
  on property: has as aspect
  max qualified cardinality: 1
subclass of: Restriction
  author at start life: Marinus Vonhof
  date of start life: 2026-07-20
  on class: Doorlaat
  on property: has as part
  max qualified cardinality: 2
subclass of: Restriction
  on property: heeft Functie
  has value: Inzameling van afvalwater
subclass of: Restriction
  on property: heeft Functie
  has value: Transport van afvalwater

Basisinspanning
author of change: Marinus Vonhof
date of change: 2015-10-13
author at start life: Marinus Vonhof
date of start life: 2014-11-29
see also: [IRIS-RIOKEN:2012] Het emissiespoor houdt in dat aan de vuiluitworp van riooloverstorten op het oppervlaktewater een bepaald maximum wordt gesteld. Voor het voldoen aan het emissiespoor moet door de gemeente een bepaalde minimale inspanning worden gedaan. Deze inspanning wordt aangeduid met het begrip basisinspanning.
scope note: Cof DMO
type: Class
subclass of: Activiteit
subclass of: Restriction
  author of change: Marinus Vonhof
  date of change: 2014-11-29
  author at start life: Marinus Vonhof
  date of start life: 2014-11-28
  on class: Rioleringsbeheer
  on property: has as part (inverse)
  max qualified cardinality: 1

Rioleringsbeheer
author at start life: Marinus Vonhof
date of start life: 2018-12-10
scope note: Cof BAS
scope note: Cof DMO
type: Class
subclass of: Gemeentelijke taak
subclass of: Restriction
  author of change: Marinus Vonhof
  date of change: 2014-11-29
  author at start life: Marinus Vonhof
  date of start life: 2014-11-28
  on class: Basisinspanning
  on property: has as part
  max qualified cardinality: 1

Basismateriaal functionaliteit
author of change: Marinus Vonhof
date of change: 2014-12-11
author at start life: Marinus Vonhof
date of start life: 2014-10-22
scope note: Cof DMO
type: Class
subclass of: Informatiedrager

Rioleringsplan
author of change: Marinus Vonhof
date of change: 2018-12-10
author at start life: Marinus Vonhof
date of start life: 2014-11-30
validity context: 6d
see also: [IRIS-RIOKEN:2012] Strategisch operationeel of maatregelen plan waarin beschreven staat hoe men binnen een bepaald gebied met de riolering dient om te gaan
scope note: Cof BAS
scope note: Cof PLI
scope note: Cof DMO
type: Class
subclass of: Informatiedrager

Infiltratiekansenkaart
author at start life: Marinus Vonhof
date of start life: 2014-12-01
scope note: Cof DMO
type: Class
subclass of: Informatiedrager
subclass of: Restriction
  author of change: Marinus Vonhof
  date of change: 2014-12-11
  author at start life: Marinus Vonhof
  date of start life: 2014-12-01
  on class: Basisrioleringsplan
  on property: has as part (inverse)
  max qualified cardinality: 1

Planvorming rioleringsbeheer
author of change: Marinus Vonhof
date of change: 2018-12-14
author at start life: Marinus Vonhof
date of start life: 2014-11-29
scope note: Cof BAS
scope note: Cof DMO
type: Class
subclass of: Rioleringsbeheer
subclass of: Restriction
  author of change: Marinus Vonhof
  date of change: 2018-12-13
  author at start life: Marinus Vonhof
  date of start life: 2014-11-29
  on class: Basisrioleringsplan
  on property: has as output
  min qualified cardinality: 1
subclass of: Restriction
  author of change: Marinus Vonhof
  date of change: 2018-12-13
  author at start life: Marinus Vonhof
  date of start life: 2014-11-29
  on class: Gemeentelijk rioleringsplan
  on property: has as output
  min qualified cardinality: 1
subclass of: Restriction
  author at start life: Marinus Vonhof
  date of start life: 2018-12-13
  on class: Inspectieplan
  on property: has as output
  min qualified cardinality: 0
subclass of: Restriction
  author at start life: Marinus Vonhof
  date of start life: 2018-12-13
  on class: Reinigingsplan
  on property: has as output
  min qualified cardinality: 0

Tewor-toets
author of change: Marinus Vonhof
date of change: 2014-12-13
author at start life: Marinus Vonhof
date of start life: 2014-11-30
see also: [IRIS-RIOKEN:2012] Tewor is een model voor het bepalen van effecten van emissies op (stedelijk) oppervlaktewater.
scope note: Cof DMO
type: Class
subclass of: Activiteit
subclass of: Restriction
  author at start life: Marinus Vonhof
  date of start life: 2014-12-11
  on class: Basisrioleringsplan
  on property: has as input
  max qualified cardinality: 1

Locaties afgekoppeld verhard oppervlak
author at start life: Marinus Vonhof
date of start life: 2015-03-22
comment: [is aspect]
scope note: Cof DMO
type: Class
subclass of: Kenmerk
subclass of: Restriction
  author at start life: Marinus Vonhof
  date of start life: 2015-03-01
  on class: Basisrioleringsplan
  on property: has as part (inverse)
  max qualified cardinality: 1

Beginpunt leiding
label: Node 1 reference @en
author of change: Marinus Vonhof
date of change: 2016-04-24
definition: Het uiteinde van een leiding, anders dan het eindpunt. Ter plaatse van het leidingmidden op de bovenkant bodem.
definition: [EN13508-2+A1] The node reference of the second node as specified by the employing authority. @en
notation: AAD
notation: GAD
author at start life: Marinus Vonhof
date of start life: 2012-04-22
alternative label: Knooppuntreferentie 1
scope note: Cof TOP
type: Class
subclass of: Vertex
subclass of: Restriction
  author of change: Marinus Vonhof
  date of change: 2018-12-06
  author at start life: Marinus Vonhof
  date of start life: 2016-11-09
  validity context: *t
  comment: Temporeel kenmerk, met kenmerk Inwinning
  on class: B.o.b. beginpunt leiding
  on property: has as aspect
  min qualified cardinality: 0
subclass of: Restriction
  author at start life: Marinus Vonhof
  date of start life: 2011-12-02
  validity context: *t
  on class: Knooppunt
  on property: is connected to
  max qualified cardinality: 1
subclass of: Restriction
  author at start life: Marinus Vonhof
  date of start life: 2011-12-02
  on class: Leidingoriëntatie
  on property: has as part (inverse)
  qualified cardinality: 1

Eindpunt leiding
label: Node 2 reference @en
author of change: Marinus Vonhof
date of change: 2016-04-24
definition: [EN13508-2+A1] The node reference of the second node as specified by the employing authority. @en
definition: Het uiteinde van een leiding, anders dan het beginpunt. Ter plaatse van het leidingmidden op de bovenkant bodem.
notation: AAF
notation: GAF
author at start life: Marinus Vonhof
date of start life: 2012-04-22
alternative label: Knooppuntreferentie 2
scope note: Cof TOP
type: Class
subclass of: Vertex
subclass of: Restriction
  author of change: Marinus Vonhof
  date of change: 2018-12-06
  author at start life: Marinus Vonhof
  date of start life: 2016-11-09
  validity context: *t
  comment: Temporeel kenmerk, met kenmerk Inwinning
  on class: B.o.b. eindpunt leiding
  on property: has as aspect
  min qualified cardinality: 0
subclass of: Restriction
  author at start life: Marinus Vonhof
  date of start life: 2011-12-02
  validity context: *t
  on class: Knooppunt
  on property: is connected to
  max qualified cardinality: 1
subclass of: Restriction
  author at start life: Marinus Vonhof
  date of start life: 2011-12-02
  on class: Leidingoriëntatie
  on property: has as part (inverse)
  qualified cardinality: 1

Bedrijfsafvalwater
author of change: Marinus Vonhof
date of change: 2020-04-18
definition: [NEN 3300:1996] Afvalwater, dat niet afkomstig is uit particuliere huishoudens
definition: [NEN-EN 752:2008] afvalwater dat bij een industriële of commerciële activiteit vrijkomt [EN 1085:2007, definitie 2040]
definition: [Waterwet] Afvalwater dat vrijkomt bij door de mens bedrijfsmatig of in een omvang alsof zij bedrijfsmatig was, ondernomen bedrijvigheid, dat geen huishoudelijk afvalwater, afvloeiend hemelwater of grondwater is
author at start life: Marinus Vonhof
date of start life: 2015-03-29
see also: [Saniwijzer] Definitie: afvalwater van industrie of land/tuinbouw
scope note: Cof BAS
scope note: Cof DMO
type: Class
subclass of: Afvalwater

Type bebouwing (coll)
comment: [is coll]
scope note: Cof BAS
scope note: Cof DMO
type: Class
subclass of: Verzameling soorten
subclass of: Class
  one of: Winkels
  one of: Woningen
  one of: Bedrijven

Begindatum
author of change: Marinus Vonhof
author of change: Wouter van Riel
date of change: 2024-04-22
date of change: 2015-05-29
date of change: 2023-01-10
definition: Datum waarop het fysieke object is geplaatst of geïnstalleerd (het wordt daarmee onderdeel van een fysiek systeem). Dus bijvoorbeeld niet de datum van fabricage.
author at start life: Marinus Vonhof
date of start life: 2011-12-15
units of measurements: yyyy-mm-dd
validity context: 5d 16d
alternative label: Installatiedatum
comment: [is aspect]
scope note: Cof TOP
type: Class
subclass of: Datum
subclass of: Restriction
  author at start life: Marinus Vonhof
  date of start life: 2013-09-28
  on class: Fysiek object
  on property: has as aspect (inverse)
  max qualified cardinality: 1
subclass of: Restriction
  on property: has as value
  all values from: date

Beginknooppunt
definition: Het knooppunt dat koppelt aan het (topologische) beginpunt van een leiding.
definition: [EN13508-2+A1] The node reference of the first node as specified by the employing authority. @en
author at start life: Marinus Vonhof
date of start life: 2026-07-17
alternative label: Beginknoop
scope note: Cof TOP
type: Class
subclass of: Extra objecttype (rol)

Extra objecttype (rol)
definition: Aanvullende niet-functionele objecttypering, bijvoorbeeld voor onderscheid van de uitvoeringswijze of de toegevoegde rol van het object. Het subtype is altijd multiparent, met ook een functioneel supertype
author at start life: Marinus Vonhof
date of start life: 2024-08-01
validity context: *f
scope note: Cof TOP
type: Class
subclass of: Informatiedrager

Vertex
author of change: Marinus Vonhof
date of change: 2020-11-24
definition: Het punt waar lijnstukken bij elkaar komen, in de grafentheorie een knoop, in de meetkunde een hoekpunt
author at start life: Marinus Vonhof
date of start life: 2012-04-22
validity context: *f
alternative label: Knoop
scope note: Cof TOP
type: Class
subclass of: Topologisch element

B.o.b. beginpunt leiding
definition: Binnenonderkant buis ter plaatse van het beginpunt
notation: AXG
notation: GXG
author at start life: Marinus Vonhof
date of start life: 2013-03-26
units of measurements: m
alternative label: B.o.b. bij beginknoop t.o.v. NAP
comment: [is aspect]
scope note: Cof TOP
type: Class
subclass of: Binnenonderkant buis
subclass of: Restriction
  author of change: Marinus Vonhof
  date of change: 2017-05-17
  date of change: 2024-05-15
  author at start life: Marinus Vonhof
  date of start life: 2015-10-29
  on class: Inwinning
  on property: has as aspect
  max qualified cardinality: 1
subclass of: Restriction
  author of change: Marinus Vonhof
  date of change: 2018-12-06
  author at start life: Marinus Vonhof
  date of start life: 2016-11-09
  validity context: *t
  on class: Beginpunt leiding
  on property: has as aspect (inverse)
  max qualified cardinality: 1
subclass of: Restriction
  on property: has as value
  all values from: decimal

Leidingoriëntatie
author of change: Marinus Vonhof
date of change: 2020-04-18
definition: Een topologisch element dat het beginpunt, eindpunt (vertices) en de verbindingslijn (edge) daartussen beschrijft. De geometrie volgt het midden van de binnenonderkant van de leiding
notation: AXY
notation: GXY
author at start life: Marinus Vonhof
date of start life: 2017-12-12
scope note: Cof TOP
type: Class
subclass of: Verbinding
subclass of: Restriction
  author of change: Marinus Vonhof
  date of change: 2020-04-18
  author at start life: Marinus Vonhof
  date of start life: 2016-11-09
  comment: Temporeel kenmerk, met kenmerk Inwinning
  on class: Lijn
  on property: has as aspect
  max qualified cardinality: 1
subclass of: Restriction
  author at start life: Marinus Vonhof
  date of start life: 2011-12-02
  on class: Beginpunt leiding
  on property: has as part
  qualified cardinality: 1
subclass of: Restriction
  author at start life: Marinus Vonhof
  date of start life: 2011-12-02
  on class: Eindpunt leiding
  on property: has as part
  qualified cardinality: 1
subclass of: Restriction
  author at start life: Marinus Vonhof
  date of start life: 2012-04-22
  validity context: *t
  on class: Leiding
  on property: has as aspect (inverse)
  max qualified cardinality: 1

Onderdeeloriëntatie
author of change: Marinus Vonhof
author of change: Wouter van Riel
date of change: 2018-12-05
date of change: 2024-04-20
definition: Een topologisch element dat de verbindingslijn (edge) tussen het beginpunt en het eindpunt van het onderdeel beschrijft. Voor een wand, pomp of doorlaat beschrijft dit topologisch element de verbinding ervan binnen het netwerk, zie daarvoor de concepten "beginpunt/eindpunt onderdeel". Dit element kan een geometrie (punt of lijn) bevatten voor presentaties. Bij een wand (stuw-/overstortconstructie) beschrijft de geometrie het midden van de bovenkant wand in de breedterichting.
author at start life: Marinus Vonhof
date of start life: 2017-12-12
scope note: Cof MDS
scope note: Cof REV
scope note: Cof HYD
scope note: Cof DMO
type: Class
subclass of: Verbinding
subclass of: Restriction
  author of change: Marinus Vonhof
  date of change: 2015-06-08
  author at start life: Marinus Vonhof
  date of start life: 2012-04-22
  validity context: 5t 11t
  on class: Wand
  on property: has as aspect (inverse)
  max qualified cardinality: 1
subclass of: Restriction
  author of change: Marinus Vonhof
  date of change: 2018-05-03
  author at start life: Marinus Vonhof
  date of start life: 2012-04-22
  validity context: 5t 11t
  on class: Pomp
  on property: has as aspect (inverse)
  max qualified cardinality: 1
subclass of: Restriction
  author at start life: Marinus Vonhof
  date of start life: 2012-04-22
  validity context: 5t 11t
  on class: Doorlaat
  on property: has as aspect (inverse)
  max qualified cardinality: 1
subclass of: Restriction
  author at start life: Marinus Vonhof
  date of start life: 2025-03-19
  on class: Lijn
  on property: has as aspect
  max qualified cardinality: 1
subclass of: Restriction
  author at start life: Wouter van Riel
  date of start life: 2024-04-20
  on class: Punt
  on property: has as aspect
  max qualified cardinality: 1

Behandelen melding
author at start life: Marinus Vonhof
date of start life: 2014-12-13
scope note: Cof DMO
type: Class
subclass of: Activiteit
subclass of: Restriction
  author at start life: Marinus Vonhof
  date of start life: 2014-12-13
  on class: Calamiteitenplan
  on property: has as input
  qualified cardinality: 1
subclass of: Restriction
  author at start life: Marinus Vonhof
  date of start life: 2014-12-13
  on class: Meldpunt
  on property: has as part (inverse)
  qualified cardinality: 1

Calamiteitenplan
author of change: Marinus Vonhof
date of change: 2015-02-28
definition: Calamiteitenplan / bron=[IWS_LIS_LEIDINGEN][CALAMITEITENPLAN] / type=[VARCHAR2][200]
author at start life: Marinus Vonhof
date of start life: 2014-09-25
comment: [is aspect]
scope note: Cof DMO
type: Class
subclass of: Kenmerk
subclass of: Restriction
  author at start life: Marinus Vonhof
  date of start life: 2014-12-13
  on class: Behandelen melding
  on property: has as input (inverse)
  qualified cardinality: 1

Meldpunt
author of change: Marinus Vonhof
date of change: 2016-04-20
author at start life: Marinus Vonhof
date of start life: 2014-12-13
alternative label: Coördinatiecentrum
scope note: Cof DMO
type: Class
subclass of: Levensvorm
subclass of: Restriction
  author at start life: Marinus Vonhof
  date of start life: 2014-12-13
  on class: Waterschap
  on property: has as part (inverse)
  max qualified cardinality: 1
subclass of: Restriction
  author at start life: Marinus Vonhof
  date of start life: 2014-12-13
  on class: Contactpersoon
  on property: has as part
  min qualified cardinality: 1
subclass of: Restriction
  author at start life: Marinus Vonhof
  date of start life: 2014-12-13
  on class: Behandelen melding
  on property: has as part
  qualified cardinality: 1

Beheer oppervlaktewaterkwaliteit
author of change: Marinus Vonhof
date of change: 2014-10-01
author at start life: Marinus Vonhof
date of start life: 2014-09-25
scope note: Cof DMO
type: Class
subclass of: Activiteit
subclass of: Restriction
  author of change: Marinus Vonhof
  date of change: 2014-10-01
  author at start life: Marinus Vonhof
  date of start life: 2014-09-25
  on class: Monitoren waterkwaliteit
  on property: has as part
  qualified cardinality: 1
subclass of: Restriction
  author of change: Marinus Vonhof
  date of change: 2014-10-01
  author at start life: Marinus Vonhof
  date of start life: 2014-09-25
  on class: Optreden bij calimiteiten waterkwaliteit
  on property: has as part
  qualified cardinality: 1
subclass of: Restriction
  author of change: Marinus Vonhof
  date of change: 2014-10-01
  author at start life: Marinus Vonhof
  date of start life: 2014-09-25
  on class: Verbeteren waterkwaliteit
  on property: has as part
  qualified cardinality: 1
subclass of: Restriction
  author at start life: Marinus Vonhof
  date of start life: 2014-10-04
  on class: Waterschapstaak TRI
  on property: has as part (inverse)
  qualified cardinality: 1
subclass of: Restriction
  author at start life: Marinus Vonhof
  date of start life: 2014-12-12
  on class: Optimaliseren afvalwaterketen
  on property: has as part
  qualified cardinality: 1

Monitoren waterkwaliteit
author of change: Marinus Vonhof
date of change: 2014-10-01
author at start life: Marinus Vonhof
date of start life: 2014-09-25
see also: [WSH 20141023] Overstortbelasting nodig voor prioritering. In de gaten houden, meten, inspecteren en bewaken
scope note: Cof DMO
type: Class
subclass of: Activiteit met raakvlak riolering
subclass of: Restriction
  author of change: Marinus Vonhof
  date of change: 2014-10-01
  author at start life: Marinus Vonhof
  date of start life: 2014-09-25
  on class: Beheer oppervlaktewaterkwaliteit
  on property: has as part (inverse)
  qualified cardinality: 1

Optreden bij calimiteiten waterkwaliteit
author of change: Marinus Vonhof
date of change: 2014-10-01
author at start life: Marinus Vonhof
date of start life: 2014-09-25
scope note: Cof DMO
type: Class
subclass of: Activiteit met raakvlak riolering
subclass of: Restriction
  author of change: Marinus Vonhof
  date of change: 2014-10-01
  author at start life: Marinus Vonhof
  date of start life: 2014-09-25
  on class: Beheer oppervlaktewaterkwaliteit
  on property: has as part (inverse)
  qualified cardinality: 1

Verbeteren waterkwaliteit
author of change: Marinus Vonhof
date of change: 2014-10-01
author at start life: Marinus Vonhof
date of start life: 2014-09-25
scope note: Cof DMO
type: Class
subclass of: Activiteit met raakvlak riolering
subclass of: Restriction
  author of change: Marinus Vonhof
  date of change: 2014-10-01
  author at start life: Marinus Vonhof
  date of start life: 2014-09-25
  on class: Beheer oppervlaktewaterkwaliteit
  on property: has as part (inverse)
  qualified cardinality: 1

Waterschapstaak TRI
author of change: Marinus Vonhof
date of change: 2014-12-11
definition: De waterschapstaken in kader van Transport en Riolering / De waterschapstaken in relatie met de afvalwaterketen
author at start life: Marinus Vonhof
date of start life: 2014-09-25
scope note: Cof DMO
type: Class
subclass of: Activiteit
subclass of: Restriction
  author of change: Marinus Vonhof
  date of change: 2014-10-06
  author at start life: Marinus Vonhof
  date of start life: 2014-10-04
  on class: Beheer oppervlaktewaterkwantiteit
  on property: has as part
  qualified cardinality: 1
subclass of: Restriction
  author of change: Marinus Vonhof
  date of change: 2014-12-02
  author at start life: Marinus Vonhof
  date of start life: 2014-10-04
  on class: Transport en zuiveren afvalwater
  on property: has as part
  qualified cardinality: 1
subclass of: Restriction
  author at start life: Marinus Vonhof
  date of start life: 2014-10-04
  on class: Beheer oppervlaktewaterkwaliteit
  on property: has as part
  qualified cardinality: 1

Optimaliseren afvalwaterketen
author of change: Marinus Vonhof
author of change: Eric van Gorkom
date of change: 2024-07-16
date of change: 2014-12-12
date of change: 2024-05-13
date of change: 2024-05-27
author at start life: Marinus Vonhof
date of start life: 2014-09-25
see also: [WSH 20141023] Optimum bereiken in belasting van oppervlaktewater en maatschappelijke kosten. Afwegingen over samenspel stelsels (eigenschappen, input, output), gemalen, zuivering en oppervlaktewater
scope note: Cof DMO
type: Class
subclass of: Activiteit
subclass of: Restriction
  author of change: Marinus Vonhof
  date of change: 2014-12-12
  author at start life: Marinus Vonhof
  date of start life: 2014-12-02
  on class: Gemeentelijke taak
  on property: has as part (inverse)
  qualified cardinality: 1
subclass of: Restriction
  author at start life: Marinus Vonhof
  date of start life: 2014-12-12
  on class: Optimalisatie afvalwater studie
  on property: has as output
  max qualified cardinality: 1
subclass of: Restriction
  author at start life: Marinus Vonhof
  date of start life: 2014-12-12
  on class: Beheer oppervlaktewaterkwaliteit
  on property: has as part (inverse)
  qualified cardinality: 1
subclass of: Restriction
  author at start life: Marinus Vonhof
  date of start life: 2014-12-12
  on class: Beheer oppervlaktewaterkwantiteit
  on property: has as part (inverse)
  qualified cardinality: 1

Bewaking peilbesluiten
author at start life: Marinus Vonhof
date of start life: 2014-11-23
scope note: Cof DMO
type: Class
subclass of: Activiteit met raakvlak riolering
subclass of: Restriction
  author at start life: Marinus Vonhof
  date of start life: 2014-11-23
  on class: Beheer oppervlaktewaterkwantiteit
  on property: has as part (inverse)
  qualified cardinality: 1

Beheerder
author of change: Marinus Vonhof
date of change: 2025-01-16
date of change: 2016-04-25
definition: Degene die als natuurlijk persoon handelende in de uitoefening van een beroep of bedrijf dan wel als rechtspersoon iets beheert
definition: [IMBOR] Een publiekrechtelijke instantie of (rechts)persoon die toeziet op de instandhouding van o.a. een object, kunstwerk of waterstaatswerk. De domeinwaardenindeling is conform de indeling in bronhouders (BGT).
author at start life: Marinus Vonhof
date of start life: 2012-04-29
validity context: 1d 3f 10d 12d 14f
scope note: Cof MDS
scope note: Cof RRB
scope note: Cof LDR
scope note: Cof DMO
type: Class
subclass of: Levensvorm

Belangenstrook
author of change: Marinus Vonhof
date of change: 2015-02-28
author at start life: Marinus Vonhof
date of start life: 2014-09-25
see also: [WSH 20141028] Buffer rondom leiding
scope note: Cof DMO
type: Class
subclass of: Gebied

Bemalingsgebied
author of change: Johan Post
date of change: 2021-10-01
definition: [NEN 3300:1996] een rioleringsgebied waaruit het afvalwater door een gemaal wordt verwijderd
author at start life: Marinus Vonhof
date of start life: 2013-02-05
scope note: Cof REV
scope note: Cof BAS
scope note: Cof DMO
type: Class
subclass of: Rioleringsgebied

Rioleringsgebied
author of change: Johan Post
date of change: 2022-09-29
date of change: 2024-10-21
definition: Een gebied zodanig gekozen dat het voldoende inzicht geeft in de belasting van oppervlaktewater en overnamepunt
author at start life: Marinus Vonhof
date of start life: 2014-11-30
validity context: 1d
see also: [IRIS-RIOKEN:2012] Het gebied waarbinnen 1 of meerdere inliggende rioolstelsel(s) het afvalwater naar 1 gemaal of overnamepunt transporteert/teren. Een rioleringsgebied kan een enkelvoudig gebied zijn, maar kan ook meerdere rioleringsgebieden omvatten.
scope note: Cof REV
scope note: Cof BAS
scope note: Cof DMO
type: Class
subclass of: Gebied
subclass of: Restriction
  author of change: Marinus Vonhof
  date of change: 2015-07-08
  author at start life: Marinus Vonhof
  date of start life: 2014-12-02
  on class: Gemeentelijk gebied
  on property: has as part (inverse)
  max qualified cardinality: 1
subclass of: Restriction
  author of change: Marinus Vonhof
  date of change: 2016-10-25
  author at start life: Marinus Vonhof
  date of start life: 2014-12-03
  on class: Rioleringsgebied
  on property: has as part (inverse)
  max qualified cardinality: 1
subclass of: Restriction
  author of change: Marinus Vonhof
  date of change: 2016-10-25
  author at start life: Marinus Vonhof
  date of start life: 2014-12-03
  on class: Rioleringsgebied
  on property: has as part
  min qualified cardinality: 0
subclass of: Restriction
  author of change: Marinus Vonhof
  date of change: 2018-12-06
  author at start life: Marinus Vonhof
  date of start life: 2015-06-02
  on class: Zuiveringseenheid
  on property: has as part (inverse)
  qualified cardinality: 1
subclass of: Restriction
  author of change: Marinus Vonhof
  date of change: 2020-11-23
  author at start life: Marinus Vonhof
  date of start life: 2018-12-17
  on class: Oppervlakte
  on property: has as aspect
  max qualified cardinality: 1
subclass of: Restriction
  author at start life: Marinus Vonhof
  date of start life: 2015-07-23
  on class: Code
  on property: has as aspect
  max qualified cardinality: 1
subclass of: Restriction
  author at start life: Marinus Vonhof
  date of start life: 2022-10-01
  on class: Stelsel
  on property: has as part
  min qualified cardinality: 0
subclass of: Restriction
  author at start life: Marinus Vonhof
  date of start life: 2022-10-01
  on class: Systeem
  on property: has as part
  min qualified cardinality: 0
subclass of: Restriction
  on class: Overnamepunt
  on property: has as part
  max qualified cardinality: 1

Benedenstrooms eindriool
author of change: Marinus Vonhof
date of change: 2016-04-28
definition: Een gesloten rioolleiding die het afvalwater afvoert van het eindgemaal naar de RWZI
author at start life: Finy Teitsma (Oranjewoud)
date of start life: 2007-10-23
scope note: Cof MDS
scope note: Cof HYD
scope note: Cof DMO
type: Class
subclass of: Transportrioolleiding
subclass of: Restriction
  on property: heeft Functie
  has value: Afvoer van afvalwater naar een RWZI

Transportrioolleiding
author of change: Marinus Vonhof
date of change: 2015-07-28
definition: Een gesloten rioolleiding waarop in principe geen aansluitleidingen zijn aangesloten.
definition: [NEN 3300:1996] Riool hoofdzakelijk bestemd voor het transport van afvalwater
author at start life: Finy Teitsma (Oranjewoud)
date of start life: 2006-11-29
comment: 20151014: NEN3300-definitie aangepast
alternative label: Hoofdriool
alternative label: Moerriool
alternative label: Transportriool
scope note: Cof MDS
scope note: Cof REV
scope note: Cof HYD
scope note: Cof DMO
type: Class
subclass of: Vrijverval transportleiding
subclass of: Restriction
  author of change: Marinus Vonhof
  date of change: 2025-12-03
  author at start life: Marinus Vonhof
  date of start life: 2018-12-06
  on class: Vrijverval leidingsegment
  on property: has as part
  min qualified cardinality: 0
subclass of: Restriction
  on property: heeft Uitvoering
  has value: Zonder aansluitingen

Stuwconstructie
label: Weir @en
author of change: Marinus Vonhof
author of change: Wouter van Riel
date of change: 2025-01-16
date of change: 2024-04-22
date of change: 2018-05-17
definition: [EN 16323:2014] overflow structure that can be used for controlling upstream surface level or for measuring discharge, or for both @en
definition: [IMBOR] Een inrichting waarmee bij regen de afstroming van rioolwater uit hooggelegen riolen wordt vertraagd.
author at start life: Marinus Vonhof
date of start life: 2013-09-28
validity context: 1d
scope note: Cof MDS
scope note: Cof HYD
scope note: Cof DMO
type: Class
subclass of: Constructieonderdeel
subclass of: Restriction
  author of change: Marinus Vonhof
  date of change: 2018-12-12
  author at start life: Marinus Vonhof
  date of start life: 2015-09-07
  on class: Opening in wand
  on property: has as part
  min qualified cardinality: 0
subclass of: Restriction
  author at start life: Marinus Vonhof
  date of start life: 2017-03-29
  on class: Stuwmuur
  on property: has as part
  qualified cardinality: 1
subclass of: Restriction
  author at start life: Marinus Vonhof
  date of start life: 2018-12-12
  on class: Wervelventiel
  on property: has as part
  max qualified cardinality: 1
subclass of: Restriction
  on property: heeft Functie
  has value: Bovenstrooms waterpeil regelen

Verbeterd hemelwaterstelsel
author of change: Marinus Vonhof
date of change: 2019-03-20
definition: Hemelwaterstelsel met voorzieningen waardoor een deel van de neerslag naar het vuilwaterriool wordt afgevoerd of wordt gezuiverd door bijvoorbeeld een filterconstructie of wadi.
author at start life: Marinus Vonhof
date of start life: 2018-12-06
scope note: Cof TOP
type: Class
subclass of: Hemelwaterstelsel
subclass of: Restriction
  author at start life: Marinus Vonhof
  date of start life: 2018-12-06
  on class: Verbeterd gescheiden systeem
  on property: has as part (inverse)
  qualified cardinality: 1
subclass of: Restriction
  author at start life: Marinus Vonhof
  date of start life: 2020-05-26
  on class: Rioolgemaal
  on property: has as part
  min qualified cardinality: 0
subclass of: Restriction
  on property: heeft Functie
  has value: Tijdelijke berging van hemelwater

Inhoud
author of change: Marinus Vonhof
date of change: 2025-01-16
date of change: 2015-05-29
definition: [IMBOR] Kenmerk voor het volume van het beheerobject.
author at start life: Nic Roest (Idoro)
date of start life: 2006-02-21
units of measurements: m3
comment: [is aspect]
scope note: Cof TOP
type: Class
subclass of: Kenmerk
subclass of: Restriction
  on property: has as value
  all values from: decimal

Hemelwaterstelsel
author of change: Marinus Vonhof
author of change: Johan Post
author of change: Wouter van Riel
date of change: 2024-05-16
date of change: 2021-10-01
date of change: 2024-04-22
definition: Een enkelvoudig vrijverval rioolstelsel bestemd voor de inzameling, het transport en de tijdelijke berging van hemelwater.
definition: [NEN 3300:1996] Rwa-rioolstelsel is synoniem van hemelwaterstelsel
definition: [NEN 3300:1996] rioolstelsel alleen bestemd voor de inzameling en het transport van neerslag
author at start life: Finy Teitsma (Oranjewoud)
date of start life: 2007-10-23
alternative label: HWA stelsel
alternative label: RWA-rioolstelsel
alternative label: Regenwaterrioolstelsel
scope note: Cof TOP
type: Class
subclass of: Vrijverval rioolstelsel
subclass of: Restriction
  author of change: Marinus Vonhof
  date of change: 2018-12-13
  author at start life: Finy Teitsma (Oranjewoud)
  date of start life: 2007-11-29
  on class: Gescheiden systeem
  on property: has as part (inverse)
  qualified cardinality: 1
subclass of: Restriction
  on property: heeft Functie
  has value: Inzameling van hemelwater
subclass of: Restriction
  on property: heeft Functie
  has value: Transport van hemelwater

Pompput
author of change: Finy Teitsma (Oranjewoud)
author of change: Johan Post
date of change: 2026-05-01
date of change: 2007-11-12
date of change: 2026-05-18
definition: Een rioolput met een inrichting bestemd voor het verpompen van afvalwater.
definition: [NEN 3300:1996] rioolput met een inrichting voor het verpompen van afvalwater
author at start life: Finy Teitsma (Oranjewoud)
date of start life: 2006-02-20
scope note: Cof TOP
type: Class
subclass of: Rioolput
subclass of: Restriction
  author of change: Marinus Vonhof
  date of change: 2016-04-15
  author at start life: Finy Teitsma (Oranjewoud)
  date of start life: 2006-02-25
  comment: per definitie
  on class: Pomp
  on property: has as part
  min qualified cardinality: 1
subclass of: Restriction
  author at start life: Marinus Vonhof
  date of start life: 2019-07-11
  on class: Pompschakeling
  on property: has as aspect
  max qualified cardinality: 1
subclass of: Restriction
  on property: heeft Functie
  has value: Verpompen van afvalwater
subclass of: Restriction
  on class: Rioolstelsel
  on property: has as part (inverse)
  max qualified cardinality: 1

Materie
author of change: Marinus Vonhof
date of change: 2024-05-16
date of change: 2024-12-23
author at start life: Wouter Johan Eric
date of start life: 2021-08-30
validity context: *d
scope note: Cof TOP
type: Class

Structuur
author of change: Marinus Vonhof
date of change: 2021-01-09
definition: Onderscheidende beschrijving van topologie, afmetingen, opbouw (delen)
author at start life: Marinus Vonhof
date of start life: 2013-09-29
validity context: 6d
comment: Onderscheidend kenmerk
comment: [is aspect]
scope note: Cof TOP
type: Class
subclass of: Onderscheidend kenmerk

Wand
author of change: Marinus Vonhof
date of change: 2019-04-05
date of change: 2022-10-01
date of change: 2025-03-19
author at start life: Marinus Vonhof
date of start life: 2012-04-24
validity context: *f
scope note: Cof MDS
scope note: Cof REV
scope note: Cof HYD
scope note: Cof DMO
type: Class
subclass of: Constructieonderdeel
subclass of: Restriction
  author of change: Marinus Vonhof
  date of change: 2015-06-08
  author at start life: Marinus Vonhof
  date of start life: 2012-04-22
  validity context: 5t 11t 14t
  on class: Onderdeeloriëntatie
  on property: has as aspect
  max qualified cardinality: 1
subclass of: Restriction
  on property: heeft Technologie
  has value: Statisch

Binnendiameter
definition: De inwendige maat
author at start life: Marinus Vonhof
date of start life: 2026-07-20
comment: Alleen voor administratieve doeleinden, voor uitwisselingsdoeleinden altijd het kenmerk "Diameter leiding" gebruiken.
comment: [is aspect]
scope note: Cof DMO
type: Class
subclass of: Diameter leiding

Diameter leiding
author of change: Marinus Vonhof
date of change: 2019-01-24
definition: De lengte van de middellijn van de cirkel die de binnen- of de buitenzijde van de leidingdoorsnede beschrijft. Gehanteerd wordt de handelsmaat (de nominale diameter). Voor kunststof is deze lengte de buitenmaat, voor de overige materialen de binnenmaat. Dat geldt ook voor (de kunststof) Polypropyleen (PP), hoewel daarvoor in andere praktijken soms de binnenmaat wordt gebruikt.
author at start life: Marinus Vonhof
date of start life: 2013-10-01
units of measurements: mm
comment: Intrinsiek aspect
comment: In datasets kan voor de afmeting van ronde leidingen zowel de diameter, hoogte of breedte als kenmerk worden gebruikt
comment: [is aspect]
scope note: Cof MDS
scope note: Cof PLI
scope note: Cof HYD
scope note: Cof DMO
type: Class
subclass of: Diameter
subclass of: Restriction
  author of change: Marinus Vonhof
  date of change: 2015-09-20
  author at start life: Marinus Vonhof
  date of start life: 2013-10-01
  on class: Leiding
  on property: has as aspect (inverse)
  max qualified cardinality: 1
subclass of: Restriction
  author at start life: Marinus Vonhof
  date of start life: 2024-05-16
  on class: Inwinning
  on property: has as aspect
  max qualified cardinality: 1
subclass of: Restriction
  on property: has as value
  all values from: Diameter leiding (datatype)

Binnenonderkant buis
author of change: Marinus Vonhof
date of change: 2015-06-01
definition: Hoogteligging t.o.v. NAP van de binnen-onderkant-buis van de leiding
author at start life: Marinus Vonhof
date of start life: 2014-11-28
units of measurements: m
see also: [IRIS-RIOKEN:2012] Binnonderkant buis
alternative label: B.o.b.
alternative label: B.o.k.
comment: [is aspect]
scope note: Cof TOP
type: Class
subclass of: Hoogte t.o.v. NAP
subclass of: Restriction
  on property: has as value
  all values from: decimal

Biologisch zuurstofverbruik
label: Biochemical oxygen demand @en
definition: [EN 16323:2014] concentration of dissolved oxygen consumed under specific conditions (t days at 20 °C with or without nitrification inhibition) by the biological oxidation of organic and/or inorganic matter in water @en
author at start life: Marinus Vonhof
date of start life: 2014-11-29
units of measurements: mg/l
see also: [IRIS-RIOKEN:2012] De hoeveelheid zuurstof die nodig is voor de afbraak van biologisch afbreekbare organische stoffen in water door micro- organismen. Het geeft daarmee aan hoe vervuild het water is met deze stoffen. De eenheid waarin het wordt aangeduid is milligram zuurstof per liter water (mg/l).
alternative label: BZV
comment: [is aspect]
scope note: Cof DMO
type: Class
subclass of: Kenmerk
subclass of: Restriction
  on property: has as value
  all values from: decimal

B.o.b. eindpunt leiding
definition: Binnenonderkant buis ter plaatse van het eindpunt
notation: AXH
notation: GXH
author at start life: Marinus Vonhof
date of start life: 2013-03-26
units of measurements: m
alternative label: B.o.b. bij eindknoop t.o.v. NAP
comment: [is aspect]
scope note: Cof TOP
type: Class
subclass of: Binnenonderkant buis
subclass of: Restriction
  author of change: Marinus Vonhof
  date of change: 2018-12-06
  author at start life: Marinus Vonhof
  date of start life: 2016-11-09
  validity context: *t
  on class: Eindpunt leiding
  on property: has as aspect (inverse)
  max qualified cardinality: 1
subclass of: Restriction
  author at start life: Marinus Vonhof
  date of start life: 2015-10-29
  on class: Inwinning
  on property: has as aspect
  max qualified cardinality: 1
subclass of: Restriction
  on property: has as value
  all values from: decimal

Bodembedreigend afvalwater
definition: Afvalwater met daarin stoffen die een bedreiging voor de bodem vormen, zoals opgenomen in de Nederlandse Richtlijn Bodembescherming
author at start life: Wouter van Riel
date of start life: 2024-04-22
scope note: Cof BAS
scope note: Cof DMO
type: Class
subclass of: Afvalwater

Vorm
author of change: Marinus Vonhof
date of change: 2025-01-16
definition: Geometrische omschrijving
definition: [IMBOR] Kwalitatieve aanduiding van de contouren van een beheerobject.
author at start life: Marinus Vonhof
date of start life: 2016-04-23
validity context: 15d
comment: [is aspect]
scope note: Cof TOP
type: Class
subclass of: Kenmerk

Onderzoeken
author of change: Marinus Vonhof
date of change: 2015-08-24
definition: [NEN 3300:1996] Verzamelen, ordenen, analyseren en verwerken van gegevens, zodat informatie kan worden afgeleid over de toestand en het functioneren van de buitenriolering
author at start life: Marinus Vonhof
date of start life: 2013-03-26
validity context: 1f 3f 5d 10f 11d 12f 14f
scope note: Cof TOP
type: Class
subclass of: Maatregel

Boostergemaal
author of change: Marinus Vonhof
date of change: 2018-05-03
definition: Een gemaal voor het verhogen van de vloeistofdruk door het afvalwater rechtstreeks van een pompinstallatie naar de volgende te persen
author at start life: Finy Teitsma (Oranjewoud)
date of start life: 2007-10-23
scope note: Cof MDS
scope note: Cof HYD
scope note: Cof RGM
scope note: Cof DMO
type: Class
subclass of: Rioolgemaal
subclass of: Restriction
  on property: heeft Technologie
  has value: Direct transport door pompen zonder opvang in een ontvangput/kelder

Rioolgemaal
author of change: Marinus Vonhof
author of change: Johan Post
date of change: 2024-04-30
date of change: 2017-08-19
definition: Een gemaal voor het verpompen van afvalwater.
definition: [NEN 3300:1996] een inrichting voor het verpompen van afvalwater
definition: [NEN-EN 752:2008] geheel van gebouw, constructies en apparatuur dat wordt gebruikt om afvalwater via een persleiding te transporteren of om het afvalwater op andere wijze omhoog te brengen
author at start life: Marinus Vonhof
date of start life: 2012-04-29
see also: [IRIS-RIOKEN:2012] Civiel werk waarin alle technische voorzieningen zijn ondergebracht die benodigd zijn voor het verpompen van rioolwater. Voor het waterschap zijn in principe alleen de riooleindgemalen interessant, waar overdracht van afvalwater plaatsvindt naar een stelsel dat onder beheer van dit waterschap is.
see also: [IRIS-RIOKEN:2012] Influentgemaal is synoniem van Rioolgemaal
alternative label: Influentgemaal
scope note: Cof TOP
type: Class
subclass of: Gemaal
subclass of: Restriction
  author of change: Marinus Vonhof
  date of change: 2019-07-10
  author at start life: Marinus Vonhof
  date of start life: 2014-10-14
  on class: Transportstelsel
  on property: has as part (inverse)
  max qualified cardinality: 1
subclass of: Restriction
  author of change: Marinus Vonhof
  date of change: 2017-03-06
  author at start life: Nic Roest (Idoro)
  date of start life: 2007-11-29
  on class: Persleiding
  on property: is connected to
  min qualified cardinality: 0
subclass of: Restriction
  author at start life: Marinus Vonhof
  date of start life: 2014-12-02
  on class: Persleidingstelsel
  on property: has as part (inverse)
  qualified cardinality: 1
subclass of: Restriction
  author at start life: Marinus Vonhof
  date of start life: 2020-05-26
  on class: Gemengd rioolstelsel
  on property: has as part (inverse)
  max qualified cardinality: 1
subclass of: Restriction
  author at start life: Marinus Vonhof
  date of start life: 2020-05-26
  on class: Verbeterd hemelwaterstelsel
  on property: has as part (inverse)
  max qualified cardinality: 1
subclass of: Restriction
  author at start life: Marinus Vonhof
  date of start life: 2020-05-26
  on class: Vuilwaterstelsel
  on property: has as part (inverse)
  max qualified cardinality: 1
subclass of: Restriction
  on property: heeft Functie
  has value: Verpompen van afvalwater

Onderhouden
label: Maintenance @en
author of change: Marinus Vonhof
date of change: 2020-10-28
definition: [EN 16323:2014] routine work undertaken to ensure the continuing performance of an asset @en
definition: [NEN 3300:1996] herstel van het oorspronkelijke functioneren, waarbij de toestand van objecten ongewijzigd gehandhaafd wordt
definition: [NEN-EN 752:2008] activiteiten die routinematig worden uitgevoerd om ervoor te zorgen dat de riolering goed blijft functioneren
author at start life: Marinus Vonhof
date of start life: 2013-02-05
validity context: 1f 3f 5d 10f 11d 12f 14f 16d
see also: [EN ISO 11298-1:2018] routine work undertaken to ensure the existing performance of an asset
scope note: Cof TOP
type: Class
subclass of: Maatregel
subclass of: Restriction
  on property: heeft Doel
  has value: Goed blijven functioneren
subclass of: Restriction
  on property: heeft Functie
  has value: Zonder toestandswijziging

Bouwwerkoriëntatie
author of change: Marinus Vonhof
date of change: 2018-12-05
definition: Een topologisch element dat de contouren (edge) of het zwaartepunt (vertex) van een bouwwerk beschrijft
author at start life: Marinus Vonhof
date of start life: 2017-12-12
scope note: Cof TOP
type: Class
subclass of: Knooppunt
subclass of: Restriction
  author of change: Marinus Vonhof
  date of change: 2017-08-21
  author at start life: Marinus Vonhof
  date of start life: 2017-08-19
  on class: Maaiveldoriëntatie
  on property: is connected to
  max qualified cardinality: 1
subclass of: Restriction
  author of change: Marinus Vonhof
  date of change: 2018-05-03
  author at start life: Marinus Vonhof
  date of start life: 2017-08-19
  validity context: 5t 11t
  on class: Bouwwerk
  on property: has as aspect (inverse)
  max qualified cardinality: 1
subclass of: Restriction
  author of change: Marinus Vonhof
  date of change: 2020-04-18
  date of change: 2026-07-24
  author at start life: Marinus Vonhof
  date of start life: 2016-11-09
  comment: Temporeel kenmerk, met kenmerk Inwinning
  on class: Buitengrens
  on property: has as aspect
  max qualified cardinality: 1

Status functioneren
author of change: Marinus Vonhof
date of change: 2018-05-03
author at start life: Marinus Vonhof
date of start life: 2014-12-02
validity context: 6d 15d
comment: [is aspect]
scope note: Cof REV
scope note: Cof BAS
scope note: Cof RGM
scope note: Cof DMO
type: Class
subclass of: Kenmerk
subclass of: Restriction
  author of change: Marinus Vonhof
  date of change: 2018-12-06
  author at start life: Marinus Vonhof
  date of start life: 2014-12-02
  on class: Bouwwerk
  on property: has as aspect (inverse)
  max qualified cardinality: 1
subclass of: Restriction
  author at start life: Marinus Vonhof
  date of start life: 2014-12-02
  on class: Leiding
  on property: has as aspect (inverse)
  max qualified cardinality: 1
subclass of: Restriction
  author at start life: Marinus Vonhof
  date of start life: 2014-12-02
  on class: Put
  on property: has as aspect (inverse)
  max qualified cardinality: 1
subclass of: Restriction
  author at start life: Marinus Vonhof
  date of start life: 2023-01-10
  on class: Inwinning
  on property: has as aspect
  max qualified cardinality: 1
subclass of: Restriction
  on property: has as reference (qualification)
  all values from: Status functioneren (coll)

Buitengrens
author of change: Marinus Vonhof
date of change: 2024-07-17
date of change: 2020-11-24
date of change: 2024-12-07
definition: Het vlak dat de buitengrens beschrijft van de ruimte of de bovenkant van de constructie (topini: outer boundary/1661)
author at start life: Marinus Vonhof
date of start life: 2013-09-03
units of measurements: gml
comment: [is aspect]
scope note: Cof TOP
type: Class
subclass of: Vlak
subclass of: Restriction
  author of change: Marinus Vonhof
  date of change: 2020-04-18
  author at start life: Marinus Vonhof
  date of start life: 2012-11-23
  on class: Putoriëntatie
  on property: has as aspect (inverse)
  max qualified cardinality: 1
subclass of: Restriction
  author of change: Marinus Vonhof
  date of change: 2020-04-18
  author at start life: Marinus Vonhof
  date of start life: 2016-11-09
  on class: Bouwwerkoriëntatie
  on property: has as aspect (inverse)
  max qualified cardinality: 1
subclass of: Restriction
  author of change: Marinus Vonhof
  date of change: 2020-04-18
  author at start life: Marinus Vonhof
  date of start life: 2016-11-09
  on class: Gebiedsoriëntatie
  on property: has as aspect (inverse)
  max qualified cardinality: 1
subclass of: Restriction
  on property: has as value
  all values from: gmlLiteral

Bovengrond
author of change: Marinus Vonhof
author of change: Johan Post
date of change: 2015-06-01
date of change: 2026-04-30
author at start life: Marinus Vonhof
date of start life: 2013-10-05
validity context: *f 16d
scope note: Cof TOP
type: Class
subclass of: Ruimte
subclass of: Restriction
  author at start life: Johan Post
  date of start life: 2026-04-30
  on class: Leiding
  on property: has as part
  min qualified cardinality: 0
subclass of: Restriction
  author at start life: Johan Post
  date of start life: 2026-04-30
  on class: Put
  on property: has as part
  min qualified cardinality: 0
subclass of: Restriction
  author at start life: Marinus Vonhof
  date of start life: 2013-10-05
  on class: Inrichting bovengrond
  on property: has as aspect
  max qualified cardinality: 1

Ruimte
author of change: Marinus Vonhof
date of change: 2017-11-16
definition: [Gellish] Is an inanimate physical object (a physical object that is not capable of life) that is volumetric and is enclosed by physical or imaginary boundaries and exists in time. This is distinguished from a volumetric spatial aspect and from a volume as a property. @en
author at start life: Marinus Vonhof
date of start life: 2013-09-03
validity context: *f 15d
comment: 2 of meer
scope note: Cof TOP
type: Class
subclass of: Restriction
  on property: has as part
  all values from: Class
    union of: Ruimte
    union of: Fysiek object
disjoint with: Fysiek object

Inrichting bovengrond
author at start life: Marinus Vonhof
date of start life: 2013-10-05
validity context: 6d
comment: [is aspect]
scope note: Cof BAS
scope note: Cof DMO
type: Class
subclass of: Kenmerk
subclass of: Restriction
  author of change: Marinus Vonhof
  date of change: 2020-04-18
  author at start life: Marinus Vonhof
  date of start life: 2013-10-05
  on class: Bovengrond
  on property: has as aspect (inverse)
  max qualified cardinality: 1
subclass of: Restriction
  on property: has as reference (qualification)
  all values from: Inrichting bovengrond (coll)

Inrichting bovengrond (coll)
validity context: 6d
comment: [is coll]
scope note: Cof BAS
scope note: Cof DMO
type: Class
subclass of: Verzameling soorten
subclass of: Class
  one of: Openbaar groen
  one of: In de weg
  one of: Trottoir / fietspad
  one of: Particuliere grond
  one of: In de wegkant
  one of: Braak terrein

Breedte
author of change: Marinus Vonhof
date of change: 2015-05-29
definition: In zelfde vlak als lengte, haaks op lengtemeting
author at start life: Nic Roest (Idoro)
date of start life: 2006-02-21
validity context: 15d
comment: [is aspect]
scope note: Cof TOP
type: Class
subclass of: Afstand

Doorlaat
author of change: Marinus Vonhof
date of change: 2018-12-13
definition: Een regelvoorziening voor de stroming van het afvalwater.
notation: DRL
author at start life: Marinus Vonhof
date of start life: 2012-05-05
validity context: *f
scope note: Cof MDS
scope note: Cof REV
scope note: Cof PLI
scope note: Cof HYD
scope note: Cof DMO
type: Class
subclass of: Constructieonderdeel
subclass of: Restriction
  author at start life: Marinus Vonhof
  date of start life: 2012-04-22
  validity context: 5t 11t 14t
  on class: Onderdeeloriëntatie
  on property: has as aspect
  max qualified cardinality: 1
subclass of: Restriction
  author at start life: Marinus Vonhof
  date of start life: 2026-07-20
  on class: Rioolleiding
  on property: has as part (inverse)
  max qualified cardinality: 1
subclass of: Restriction
  author at start life: Marinus Vonhof
  date of start life: 2026-07-20
  on class: Transportleiding
  on property: has as part (inverse)
  max qualified cardinality: 1
subclass of: Restriction
  on property: heeft Functie
  has value: Beperken debiet

Breedte put
author of change: Marinus Vonhof
author of change: Johan Post
date of change: 2021-08-06
date of change: 2026-05-01
definition: De inwendige breedte (horizontaal, uit het bovenaanzicht). Indien aanwezig de breedte van de onderbak - zie afbeelding dc (bron EN13508-2)
author at start life: Marinus Vonhof
date of start life: 2018-10-17
units of measurements: mm
comment: Intrinsiek aspect
comment: [is aspect]
scope note: Cof TOP
type: Class
subclass of: Breedte
subclass of: Restriction
  author of change: Marinus Vonhof
  date of change: 2014-08-01
  author at start life: Finy Teitsma (Oranjewoud)
  date of start life: 2006-02-25
  validity context: *t
  on class: Put
  on property: has as aspect (inverse)
  max qualified cardinality: 1
subclass of: Restriction
  on property: has as value
  all values from: Breedte put (datatype)

Breedte toegang
author of change: Marinus Vonhof
author of change: Nic Roest (Idoro)
author of change: Johan Post
date of change: 2025-01-16
date of change: 2026-05-01
date of change: 2006-11-23
definition: [IMBOR] De kleinste afmeting in het horizontale vlak dat toegang geeft tot het object. - zie afbeelding da (bron EN13508-2)
notation: JCC
author at start life: Nic Roest (Idoro)
date of start life: 2006-03-23
units of measurements: mm
comment: Intrinsiek aspect
comment: [is aspect]
scope note: Cof RRB
scope note: Cof LDR
scope note: Cof BAS
scope note: Cof DMO
type: Class
subclass of: Breedte
subclass of: Restriction
  author of change: Marinus Vonhof
  date of change: 2018-05-03
  author at start life: Finy Teitsma (Oranjewoud)
  date of start life: 2006-02-25
  on class: Rioolput
  on property: has as aspect (inverse)
  max qualified cardinality: 1
subclass of: Restriction
  author at start life: Marinus Vonhof
  date of start life: 2015-02-02
  on class: Reinigen rioolput
  on property: has as output (inverse)
  max qualified cardinality: 1
subclass of: Restriction
  on property: has as value
  all values from: integer

Bruto oppervlakte
author at start life: Marinus Vonhof
date of start life: 2014-11-30
units of measurements: m2
comment: [is aspect]
scope note: Cof DMO
type: Class
subclass of: Kenmerk
subclass of: Restriction
  author at start life: Marinus Vonhof
  date of start life: 2014-11-30
  on class: Gemeentelijk gebied
  on property: has as aspect (inverse)
  qualified cardinality: 1
subclass of: Restriction
  on property: has as value
  all values from: decimal

Gemeentelijk gebied
author of change: Marinus Vonhof
date of change: 2015-05-27
author at start life: Marinus Vonhof
date of start life: 2014-11-30
validity context: 1d 3d 10d 12d 14d
comment: [VervallenLink http://definities.geostandaarden.nl/concepten/imgeo/doc/begrip/Gemeente]
see also: [IMGeo:1.0/2007] Een gedeelte van het grondgebied van Nederland, ingesteld op basis van Artikel 123 van de Grondwet.
alternative label: Gemeentegrens
scope note: Cof BAS
scope note: Cof DMO
type: Class
subclass of: Registratief gebied
subclass of: Restriction
  author of change: Marinus Vonhof
  date of change: 2015-05-27
  author at start life: Marinus Vonhof
  date of start life: 2014-11-30
  on class: Kern
  on property: has as part
  min qualified cardinality: 1
subclass of: Restriction
  author of change: Marinus Vonhof
  date of change: 2015-07-08
  author at start life: Marinus Vonhof
  date of start life: 2014-12-02
  on class: Rioleringsgebied
  on property: has as part
  min qualified cardinality: 0
subclass of: Restriction
  author of change: Marinus Vonhof
  date of change: 2015-10-26
  author at start life: Marinus Vonhof
  date of start life: 2014-11-30
  on class: Gemeente
  on property: is connected to
  qualified cardinality: 1
subclass of: Restriction
  author at start life: Marinus Vonhof
  date of start life: 2014-11-30
  on class: Bruto oppervlakte
  on property: has as aspect
  qualified cardinality: 1

Bruto overstortingsduur
author at start life: Marinus Vonhof
date of start life: 2014-11-29
units of measurements: h
see also: [IRIS-RIOKEN:2012] De totale duur van een overstortingsgebeurtenis inclusief de tussenliggende overstortingspauze(s).
comment: [is aspect]
scope note: Cof DMO
type: Class
subclass of: Kenmerk
subclass of: Restriction
  author of change: Marinus Vonhof
  date of change: 2015-05-29
  author at start life: Marinus Vonhof
  date of start life: 2014-11-29
  on class: Overstortput
  on property: has as aspect (inverse)
  max qualified cardinality: 1
subclass of: Restriction
  on property: has as value
  all values from: integer

Overstortput
label: Combined sewer overflow @en
author of change: Marinus Vonhof
author of change: Wouter van Riel
date of change: 2024-04-20
date of change: 2024-05-17
definition: Een rioolput voorzien van een overstortdrempel met een ontworpen drempellengte en -hoogte.
definition: [EN 16323:2014] device on a combined system that relieves the system of excess flow @en
definition: [NEN 3300:1996] rioolput voorzien van een overstortdrempel
definition: [Omgevingswet] Een kunstwerk waarmee rioolwater op het oppervlaktewater wordt geloosd, zodra het riool door te grote neerslaghoeveelheden niet al het rioolwater kan verwerken
author at start life: Finy Teitsma (Oranjewoud)
date of start life: 2006-02-20
validity context: 3f 10f 11f 14f
see also: [IRIS-RIOKEN:2012] Een inzamelknooppunt, uitgevoerd als voorziening met drempel, voor het onder bepaalde omstandigheden lozen van afvalwater uit het rioleringsnetwerk naar een ander rioleringsnetwerk of oppervlaktewater in de zin van de Wet verontreiniging oppervlaktewateren. Een riooloverstort is dus een voorziening door middel waarvan bij de neerslag van hemelwater het teveel aan hemelwater, al of niet vermengd met afvalwater dat niet in het stelsel wordt geborgen, kan worden geloosd op oppervlaktewater.
alternative label: Overstort
alternative label: Riooloverstort
scope note: Cof TOP
type: Class
subclass of: Rioolput
subclass of: Restriction
  author of change: Marinus Vonhof
  date of change: 2021-08-06
  author at start life: Finy Teitsma (Oranjewoud)
  date of start life: 2006-02-25
  comment: per definitie
  on class: Overstortdrempel
  on property: has as part
  min qualified cardinality: 1
subclass of: Restriction
  author of change: Marinus Vonhof
  date of change: 2015-05-29
  author at start life: Marinus Vonhof
  date of start life: 2014-11-29
  on class: Bruto overstortingsduur
  on property: has as aspect
  max qualified cardinality: 1
subclass of: Restriction
  on property: heeft Toepassing
  has value: Calamiteit
subclass of: Restriction
  on property: heeft Functie
  has value: Overtollig afvalwater laten wegstromen

Status functioneren (coll)
validity context: 6d
comment: [is coll]
scope note: Cof REV
scope note: Cof BAS
scope note: Cof DMO
type: Class
subclass of: Verzameling soorten
subclass of: Class
  one of: In ontwerp
  one of: In gebruik
  one of: In aanleg
  one of: Buiten gebruik

Buitendiameter
definition: De uitwendige maat
author at start life: Marinus Vonhof
date of start life: 2026-07-20
comment: Alleen voor administratieve doeleinden, voor uitwisselingsdoeleinden altijd het kenmerk "Diameter leiding" gebruiken.
comment: [is aspect]
scope note: Cof DMO
type: Class
subclass of: Diameter leiding

Vlak
author of change: Marinus Vonhof
date of change: 2019-05-15
definition: Tweedimensionaal geometrisch element. Voor geografische beschrijvingen conform coordinatenstelsel EPSG:7415 (x/y conform EPSG:28992, optioneel z conform EPSG:5709).
author at start life: Marinus Vonhof
date of start life: 2016-11-09
units of measurements: gml
comment: [is aspect]
scope note: Cof TOP
type: Class
subclass of: Geometrie
subclass of: Restriction
  on property: has as value
  all values from: gmlLiteral

Putoriëntatie
author of change: Marinus Vonhof
date of change: 2018-12-10
definition: Een topologisch element dat het zwaartepunt (vertex) van de bovenkant putbodem en/of de contouren van de constructie (edge) beschrijft.
author at start life: Marinus Vonhof
date of start life: 2017-12-12
scope note: Cof TOP
type: Class
subclass of: Knooppunt
subclass of: Restriction
  author of change: Marinus Vonhof
  date of change: 2017-12-12
  author at start life: Marinus Vonhof
  date of start life: 2015-11-07
  validity context: 5t 11t
  on class: Maaiveldoriëntatie
  on property: is connected to
  max qualified cardinality: 1
subclass of: Restriction
  author of change: Marinus Vonhof
  date of change: 2020-04-18
  author at start life: Marinus Vonhof
  date of start life: 2012-11-23
  comment: Temporeel kenmerk, met kenmerk Inwinning
  on class: Buitengrens
  on property: has as aspect
  min qualified cardinality: 0
subclass of: Restriction
  author at start life: Marinus Vonhof
  date of start life: 2012-04-22
  validity context: *t
  on class: Put
  on property: has as aspect (inverse)
  max qualified cardinality: 1

Gebiedsoriëntatie
author of change: Marinus Vonhof
date of change: 2020-11-24
definition: Een topologisch element dat (de contouren van) het gebied, systeem of stelsel beschrijft
author at start life: Marinus Vonhof
date of start life: 2016-11-09
scope note: Cof MDS
scope note: Cof HYD
scope note: Cof DMO
type: Class
subclass of: Representatie fysiek object
subclass of: Restriction
  author of change: Marinus Vonhof
  date of change: 2016-11-09
  author at start life: Marinus Vonhof
  date of start life: 2015-07-28
  on class: Gebied
  on property: has as aspect (inverse)
  max qualified cardinality: 1
subclass of: Restriction
  author of change: Marinus Vonhof
  date of change: 2020-04-18
  author at start life: Marinus Vonhof
  date of start life: 2016-11-09
  comment: Temporeel kenmerk, met kenmerk Inwinning
  on class: Buitengrens
  on property: has as aspect
  min qualified cardinality: 0
subclass of: Restriction
  author at start life: Marinus Vonhof
  date of start life: 2020-04-20
  on class: Stelsel
  on property: has as aspect (inverse)
  max qualified cardinality: 1
subclass of: Restriction
  author at start life: Marinus Vonhof
  date of start life: 2020-04-20
  on class: Systeem
  on property: has as aspect (inverse)
  max qualified cardinality: 1

Buurt
author at start life: Wouter van Riel
date of start life: 2021-11-19
see also: [CBS] Onderdeel van een gemeente, dat vanuit bebouwingsoogpunt of sociaaleconomische structuur homogeen is afgebakend.
scope note: Cof BAS
scope note: Cof DMO
type: Class
subclass of: Registratief gebied
subclass of: Restriction
  author of change: Marinus Vonhof
  date of change: 2021-12-29
  author at start life: Wouter van Riel
  date of start life: 2021-11-19
  on class: District
  on property: has as part (inverse)
  qualified cardinality: 1

District
label: District (EN) @en
definition: [EN13508-2+A1] De naam van de wijk zoals gespecificeerd door de bevoegde instantie
definition: [EN13508-2+A1] The name of the district as specified by the employing authority @en
notation: AAO
notation: CAO
notation: EAO
notation: GAO
notation: JAO
author at start life: Marinus Vonhof
date of start life: 2015-10-30
validity context: *d
see also: Vervallen link: https://imgeo.geostandaarden.nl/def/imgeo-object/wijk
see also: [IMGeo:1.0/2007] Een aaneengesloten gedeelte van het grondgebied van een gemeente, waarvan de grenzen zoveel mogelijk zijn gebaseerd op sociaal-geografische kenmerken.
alternative label: Wijk
scope note: Cof BAS
scope note: Cof DMO
type: Class
subclass of: Registratief gebied
subclass of: Restriction
  author of change: Marinus Vonhof
  date of change: 2016-04-24
  author at start life: Marinus Vonhof
  date of start life: 2014-12-01
  on class: Kern
  on property: has as part (inverse)
  qualified cardinality: 1
subclass of: Restriction
  author at start life: Wouter van Riel
  date of start life: 2021-11-19
  on class: Buurt
  on property: has as part
  min qualified cardinality: 0

Materiaal put
label: Material (manhole) @en
author of change: Marinus Vonhof
date of change: 2014-12-17
definition: [EN13508-2+A1] The material of the fabric of the manhole or inspection chamber in accordance with Table C.4. @en
notation: CCD
notation: ECD
notation: JCD
author at start life: Marinus Vonhof
date of start life: 2012-05-01
comment: Intrinsiek aspect
alternative label: Putmateriaal
comment: [is aspect]
scope note: Cof TOP
type: Class
subclass of: Materiaal
subclass of: Restriction
  author of change: Marinus Vonhof
  date of change: 2015-06-01
  author at start life: Finy Teitsma (Oranjewoud)
  date of start life: 2007-10-24
  validity context: *t
  on class: Put
  on property: has as aspect (inverse)
  max qualified cardinality: 1
subclass of: Restriction
  on property: has as reference (qualification)
  all values from: Materiaal put (coll)

Reinigen
label: Cleaning @en
author of change: Marinus Vonhof
date of change: 2018-05-01
definition: [EN 16323:2014] operation consisting of removing deposited solid matter or obstructions @en
author at start life: Marinus Vonhof
date of start life: 2016-04-24
validity context: 1f 3f 5d 10f 11d 12f 14f
scope note: Cof TOP
type: Class
subclass of: Onderhouden

Wijze van afleiden (coll)
author at start life: Johan Post
date of start life: 2022-03-27
comment: [is coll]
scope note: Cof DMO
type: Class
subclass of: Verzameling soorten
subclass of: Class
  one of: Ontwerpcapaciteit
  one of: Geïnstalleerde capaciteit
  one of: Normcapaciteit
  one of: Gemeten capaciteit

Capaciteit gemaal
author of change: Johan Post
date of change: 2022-11-25
definition: De in de praktijk maximaal leverbare hoeveelheid per tijdseenheid (de capaciteit kan variëren door wisselende drukhoogte en pompschakeling)
author at start life: Marinus Vonhof
date of start life: 2015-05-29
units of measurements: m3/h
alternative label: Gemaalcapaciteit
alternative label: Geïnstalleerde capaciteit gemaal
comment: [is aspect]
scope note: Cof BAS
scope note: Cof HYD
scope note: Cof RGM
scope note: Cof DMO
type: Class
subclass of: Capaciteit
subclass of: Restriction
  author of change: Marinus Vonhof
  date of change: 2018-12-12
  author at start life: Marinus Vonhof
  date of start life: 2018-12-06
  on class: Gemaal
  on property: has as aspect (inverse)
  qualified cardinality: 1
subclass of: Restriction
  on property: has as value
  all values from: decimal

Hybride drukriolering
author of change: Marinus Vonhof
author of change: Johan Post
date of change: 2024-04-30
date of change: 2024-05-18
date of change: 2026-05-18
definition: Een drukrioleringsstelsel waarbij kleine hoeveelheden lucht in het stelsel wordt geïnjecteerd. De luchtinjectie-unit vervangt op strategische plaatsen een bestaande pomp (6 tot 10 % van de pompunits), zorgt voor transport van afvalwater door de persleiding onder luchtdruk en voegt lucht toe aan het rioolwater
author at start life: Marinus Vonhof
date of start life: 2020-04-17
validity context: 1d
alternative label: Hybride systeem
scope note: Cof BAS
scope note: Cof RGM
scope note: Cof DMO
type: Class
subclass of: Mechanisch rioolstelsel
subclass of: Restriction
  author at start life: Marinus Vonhof
  date of start life: 2020-04-17
  on class: Pompunit
  on property: has as part
  qualified cardinality: 1
subclass of: Restriction
  on property: heeft Technologie
  has value: Transport onder overdruk

Centrifugaalpomp
author of change: Finy Teitsma (Oranjewoud)
date of change: 2007-10-25
definition: Een pomp waarbij de vloeistof wordt verpompt met een draaiend rad (rotor of waaier).
author at start life: Finy Teitsma (Oranjewoud)
date of start life: 2007-10-24
scope note: Cof BAS
scope note: Cof HYD
scope note: Cof RGM
scope note: Cof DMO
type: Class
subclass of: Pomp
subclass of: Restriction
  on property: heeft Technologie
  has value: Verplaatsing door middel van een draaiend rad

Chemisch zuurstof verbruik
author at start life: Marinus Vonhof
date of start life: 2014-11-29
see also: [IRIS-RIOKEN:2012] Hoeveelheid zuurstof die nodig is om een liter verontreinigd water chemisch af te breken. De eenheid is uitgedrukt in milligram zuurstof per liter water (mg/l).
alternative label: CZV
comment: [is aspect]
scope note: Cof DMO
type: Class
subclass of: Kenmerk

Pompunit
author of change: Marinus Vonhof
author of change: Johan Post
date of change: 2024-05-16
date of change: 2022-10-02
date of change: 2017-05-30
date of change: 2026-05-18
definition: Pompput in een drukrioleringsstelsel
author at start life: Marinus Vonhof
date of start life: 2012-04-24
validity context: 12d
see also: [Waterkring West] Onderdeel van een mechanisch rioolstelsel
alternative label: Drukrioleringsunit
alternative label: Minigemaal
scope note: Cof MDS
scope note: Cof REV
scope note: Cof RGM
scope note: Cof DMO
type: Class
subclass of: Rioolput
subclass of: Restriction
  author of change: Marinus Vonhof
  date of change: 2015-06-01
  author at start life: Marinus Vonhof
  date of start life: 2014-05-03
  on class: Drukrioleringspomp
  on property: has as part
  min qualified cardinality: 1
subclass of: Restriction
  author of change: Marinus Vonhof
  date of change: 2020-04-17
  author at start life: Marinus Vonhof
  date of start life: 2013-09-14
  on class: Drukriolering
  on property: has as part (inverse)
  qualified cardinality: 1
subclass of: Restriction
  author of change: Marinus Vonhof
  date of change: 2022-10-02
  author at start life: Marinus Vonhof
  date of start life: 2020-04-17
  on class: Hybride drukriolering
  on property: has as part (inverse)
  max qualified cardinality: 1
subclass of: Restriction
  on property: heeft Functie
  has value: Inzameling van afvalwater
subclass of: Restriction
  on property: heeft Functie
  has value: Verpompen van afvalwater

Contactpersoon
author of change: Marinus Vonhof
date of change: 2024-09-18
date of change: 2016-04-20
author at start life: Marinus Vonhof
date of start life: 2014-09-25
scope note: Cof REV
scope note: Cof DMO
type: Class
subclass of: Levensvorm
subclass of: Restriction
  author at start life: Marinus Vonhof
  date of start life: 2014-12-13
  on class: Meldpunt
  on property: has as part (inverse)
  qualified cardinality: 1

WIBON thema (coll)
author of change: Marinus Vonhof
date of change: 2022-10-01
comment: [is coll]
scope note: Cof MDS
scope note: Cof DMO
type: Class
subclass of: Verzameling soorten
subclass of: Class
  one of: Riool onder druk (thema)
  one of: Riool vrijverval (thema)
  one of: Wees (thema)
  one of: Hoogspanning (thema)
  one of: Laagspanning (thema)
  one of: Middenspanning (thema)
  one of: Datatransport (thema)

Datum inwinning
author of change: Johan Post
date of change: 2022-09-29
author at start life: Marinus Vonhof
date of start life: 2015-10-29
units of measurements: yyyy-mm-dd
alternative label: Inwinningsdatum
comment: [is aspect]
scope note: Cof TOP
type: Class
subclass of: Datum
subclass of: Restriction
  date of change: 2019-04-25
  author at start life: Marinus Vonhof
  date of start life: 2015-10-29
  on class: Inwinning
  on property: has as aspect (inverse)
  max qualified cardinality: 1
subclass of: Restriction
  on property: has as value
  all values from: date
subclass of: Restriction
  on class: Type capaciteit
  on property: has as aspect (inverse)
  max qualified cardinality: 1

Datum maatregel
author of change: Marinus Vonhof
date of change: 2019-03-14
definition: De datum waarop de status van de maatregel (ontwerp, uitgevoerd) is ingegaan. Als de status ontbreekt de datum waarop de uitvoering van de maatregel is afgerond
author at start life: Marinus Vonhof
date of start life: 2013-03-26
units of measurements: yyyy-mm-dd
validity context: 6d 15d
comment: [is aspect]
scope note: Cof TOP
type: Class
subclass of: Datum
subclass of: Restriction
  author of change: Marinus Vonhof
  date of change: 2018-05-01
  author at start life: Marinus Vonhof
  date of start life: 2013-03-26
  validity context: *t
  on class: Maatregel
  on property: has as aspect (inverse)
  max qualified cardinality: 1
subclass of: Restriction
  on property: has as value
  all values from: date

Persleiding
label: Pressure main @en
author of change: Marinus Vonhof
author of change: Wouter van Riel
date of change: 2018-12-13
date of change: 2024-04-23
definition: Een gesloten leiding waarin het afvalwater door middel van overdruk wordt getransporteerd.
definition: [EN 16323:2014] pipeline for conveying wastewater under pressure @en
definition: [NEN 3300:1996] leiding waardoor onder overdruk afvalwater wordt getransporteerd
definition: [NEN-EN 752:2008] leiding waardoor afvalwater wordt gepompt [EN 1085:2007, definitie 2170]
author at start life: Marinus Vonhof
author at start life: Finy Teitsma (Oranjewoud)
date of start life: 2007-10-23
validity context: 1d 12d
scope note: Cof TOP
type: Class
subclass of: Mechanische transportleiding
subclass of: Restriction
  author of change: Marinus Vonhof
  date of change: 2016-04-28
  author at start life: Marinus Vonhof
  date of start life: 2014-12-02
  on class: Leidingsegment
  on property: has as part
  min qualified cardinality: 0
subclass of: Restriction
  author of change: Marinus Vonhof
  date of change: 2017-03-06
  author at start life: Nic Roest (Idoro)
  date of start life: 2007-11-29
  on class: Rioolgemaal
  on property: is connected to
  max qualified cardinality: 1
subclass of: Restriction
  author at start life: Marinus Vonhof
  date of start life: 2014-12-02
  on class: Persleidingstelsel
  on property: has as part (inverse)
  qualified cardinality: 1
subclass of: Restriction
  on property: heeft Technologie
  has value: Transport onder overdruk

Resultaat
author of change: Marinus Vonhof
date of change: 2024-05-16
date of change: 2020-10-09
definition: Bij activiteit: de output, het rapport
author at start life: Marinus Vonhof
date of start life: 2014-04-29
validity context: 1d 3d 5d 6d 10d 11d 12d 14d
scope note: Cof TOP
type: Class
subclass of: Informatiedrager

Diameter
author of change: Marinus Vonhof
date of change: 2018-12-05
definition: De lengte van de koorde die het middelpunt van de cirkel snijdt
definition: Zowel een lijn (de koorde die het middelpunt van de cirkel snijdt) als de lengte van die lijn
author at start life: Nic Roest (Idoro)
date of start life: 2006-02-21
validity context: 15d
alternative label: Middellijn
comment: [is aspect]
scope note: Cof TOP
type: Class
subclass of: Afstand

Risicogebied
author of change: Marinus Vonhof
date of change: 2015-02-28
author at start life: Marinus Vonhof
date of start life: 2014-12-02
see also: [WSH 20141028] Locaties met verhoogd risico bij calamiteiten leiding. Watergang, waterkering, gasleiding, spoorlijn
scope note: Cof BAS
scope note: Cof DMO
type: Class
subclass of: Gebied
subclass of: Restriction
  author of change: Marinus Vonhof
  date of change: 2015-04-20
  author at start life: Marinus Vonhof
  date of start life: 2014-12-03
  on class: Leiding
  on property: has as part
  min qualified cardinality: 0
subclass of: Restriction
  author of change: Marinus Vonhof
  date of change: 2015-04-20
  author at start life: Marinus Vonhof
  date of start life: 2014-12-03
  on class: Put
  on property: has as part
  min qualified cardinality: 0

Dikte
author of change: Marinus Vonhof
date of change: 2015-05-29
definition: In de richting haaks op het vlak van een plat voorwerp, waarbij de meetpunten op de buitenkant liggen
author at start life: Nic Roest (Idoro)
date of start life: 2006-02-21
validity context: 15d
comment: [is aspect]
scope note: Cof TOP
type: Class
subclass of: Afstand

Kern
label: Town or village @en
author of change: Marinus Vonhof
date of change: 2021-03-10
definition: [EN13508-2+A1] De naam van de stad, het dorp, zoals gespecificeerd door de bevoegde instantie
definition: [EN13508-2+A1] The name of the town, village as specified by the employing authority @en
notation: AAN
notation: CAN
notation: EAN
notation: GAN
notation: JAN
author at start life: Marinus Vonhof
date of start life: 2014-11-30
validity context: 5d 11d
see also: [IRIS-RIOKEN:2012] Gebied liggend binnen een gemeente, meerdere definities mogelijk, afhankelijk van welke bron gehanteerd wordt. Een kern wordt over het algemeen gevormd door een woonplaats met het bijbehorende buitengebied.
alternative label: Bebouwingskern
alternative label: Stad of dorp
scope note: Cof BAS
scope note: Cof DMO
type: Class
subclass of: Registratief gebied
subclass of: Restriction
  author of change: Marinus Vonhof
  date of change: 2015-05-27
  author at start life: Marinus Vonhof
  date of start life: 2014-11-30
  on class: Gemeentelijk gebied
  on property: has as part (inverse)
  qualified cardinality: 1
subclass of: Restriction
  author of change: Marinus Vonhof
  date of change: 2016-04-24
  author at start life: Marinus Vonhof
  date of start life: 2014-12-01
  on class: District
  on property: has as part
  max qualified cardinality: 1

Onderscheidend kenmerk
author of change: Marinus Vonhof
date of change: 2021-01-09
definition: Een dicriminerend (onderscheidend) kenmerk
author at start life: Marinus Vonhof
date of start life: 2015-02-25
comment: [is aspect]
scope note: Cof TOP
type: Class
subclass of: Kenmerk

Doorlatende leiding (coll)
definition: Een leiding die niet vloeistofdicht is, bestemd om het hemel-/grondwater vanuit de bodem op te nemen of in de bodem af te voeren
validity context: *d
comment: [is coll]
scope note: Cof MDS
scope note: Cof DMO
type: Class
subclass of: Verzameling soorten
subclass of: Class
  one of:
    rest:
      rest:
        rest: nil

Mechanisch rioolstelsel
author of change: Marinus Vonhof
author of change: Johan Post
date of change: 2026-05-01
date of change: 2014-04-29
date of change: 2026-05-18
definition: Een rioolstelsel waarbij het transport door middel van over- of onderdruk plaatsvindt.
author at start life: Finy Teitsma (Oranjewoud)
date of start life: 2006-11-29
validity context: *f
scope note: Cof MDS
scope note: Cof RGM
scope note: Cof DMO
type: Class
subclass of: Rioolstelsel
subclass of: Restriction
  author of change: Marinus Vonhof
  author at start life: Marinus Vonhof
  on class: Overnamepunt
  on property: has as part
  max qualified cardinality: 1
subclass of: Restriction
  on property: heeft Functie
  has value: Inzameling van vuilwater
subclass of: Restriction
  on property: heeft Technologie
  has value: Transport onder overdruk of onderdruk
subclass of: Restriction
  on property: heeft Functie
  has value: Transport van vuilwater

Verzameldrain
definition: Een leiding met ondoorlatende wand die het door drains aangevoerde water verzamelt en transporteert, zonder zelf water uit de omliggende bodem op te nemen.
author at start life: Johan Post
date of start life: 2026-05-19
type: Class
subclass of: Vrijverval rioolleiding
subclass of: Restriction
  on property: heeft Functie
  has value: Transport van grondwater

Droogweerafvoer
label: Dry weather flow @en
author of change: Wouter van Riel
date of change: 2022-09-26
definition: [EN 16323:2014] flow not affected by rainfall or snow melt @en
definition: [NEN 3300:1996] De hoeveelheid afvalwater die per tijdseenheid in een droogweersituatie via het rioolstelsel wordt afgevoerd
definition: [NEN-EN 752:2008] afvoer die niet wordt beïnvloed door regenval of smeltwater [EN 1085:2007, definitie 3050]
notation: DWA
author at start life: Marinus Vonhof
date of start life: 2014-11-29
comment: 20151014: NEN3300-definitie aangepast
see also: [IRIS-RIOKEN:2012] Het water dat bij droog weer via het rioolstelsel binnen 1 rioleringsgebied moet worden afgevoerd. Dit bestaat uit huishoudelijk- en industrieel afvalwater en lekwater.
alternative label: DWA
alternative label: Vuilwater
scope note: Cof BAS
scope note: Cof DMO
type: Class
subclass of: Afvalwater

Drukklasse
author of change: Marinus Vonhof
date of change: 2025-01-16
date of change: 2024-07-16
date of change: 2020-04-17
definition: De maximale druk die de buis van een bepaalde klasse kan weerstaan bij een bepaalde temperatuur. De waarde is de druk nominaal (PN) uitgedrukt in bar (1 bar = 1,02 kg/cm2). Bijvoorbeeld als de waarde 11 is ingevuld, dan is de drukklasse PN11Bar.
definition: [IMBOR] Klasse voor de maximaal toelaatbare inwendige druk, uitgedrukt in PN bij temperaturen tot 20 gr C.
notation: PN
author at start life: Nic Roest (Idoro)
date of start life: 2006-05-23
validity context: 15d
alternative label: Pression nominale
comment: [is aspect]
scope note: Cof BAS
scope note: Cof PLI
scope note: Cof DMO
type: Class
subclass of: Kenmerk
subclass of: Restriction
  author at start life: Marinus Vonhof
  date of start life: 2024-05-16
  on class: Rioolleiding
  on property: has as aspect (inverse)
  max qualified cardinality: 1
subclass of: Restriction
  author at start life: Marinus Vonhof
  date of start life: 2024-05-16
  on class: Transportleiding
  on property: has as aspect (inverse)
  max qualified cardinality: 1
subclass of: Restriction
  on property: has as value
  all values from: decimal

Mechanische rioolleiding
author of change: Marinus Vonhof
author of change: Johan Post
author of change: Wouter van Riel
date of change: 2016-08-26
date of change: 2024-04-23
date of change: 2024-05-04
date of change: 2026-05-19
definition: Een gesloten rioolleiding waarin het afvalwater door middel van onder-/overdruk wordt getransporteerd.
author at start life: Marinus Vonhof
author at start life: Finy Teitsma (Oranjewoud)
date of start life: 2006-02-20
validity context: *f 11d 12d 13d
see also: [IMKL:1.1/2008] Riolering waarbij het transport plaatsvindt door overdruk (uit NEN 3300, Buitenriolering).
scope note: Cof TOP
type: Class
subclass of: Rioolleiding
subclass of: Restriction
  on property: heeft Structuur
  has value: Gesloten
subclass of: Restriction
  on property: heeft Technologie
  has value: Transport onder overdruk of onderdruk

Drukrioleringspomp
author of change: Marinus Vonhof
date of change: 2025-01-16
date of change: 2015-07-28
definition: Een pomp die toegepast wordt in een pompunit
author at start life: Marinus Vonhof
date of start life: 2014-05-03
scope note: Cof BAS
scope note: Cof HYD
scope note: Cof RGM
scope note: Cof DMO
type: Class
subclass of: Pomp
subclass of: Restriction
  author of change: Marinus Vonhof
  date of change: 2015-06-01
  author at start life: Marinus Vonhof
  date of start life: 2014-05-03
  on class: Pompunit
  on property: has as part (inverse)
  qualified cardinality: 1
subclass of: Restriction
  on property: heeft Toepassing
  has value: Deel van pompunit

Dubbelkerende spindelschuif
author of change: Marinus Vonhof
date of change: 2025-01-16
definition: [IMBOR] Een mechanische afsluiter die bestaat uit een naar beneden schuifbare plaat op basis van een afstelbare metalen staaf met draad (spindel) die de doorstroomopening in beide richtingen af kan sluiten.
author at start life: Marinus Vonhof
date of start life: 2019-05-15
scope note: Cof BAS
scope note: Cof PLI
scope note: Cof HYD
scope note: Cof DMO
type: Class
subclass of: Schuif
subclass of: Restriction
  on property: heeft Functie
  has value: Afsluiten in twee stroomrichtingen

Schuif
author of change: Marinus Vonhof
date of change: 2025-01-16
definition: [IMBOR] Een ijzeren staaf waarmee een bewegend onderdeel van een object afgesloten kan worden.
author at start life: Wouter van Riel
date of start life: 2024-04-20
scope note: Cof BAS
scope note: Cof PLI
scope note: Cof HYD
scope note: Cof DMO
type: Class
subclass of: Mechanische afsluiter
subclass of: Restriction
  on property: heeft Uitvoering
  has value: Schuifbare plaat

Verbeterde overstortput
definition: [NEN 3300:1996] een overstortput waarbij duikschotten en een langere drempel zijn toegepast en de inhoud van de put voor de drempel is vergroot met het doel de vuiluitworp te beperken
author at start life: Marinus Vonhof
date of start life: 2012-04-29
scope note: Cof MDS
scope note: Cof HYD
scope note: Cof DMO
type: Class
subclass of: Externe overstortput
subclass of: Restriction
  on property: heeft Uitvoering
  has value: Langere drempel
subclass of: Restriction
  on property: heeft Uitvoering
  has value: Vergrote inhoud voor de drempel
subclass of: Restriction
  on property: heeft Doel
  has value: Verminderen vuilbelasting van oppervlaktewater

Edge
author of change: Marinus Vonhof
date of change: 2020-11-24
definition: Wiskundige term (engels) voor zijde, kant, boog, tak
author at start life: Marinus Vonhof
date of start life: 2011-12-15
alternative label: Zijde
scope note: Cof TOP
type: Class
subclass of: Topologisch element

Topologisch element
author of change: Marinus Vonhof
date of change: 2025-01-16
date of change: 2016-11-09
definition: [Gellish] Is a configuration that indicates how items are connected or positioned relative to each other. The topology in terms of connections usually doesn't change when the positions of the items change. @en
definition: [IMBOR] Een configuratie waarin vastgelegd wordt hoe objecten verbonden zijn of hoe ze relatief tot elkaar gepositioneerd zijn.
author at start life: Marinus Vonhof
date of start life: 2013-10-04
validity context: *f 15d
scope note: Cof TOP
type: Class

Einddatum
author of change: Marinus Vonhof
author of change: Johan Post
date of change: 2015-05-29
date of change: 2023-01-10
date of change: 2026-05-13
definition: Datum waarop een object functioneel geen onderdeel meer vormt van het systeem, doordat het niet langer een rol vervult in het functioneren, beheren of gebruiken van dat systeem. Dit is niet per definitie de datum van fysieke verwijdering of sloop
author at start life: Marinus Vonhof
date of start life: 2011-12-15
units of measurements: yyyy-mm-dd
validity context: 6d 15d 16d
comment: [is aspect]
scope note: Cof TOP
type: Class
subclass of: Datum
subclass of: Restriction
  author at start life: Marinus Vonhof
  date of start life: 2013-09-28
  on class: Fysiek object
  on property: has as aspect (inverse)
  max qualified cardinality: 1
subclass of: Restriction
  on property: has as value
  all values from: date

Eindknooppunt
definition: [EN13508-2+A1] The node reference of the second node as specified by the employing authority. @en
definition: Het knooppunt dat koppelt aan het (topologische) eindpunt van een leiding.
author at start life: Marinus Vonhof
date of start life: 2026-07-17
alternative label: Eindknoop
scope note: Cof TOP
type: Class
subclass of: Extra objecttype (rol)

Enkelkerende spindelschuif
author of change: Marinus Vonhof
date of change: 2025-01-16
definition: [IMBOR] Een doorlaat met een voorziening om de stroming te regelen.
author at start life: Marinus Vonhof
date of start life: 2019-05-15
scope note: Cof BAS
scope note: Cof PLI
scope note: Cof HYD
scope note: Cof DMO
type: Class
subclass of: Schuif
subclass of: Restriction
  on property: heeft Functie
  has value: Afsluiten in één stroomrichting

Pompschakeling (coll)
comment: [is coll]
scope note: Cof BAS
scope note: Cof RGM
scope note: Cof DMO
type: Class
subclass of: Verzameling soorten
subclass of: Class
  one of: Samenloop

Externe overstortput
author of change: Finy Teitsma (Oranjewoud)
date of change: 2007-11-12
definition: Een overstortput waarbij overtollig afvalwater uit een rioolstelsel kan stromen.
definition: [NEN 3300:1996] rioolput voorzien van een overstortdrempel die loost buiten het in beschouwing genomen rioolstelsel, meestal op oppervlaktewater
definition: [NEN-EN 752:2008] voorziening in een gemengd systeem waarmee overtollig afvalwater wordt afgevoerd [EN 1085:2007, definitie 2130]
author at start life: Finy Teitsma (Oranjewoud)
date of start life: 2006-05-23
alternative label: Externe overstort
scope note: Cof MDS
scope note: Cof REV
scope note: Cof HYD
scope note: Cof DMO
type: Class
subclass of: Overstortput
subclass of: Restriction
  on property: heeft Functie
  has value: Lozen buiten het stelsel

Rioleringsbeheerder
definition: [NEN 3300:1996] rechtspersoon belast met de zorg voor de riolering
author at start life: Marinus Vonhof
date of start life: 2016-08-26
validity context: 1d 10d
scope note: Cof BAS
scope note: Cof DMO
type: Class
subclass of: Beheerder
subclass of: Restriction
  author at start life: Wouter van Riel
  date of start life: 2022-12-19
  on class: Fysiek object
  on property: has as input
  min qualified cardinality: 0
subclass of: Restriction
  on property: heeft Functie
  has value: Rioleringsbeheer

Gegevensbeheerder
definition: Persoon die zorgdraagt voor het beheren van gegevens
author at start life: Wouter van Riel
date of start life: 2022-12-19
validity context: 1d 5d 6d 10d 11d 12d
scope note: Cof BAS
scope note: Cof DMO
type: Class
subclass of: Beheerder
subclass of: Restriction
  author at start life: Marinus Vonhof
  date of start life: 2023-01-16
  on class: Informatiedrager
  on property: has as input
  min qualified cardinality: 0
subclass of: Restriction
  author at start life: Marinus Vonhof
  date of start life: 2023-01-16
  on class: Informatiedrager
  on property: has as output
  min qualified cardinality: 0
subclass of: Restriction
  author at start life: Wouter van Riel
  date of start life: 2022-12-19
  on class: Fysiek object
  on property: has as input
  min qualified cardinality: 0

Gegevenswoordenboek Stedelijk Water
author of change: Marinus Vonhof
date of change: 2024-05-16
date of change: 2024-07-31
date of change: 2021-12-29
date of change: 2021-09-20
date of change: 2021-10-02
date of change: 2025-11-18
date of change: 2026-08-25
definition: Een datamodel (ontologie, kennismodel) voor het vakgebied Stedelijk Water, het bevat modellen voor systemen en processen binnen het vakgebied. Belangrijke onderdelen ervan zijn modellen van constructies (systemen, stelsels, bouwwerken, leidingen, putten) en modellen van activiteiten (plannen, projecten, maatregelen). Het datamodel is onderdeel van het Semantisch Web, de datastructuur is gebaseerd op de linked-data-taal RDF/RDFS/OWL.
author at start life: Marinus Vonhof
date of start life: 2011-11-11
validity context: 6d
comment: URI gewijzigd (was GWSW_Datamodel) (20251118)
comment: Vigerend: GWSW versie 1.7.0 (25-08-2026)
alternative label: GWSW
scope note: Cof TOP
type: Class
subclass of: Informatiedrager
subclass of: Restriction
  author at start life: Marinus Vonhof
  date of start life: 2026-07-24
  on class: GWSW.orox
  on property: has as part
  qualified cardinality: 1

GWSW.orox
definition: Het uitwisselprotocol voor toepassingen van het GWSW. Het protocol beschrijft met de linked-data-taal RDF/RDFS/OWL de inhoud van het GWSW Datamodel en de GWSW Datasets (de gemeentelijke gegevens). In alle gevallen wordt het zogenaamde Turtle-formaat voor de uitwisselbestanden gebruikt, maar in principe is elk RDF-formaat bruikbaar. De door gemeenten gebruikte beheersystemen kunnen in de meeste gevallen gegevens exporteren conform GWSW OroX.
author at start life: Marinus Vonhof
date of start life: 2026-07-24
alternative label: GWSW OroX
scope note: Cof TOP
type: Class
subclass of: Informatiedrager
subclass of: Restriction
  author at start life: Marinus Vonhof
  date of start life: 2026-07-24
  on class: Gegevenswoordenboek Stedelijk Water
  on property: has as part (inverse)
  qualified cardinality: 1

Lozingsvergunninghouder
author of change: Marinus Vonhof
author of change: Johan Post
date of change: 2025-01-16
date of change: 2026-05-01
date of change: 2013-09-03
definition: [IMBOR] De partij die het lozen van water op een perceelaansluitpunt vergund is.
author at start life: Marinus Vonhof
date of start life: 2013-02-05
comment: [is aspect]
scope note: Cof BAS
scope note: Cof DMO
type: Class
subclass of: Kenmerk
subclass of: Restriction
  author at start life: Marinus Vonhof
  date of start life: 2013-02-05
  on class: Perceelaansluitpunt
  on property: has as aspect (inverse)
  max qualified cardinality: 1
subclass of: Restriction
  on class: Gebouwaansluitpunt
  on property: has as aspect (inverse)
  max qualified cardinality: 1
subclass of: Restriction
  on class: Overnamepunt
  on property: has as aspect (inverse)
  max qualified cardinality: 1

Lozingsvergunningnummer
author of change: Marinus Vonhof
author of change: Johan Post
date of change: 2025-01-16
date of change: 2026-05-01
date of change: 2020-04-18
definition: [IMBOR] Het nummer dat de vergunning aanduidt die een partij is verleend voor het lozen van water op een bepaald perceelaansluitpunt.
author at start life: Marinus Vonhof
date of start life: 2013-02-05
comment: [is aspect]
scope note: Cof BAS
scope note: Cof DMO
type: Class
subclass of: Unieke identificatie
subclass of: Restriction
  author at start life: Marinus Vonhof
  date of start life: 2013-02-05
  on class: Perceelaansluitpunt
  on property: has as aspect (inverse)
  max qualified cardinality: 1
subclass of: Restriction
  on class: Gebouwaansluitpunt
  on property: has as aspect (inverse)
  max qualified cardinality: 1
subclass of: Restriction
  on class: Overnamepunt
  on property: has as aspect (inverse)
  max qualified cardinality: 1

Lozingseisen
author of change: Johan Post
date of change: 2025-05-01
author at start life: Marinus Vonhof
date of start life: 2020-04-18
see also: [Saniwijzer] Eisen die worden gesteld aan te lozen effluent
alternative label: Lozingsnormen
comment: [is aspect]
scope note: Cof BAS
scope note: Cof DMO
type: Class
subclass of: Kenmerk
subclass of: Restriction
  author at start life: Marinus Vonhof
  date of start life: 2020-04-18
  on class: Perceelaansluitpunt
  on property: has as aspect (inverse)
  max qualified cardinality: 1
subclass of: Restriction
  on class: Gebouwaansluitpunt
  on property: has as aspect (inverse)
  max qualified cardinality: 1
subclass of: Restriction
  on class: Overnamepunt
  on property: has as aspect (inverse)
  max qualified cardinality: 1

Gegevensgroep DAMO TRI
author of change: Marinus Vonhof
date of change: 2014-10-04
author at start life: Marinus Vonhof
date of start life: 2014-09-25
comment: [is aspect]
scope note: Cof DMO
type: Class
subclass of: Kenmerk

Pompschakeling
author of change: Marinus Vonhof
date of change: 2015-02-28
definition: Wijze waarop de pompen worden in- en uitgeschakeld
author at start life: Nic Roest (Idoro)
date of start life: 2006-02-21
validity context: 15d
see also: [HYD] Aanduiding of pompen in samenloop of enkelloop functioneren
alternative label: Pompregime
comment: [is aspect]
scope note: Cof BAS
scope note: Cof HYD
scope note: Cof RGM
scope note: Cof DMO
type: Class
subclass of: Kenmerk
subclass of: Restriction
  author of change: Marinus Vonhof
  date of change: 2019-07-11
  author at start life: Finy Teitsma (Oranjewoud)
  date of start life: 2006-02-25
  on class: Gemaal
  on property: has as aspect (inverse)
  max qualified cardinality: 1
subclass of: Restriction
  author at start life: Marinus Vonhof
  date of start life: 2019-07-11
  on class: Pompput
  on property: has as aspect (inverse)
  max qualified cardinality: 1
subclass of: Restriction
  on property: has as reference (qualification)
  all values from: Pompschakeling (coll)

Ontwerpcapaciteit gemaal
author of change: Johan Post
date of change: 2022-11-25
definition: De capaciteit op basis van het ontwerp
author at start life: Marinus Vonhof
date of start life: 2020-04-18
units of measurements: m3/h
comment: [is aspect]
scope note: Cof BAS
scope note: Cof HYD
scope note: Cof RGM
scope note: Cof DMO
type: Class
subclass of: Capaciteit
subclass of: Restriction
  author at start life: Marinus Vonhof
  date of start life: 2020-04-18
  on class: Gemaal
  on property: has as aspect (inverse)
  max qualified cardinality: 1
subclass of: Restriction
  on property: has as value
  all values from: decimal

Gemaal droge opstelling
author of change: Marinus Vonhof
date of change: 2017-05-31
definition: Een gemaal waarbij de pompen zich buiten de ontvangput/kelder bevinden.
definition: [NEN 3300:1996] Gemaal ten minste bestaande uit een ontvangkelder en een pompenkelder. De pompen zijn buiten de ontvangkelder opgesteld
author at start life: Finy Teitsma (Oranjewoud)
date of start life: 2006-05-23
comment: 20151014: NEN3300-definitie aangepast
alternative label: Gemaal met droge pompopstelling
scope note: Cof MDS
scope note: Cof HYD
scope note: Cof RGM
scope note: Cof DMO
type: Class
subclass of: Rioolgemaal
subclass of: Restriction
  on property: heeft Uitvoering
  has value: Opstelling pomp(en) buiten de ontvangput/kelder

Gemaal natte opstelling
author of change: Marinus Vonhof
date of change: 2019-05-15
definition: Een gemaal waarbij de pompen zich in de ontvangput/kelder bevinden.
definition: [NEN 3300:1996] gemaal waarbij de pomp in de ontvangkelder van het gemaal is opgesteld
author at start life: Finy Teitsma (Oranjewoud)
date of start life: 2006-05-23
alternative label: Gemaal met natte pompopstelling
scope note: Cof MDS
scope note: Cof HYD
scope note: Cof RGM
scope note: Cof DMO
type: Class
subclass of: Rioolgemaal
subclass of: Restriction
  on property: heeft Uitvoering
  has value: Opstelling pomp(en) in de ontvangput/kelder

Gemeentelijk rioleringsplan
author of change: Marinus Vonhof
date of change: 2018-12-10
definition: [NEN 3300:1996] Document op grond van de Wet milieubeheer waarin het vastgestelde rioleringsbeleid van de gemeente is beschreven
definition: [Omgevingswet] Een document van een gemeente over het beheer van de riolering en het beheer van grondwater en hemelwater
author at start life: Marinus Vonhof
date of start life: 2014-11-29
see also: [IRIS-RIOKEN:2012] Financieel beleidstuk, waarin de onder andere in het BRP en het gemeentelijk waterplan geformuleerde doelen en maatregelen door de gemeente op investerings- en exploitatiegeld en een jaarlijkse fasering worden gezet.
alternative label: GRP
scope note: Cof BAS
scope note: Cof PLI
scope note: Cof DMO
type: Class
subclass of: Rioleringsplan
subclass of: Restriction
  author of change: Marinus Vonhof
  date of change: 2018-12-13
  author at start life: Marinus Vonhof
  date of start life: 2014-11-29
  on class: Planvorming rioleringsbeheer
  on property: has as output (inverse)
  qualified cardinality: 1

Gemeentelijke taak
author of change: Marinus Vonhof
date of change: 2018-12-10
author at start life: Marinus Vonhof
date of start life: 2014-12-02
validity context: 6d
scope note: Cof BAS
scope note: Cof DMO
type: Class
subclass of: Activiteit
subclass of: Restriction
  author of change: Marinus Vonhof
  date of change: 2014-12-12
  author at start life: Marinus Vonhof
  date of start life: 2014-12-02
  on class: Optimaliseren afvalwaterketen
  on property: has as part
  qualified cardinality: 1

Vuilwaterstelsel
author of change: Johan Post
author of change: Eric van Gorkom
date of change: 2021-10-01
date of change: 2024-05-13
definition: Een vrijverval rioolstelsel bestemd voor de inzameling, het transport en de tijdelijke berging van vuilwater.
definition: [NEN 3300:1996] Dwa-rioolstelsel is synoniem van vuilwaterstelsel
definition: [NEN 3300:1996] rioolstelsel voor de inzameling en het transport van huishoudelijk- en bedrijfsafvalwater, niet zijnde neerslag
author at start life: Finy Teitsma (Oranjewoud)
date of start life: 2007-10-23
alternative label: DWA stelsel
alternative label: Dwa-rioolstelsel
alternative label: Vuilwaterrioolstelsel
scope note: Cof TOP
type: Class
subclass of: Vrijverval rioolstelsel
subclass of: Restriction
  author of change: Marinus Vonhof
  date of change: 2016-04-22
  author at start life: Nic Roest (Idoro)
  date of start life: 2007-11-29
  on class: Gescheiden systeem
  on property: has as part (inverse)
  qualified cardinality: 1
subclass of: Restriction
  author at start life: Marinus Vonhof
  date of start life: 2020-05-26
  on class: Rioolgemaal
  on property: has as part
  min qualified cardinality: 0
subclass of: Restriction
  on class: Vrijverval rioolleiding
  on property: has as part
  min qualified cardinality: 0
subclass of: Restriction
  on property: heeft Functie
  has value: Inzameling van vuilwater
subclass of: Restriction
  on property: heeft Functie
  has value: Tijdelijke berging van vuilwater
subclass of: Restriction
  on property: heeft Functie
  has value: Transport van vuilwater

Geometrie
author of change: Marinus Vonhof
date of change: 2025-01-16
date of change: 2017-11-16
definition: [Gellish] Is a scale that is a measurement of spatial aspects. (This may otherwise be called geometry)
definition: [IMBOR] Een kenmerk waarmee de locatie van een object wordt vastgelegd.
author at start life: Marinus Vonhof
date of start life: 2016-10-14
units of measurements: gml
validity context: 15d
comment: [is aspect]
scope note: Cof TOP
type: Class
subclass of: Kenmerk
subclass of: Restriction
  author at start life: Marinus Vonhof
  date of start life: 2016-11-09
  on class: Inwinning
  on property: has as aspect
  max qualified cardinality: 1
subclass of: Restriction
  on property: has as value
  all values from: gmlLiteral

Grondwatersamenstellingsonderzoek
author at start life: Marinus Vonhof
date of start life: 2020-04-17
validity context: 6d
scope note: Cof BAS
scope note: Cof DMO
type: Class
subclass of: Onderzoeken

Vacuümpompstation
author of change: Marinus Vonhof
author of change: Johan Post
date of change: 2021-10-01
date of change: 2026-05-21
date of change: 2026-07-20
definition: Een technische installatie waarmee onderdruk wordt gecreëerd om het afvalwater te transporteren
definition: [NEN 3300:1996] Onderdrukpompstation is synoniem van vacuümpompstation
definition: [NEN 3300:1996] pompstation voor het in stand houden van de onderdruk in vacuümafvoerleidingen en voor het vervolgens onder overdruk verder transporten van het afvalwater
author at start life: Marinus Vonhof
date of start life: 2012-04-29
validity context: 1d
alternative label: Onderdrukpompstation
alternative label: Vacuümgemaal
scope note: Cof MDS
scope note: Cof HYD
scope note: Cof RGM
scope note: Cof DMO
type: Class
subclass of: Rioolgemaal
subclass of: Restriction
  author at start life: Marinus Vonhof
  date of start life: 2013-09-14
  on class: Vacuümriolering
  on property: has as part (inverse)
  qualified cardinality: 1
subclass of: Restriction
  on property: heeft Functie
  has value: In stand houden onderdruk

Hoogte
author of change: Marinus Vonhof
date of change: 2015-05-29
definition: In de richting haaks op het horizontale vlak
author at start life: Nic Roest (Idoro)
date of start life: 2006-02-21
units of measurements: mm
validity context: 15d
comment: [is aspect]
scope note: Cof TOP
type: Class
subclass of: Afstand
subclass of: Restriction
  on property: has as value
  all values from: integer

Hoogte put
author of change: Marinus Vonhof
author of change: Eric van Gorkom
date of change: 2021-08-06
date of change: 2024-05-13
definition: De inwendige hoogte (verticaal, vanuit het zijaanzicht). De afstand van binnenonderkant tot binnenbovenkant putconstructie (inclusief onderbak) - zie afbeelding C+F (bron EN13508-2)
author at start life: Marinus Vonhof
date of start life: 2014-08-01
units of measurements: mm
comment: Intrinsiek aspect
comment: [is aspect]
scope note: Cof TOP
type: Class
subclass of: Hoogte
subclass of: Restriction
  author of change: Marinus Vonhof
  date of change: 2014-08-01
  author at start life: Finy Teitsma (Oranjewoud)
  date of start life: 2006-02-25
  validity context: 5t 11t
  on class: Put
  on property: has as aspect (inverse)
  max qualified cardinality: 1
subclass of: Restriction
  on property: has as value
  all values from: Hoogte put (datatype)

Huishoudelijk afvalwater
author of change: Marinus Vonhof
date of change: 2020-04-18
definition: [NEN 3300:1996] Afvalwater uit particuliere huishoudens
definition: [NEN-EN 752:2008] afvalwater uit particuliere huishoudens afkomstig van keukens, toiletten, badkamers, wasmachines en dergelijke [EN 1085:2007, definitie 2030]
definition: [Waterwet] Afvalwater dat overwegend afkomstig is van menselijke stofwisseling en huishoudelijke werkzaamheden
author at start life: Marinus Vonhof
date of start life: 2016-04-07
see also: [Saniwijzer] Het normale huishoudelijke afvalwater, bestaand uit al het water van toilet, keuken, badkamer en wasmachine
scope note: Cof BAS
scope note: Cof DMO
type: Class
subclass of: Afvalwater

Huisnummer
author of change: Marinus Vonhof
date of change: 2025-01-16
definition: [IMBOR] Nummer dat is toegekend aan het object zelf of toebehoort aan een nabijgelegen gebouw om het adres van een object met de overige adresgegevens vast te kunnen leggen.
author at start life: Marinus Vonhof
date of start life: 2014-12-23
comment: [is aspect]
scope note: Cof BAS
scope note: Cof DMO
type: Class
subclass of: Perceelnummer

Perceelnummer
author of change: Marinus Vonhof
date of change: 2015-02-28
author at start life: Marinus Vonhof
date of start life: 2013-02-05
comment: [is aspect]
scope note: Cof BAS
scope note: Cof DMO
type: Class
subclass of: Unieke identificatie

Lengte put
author of change: Marinus Vonhof
author of change: Johan Post
date of change: 2021-08-06
date of change: 2026-05-01
definition: De inwendige lengte (horizontaal, uit het bovenaanzicht). Indien aanwezig de lengte van de onderbak - zie afbeelding dc (bron EN13508-2)
author at start life: Marinus Vonhof
date of start life: 2016-08-05
units of measurements: mm
validity context: 15d
comment: Intrinsiek aspect
comment: [is aspect]
scope note: Cof TOP
type: Class
subclass of: Lengte
subclass of: Restriction
  author of change: Marinus Vonhof
  date of change: 2014-08-01
  author at start life: Finy Teitsma (Oranjewoud)
  date of start life: 2006-02-25
  validity context: *t
  on class: Put
  on property: has as aspect (inverse)
  max qualified cardinality: 1
subclass of: Restriction
  on property: has as value
  all values from: Lengte put (datatype)

Lengte leiding
author of change: Marinus Vonhof
date of change: 2015-05-29
author at start life: Nic Roest (Idoro)
date of start life: 2006-02-21
units of measurements: m
comment: Intrinsiek aspect
comment: [is aspect]
scope note: Cof TOP
type: Class
subclass of: Lengte
subclass of: Restriction
  author of change: Marinus Vonhof
  date of change: 2015-08-24
  author at start life: Finy Teitsma (Oranjewoud)
  date of start life: 2006-02-25
  validity context: *t
  on class: Leiding
  on property: has as aspect (inverse)
  max qualified cardinality: 1
subclass of: Restriction
  date of change: 2015-11-03
  author at start life: Marinus Vonhof
  date of start life: 2013-03-29
  on class: Inwinning
  on property: has as aspect
  max qualified cardinality: 1
subclass of: Restriction
  on property: has as value
  all values from: Lengte leiding (datatype)

Maaiveldhoogte
author of change: Marinus Vonhof
date of change: 2015-11-07
definition: Het niveau van het maaiveld
author at start life: Marinus Vonhof
date of start life: 2012-04-22
units of measurements: m
comment: [is aspect]
scope note: Cof TOP
type: Class
subclass of: Hoogte t.o.v. NAP
subclass of: Restriction
  author of change: Marinus Vonhof
  date of change: 2018-12-12
  author at start life: Marinus Vonhof
  date of start life: 2012-04-22
  on class: Maaiveldoriëntatie
  on property: has as aspect (inverse)
  qualified cardinality: 1
subclass of: Restriction
  author at start life: Marinus Vonhof
  date of start life: 2015-11-07
  on class: Inwinning
  on property: has as aspect
  max qualified cardinality: 1
subclass of: Restriction
  on property: has as value
  all values from: decimal

Opdrachtgever
label: Employing authority @en
author of change: Marinus Vonhof
date of change: 2025-01-16
date of change: 2020-04-20
definition: Een rechtspersoon die opdracht geeft voor het uitvoeren van activiteiten dan wel het leveren van producten of diensten. De initiator van het project, dus ongeacht onderaanneming.
definition: [IMBOR] Een opdrachtgever is een organisatie die een bepaalde opdracht tot het verrichten van werkzaamheden verstrekt aan een andere (rechts)persoon, de opdrachtnemer.
notation: AAM
notation: CAM
notation: EAM
notation: GAM
notation: JAM
author at start life: Marinus Vonhof
date of start life: 2011-12-02
validity context: 3d 14d
see also: [KIB] De naam van de bevoegde instantie
alternative label: Bevoegde instantie
scope note: Cof TOP
type: Class
subclass of: Levensvorm
subclass of: Restriction
  author at start life: Marinus Vonhof
  date of start life: 2015-10-26
  on class: Project
  on property: has as input (inverse)
  qualified cardinality: 1

Opdrachtnemer
author of change: Marinus Vonhof
date of change: 2017-05-08
definition: Rechtspersoon die door middel van een overeenkomst door een opdrachtgever tegen vergoeding in staat wordt gesteld tot het uitvoeren van bepaalde activiteiten dan wel het leveren van producten of diensten
author at start life: Marinus Vonhof
date of start life: 2015-10-26
validity context: 3d 6d 14d
scope note: Cof TOP
type: Class
subclass of: Levensvorm
subclass of: Restriction
  author of change: Marinus Vonhof
  date of change: 2015-10-31
  author at start life: Marinus Vonhof
  date of start life: 2015-10-26
  on class: Project
  on property: has as output (inverse)
  qualified cardinality: 1

Vorm put
author of change: Marinus Vonhof
date of change: 2021-08-06
definition: De inwendige vorm (horizontaal, uit het bovenaanzicht). Indien aanwezig de vorm van de onderbak
author at start life: Marinus Vonhof
date of start life: 2012-05-01
comment: Intrinsiek aspect
comment: [is aspect]
scope note: Cof TOP
type: Class
subclass of: Vorm
subclass of: Restriction
  author of change: Marinus Vonhof
  date of change: 2021-08-06
  author at start life: Finy Teitsma (Oranjewoud)
  date of start life: 2006-02-25
  validity context: *t
  on class: Put
  on property: has as aspect (inverse)
  max qualified cardinality: 1
subclass of: Restriction
  date of change: 2017-05-17
  author at start life: Marinus Vonhof
  date of start life: 2015-10-30
  on class: Inwinning
  on property: has as aspect
  max qualified cardinality: 1
subclass of: Restriction
  on property: has as reference (qualification)
  all values from: Vorm put (coll)

Identificatie telemetriesysteem
author at start life: Marinus Vonhof
date of start life: 2013-02-05
comment: [is aspect]
scope note: Cof BAS
scope note: Cof PLI
scope note: Cof DMO
type: Class
subclass of: Unieke identificatie
subclass of: Restriction
  author of change: Marinus Vonhof
  date of change: 2019-05-15
  author at start life: Marinus Vonhof
  date of start life: 2013-02-05
  on class: Mechanische afsluiter
  on property: has as aspect (inverse)
  max qualified cardinality: 1

Industrieterrein
author at start life: Marinus Vonhof
date of start life: 2014-12-01
scope note: Cof BAS
scope note: Cof DMO
type: Class
subclass of: District

Spoelklep
author of change: Marinus Vonhof
author of change: Johan Post
date of change: 2024-05-01
date of change: 2022-10-03
date of change: 2019-01-08
definition: Klep onder de oppervlaktewaterspiegel die geopend kan worden om het rioolstelsel door te spoelen met oppervlaktewater
author at start life: Marinus Vonhof
date of start life: 2015-03-01
scope note: Cof BAS
scope note: Cof HYD
scope note: Cof DMO
type: Class
subclass of: Mechanische afsluiter
subclass of: Restriction
  on property: heeft Functie
  has value: Afsluiten in twee stroomrichtingen
subclass of: Restriction
  on property: heeft Functie
  has value: Doorspoelen rioolstelsel

Meten
author of change: Marinus Vonhof
author of change: Johan Post
date of change: 2014-04-29
date of change: 2024-09-10
author at start life: Marinus Vonhof
date of start life: 2013-09-28
validity context: 6d
scope note: Cof REV
scope note: Cof BAS
scope note: Cof DMO
type: Class
subclass of: Onderzoeken

Wijze van inwinning
author of change: Johan Post
date of change: 2022-09-29
definition: Wijze waarop gegevens verzameld zijn
author at start life: Marinus Vonhof
date of start life: 2013-02-05
alternative label: Wijze van inwinnen
comment: [is aspect]
scope note: Cof TOP
type: Class
subclass of: Kenmerk
subclass of: Restriction
  author of change: Marinus Vonhof
  date of change: 2026-07-26
  date of change: 2024-05-15
  date of change: 2019-04-25
  author at start life: Marinus Vonhof
  date of start life: 2015-10-29
  on class: Inwinning
  on property: has as aspect (inverse)
  max qualified cardinality: 1
subclass of: Restriction
  on property: has as reference (qualification)
  all values from: Wijze van inwinning (coll)

Inspecteren
author of change: Marinus Vonhof
date of change: 2022-09-30
date of change: 2015-08-24
definition: [NEN 3300:1996] (Inspectie) Het waarnemen, herkennen en beschrijven van de toestand
author at start life: Marinus Vonhof
date of start life: 2013-03-26
validity context: 1f 3f 5d 10f 11d 12f 14f
scope note: Cof TOP
type: Class
subclass of: Onderzoeken

Mechanische transportleiding
author of change: Marinus Vonhof
author of change: Johan Post
author of change: Wouter van Riel
date of change: 2025-01-16
date of change: 2024-05-02
date of change: 2015-09-20
date of change: 2024-04-23
date of change: 2024-07-26
date of change: 2024-05-04
definition: [IMBOR] Een transportleiding waarin de materie op basis van onder- en bovendruk wordt verplaatst.
author at start life: Marinus Vonhof
date of start life: 2014-12-02
validity context: *f
scope note: Cof TOP
type: Class
subclass of: Transportleiding
subclass of: Restriction
  on property: heeft Structuur
  has value: Gesloten
subclass of: Restriction
  on property: heeft Technologie
  has value: Transport onder overdruk of onderdruk

Inspectieplan
author of change: Marinus Vonhof
author of change: Johan Post
date of change: 2024-05-02
date of change: 2018-12-12
definition: Een plan dat beschrijft hoe en wanneer de riolering geïnspecteerd wordt
author at start life: Marinus Vonhof
date of start life: 2018-12-06
scope note: Cof BAS
scope note: Cof PLI
scope note: Cof DMO
type: Class
subclass of: Rioleringsplan
subclass of: Restriction
  author at start life: Marinus Vonhof
  date of start life: 2018-12-13
  on class: Planvorming rioleringsbeheer
  on property: has as output (inverse)
  max qualified cardinality: 1

Project
author of change: Marinus Vonhof
date of change: 2025-01-16
definition: [IMBOR] Afbakening van het gebied (begrenzing) waarbinnen werkzaamheden gepland zijn, uitgevoerd worden of uitgevoerd zijn.
author at start life: Marinus Vonhof
date of start life: 2013-09-03
validity context: 3d 14d
scope note: Cof TOP
type: Class
subclass of: Activiteit
subclass of: Restriction
  author of change: Marinus Vonhof
  date of change: 2015-10-26
  author at start life: Marinus Vonhof
  date of start life: 2011-12-02
  validity context: 1t 10t 12t
  on class: Projectreferentie opdrachtgever
  on property: has as aspect
  max qualified cardinality: 1
subclass of: Restriction
  author of change: Marinus Vonhof
  date of change: 2015-10-31
  author at start life: Marinus Vonhof
  date of start life: 2015-10-26
  on class: Opdrachtnemer
  on property: has as output
  min qualified cardinality: 1
subclass of: Restriction
  author at start life: Marinus Vonhof
  date of start life: 2015-10-26
  validity context: 1t 10t 12t
  on class: Projectreferentie opdrachtnemer
  on property: has as aspect
  max qualified cardinality: 1
subclass of: Restriction
  author at start life: Marinus Vonhof
  date of start life: 2015-10-26
  on class: Opdrachtgever
  on property: has as input
  qualified cardinality: 1

Vrijverval transportstelsel
author of change: Marinus Vonhof
author of change: Johan Post
date of change: 2025-01-16
date of change: 2021-10-01
definition: [IMBOR] Een netwerk van leidingen en putten ten behoeve van het transport van materie dat door middel van zwaartekracht plaatsvindt.
author at start life: Marinus Vonhof
date of start life: 2014-12-02
scope note: Cof TOP
type: Class
subclass of: Transportstelsel
subclass of: Restriction
  author of change: Marinus Vonhof
  date of change: 2015-09-20
  author at start life: Marinus Vonhof
  date of start life: 2014-12-02
  validity context: 1t 10t 12t
  on class: Vrijverval transportleiding
  on property: has as part
  min qualified cardinality: 1
subclass of: Restriction
  on property: heeft Technologie
  has value: Transport door de zwaartekracht

Interne overstortput
author of change: Marinus Vonhof
author of change: Finy Teitsma (Oranjewoud)
author of change: Wouter van Riel
date of change: 2024-04-20
date of change: 2007-11-12
date of change: 2025-03-20
definition: Een overstortput die loost op een voorziening binnen hetzelfde rioolstelsel.
definition: [NEN 3300:1996] rioolput voorzien van een overstortdrempel die loost binnen het in beschouwing genomen rioolstelsel
author at start life: Finy Teitsma (Oranjewoud)
date of start life: 2006-05-23
alternative label: Interne overstort
scope note: Cof MDS
scope note: Cof REV
scope note: Cof HYD
scope note: Cof DMO
type: Class
subclass of: Overstortput
subclass of: Restriction
  on property: heeft Functie
  has value: Lozen binnen het stelsel

Invoer DWA gebied
definition: som van alle DWA invoeren van inprikkende gebieden en bovenstroomse afvoerconstructies
author at start life: Wouter van Riel
date of start life: 2022-12-19
units of measurements: m3/h
comment: [is aspect]
scope note: Cof DMO
type: Class
subclass of: Invoer gebied
subclass of: Restriction
  author at start life: Wouter van Riel
  date of start life: 2022-12-19
  on class: Afvoerpunt gebied
  on property: has as aspect (inverse)
  max qualified cardinality: 1
subclass of: Restriction
  on property: has as value
  all values from: decimal
subclass of: Restriction
  on class: Inwinning
  on property: has as aspect
  max qualified cardinality: 1

Invoer HWA gebied
definition: som van alle HWA invoeren van inprikkende gebieden en bovenstroomse afvoerconstructies
author at start life: Wouter van Riel
date of start life: 2022-12-19
units of measurements: m3/h
comment: [is aspect]
scope note: Cof DMO
type: Class
subclass of: Invoer gebied
subclass of: Restriction
  author at start life: Wouter van Riel
  date of start life: 2022-12-19
  on class: Afvoerpunt gebied
  on property: has as aspect (inverse)
  max qualified cardinality: 1
subclass of: Restriction
  on property: has as value
  all values from: decimal
subclass of: Restriction
  on class: Inwinning
  on property: has as aspect
  max qualified cardinality: 1

Uitlaatconstructie
author of change: Marinus Vonhof
author of change: Johan Post
date of change: 2022-09-30
date of change: 2026-05-21
date of change: 2020-04-18
definition: [NEN-EN 752:2008] constructie of punt van waaruit afvalwater wordt geloosd naar een afvalwaterzuiveringsinstallatie of ontvangend water [EN 1085:2007, definitie 1280]
definition: Een bouwwerk bestaande uit een constructief vormgegeven uitstroomelement dat de uitstroming van water uit een leiding naar het oppervlaktewater mogelijk maakt.
definition: [NEN 3300:1996] constructie waar uitstroming van afvalwater uit het in beschouwing genomen rioolstelsel naar het oppervlaktewater mogelijk is
author at start life: Marinus Vonhof
date of start life: 2013-10-01
scope note: Cof MDS
scope note: Cof HYD
scope note: Cof DMO
type: Class
subclass of: Bouwwerk
subclass of: Restriction
  on property: heeft Functie
  has value: Uitstroom van afvalwater naar oppervlaktewater

Wandruwheid
author of change: Marinus Vonhof
date of change: 2025-01-16
definition: [IMBOR] Aanduiding voor de ruwheid van de buiswand.
author at start life: Marinus Vonhof
date of start life: 2011-12-15
units of measurements: mm
validity context: 15d
alternative label: K-Nikuradse waarde profielwand
comment: [is aspect]
scope note: Cof BAS
scope note: Cof DMO
type: Class
subclass of: Kenmerk
subclass of: Restriction
  author of change: Marinus Vonhof
  date of change: 2015-06-01
  author at start life: Marinus Vonhof
  date of start life: 2011-12-15
  on class: Leiding
  on property: has as aspect (inverse)
  max qualified cardinality: 1
subclass of: Restriction
  on property: has as value
  all values from: Wandruwheid (datatype)

Wandruwheid binnenboven
author of change: Marinus Vonhof
date of change: 2025-01-16
definition: [IMBOR] Aanduiding voor de ruwheid van de buiswand binnenboven.
author at start life: Marinus Vonhof
date of start life: 2013-02-05
units of measurements: mm
comment: [is aspect]
scope note: Cof BAS
scope note: Cof DMO
type: Class
subclass of: Wandruwheid
subclass of: Restriction
  author at start life: Marinus Vonhof
  date of start life: 2013-02-05
  on class: Leiding
  on property: has as aspect (inverse)
  max qualified cardinality: 1
subclass of: Restriction
  on property: has as value
  all values from: integer

Wandruwheid binnenonder
author of change: Marinus Vonhof
date of change: 2025-01-16
definition: [IMBOR] Aanduiding voor de ruwheid van de buiswand binnenonder.
author at start life: Marinus Vonhof
date of start life: 2013-02-05
units of measurements: mm
comment: [is aspect]
scope note: Cof BAS
scope note: Cof DMO
type: Class
subclass of: Wandruwheid
subclass of: Restriction
  author at start life: Marinus Vonhof
  date of start life: 2013-02-05
  on class: Leiding
  on property: has as aspect (inverse)
  max qualified cardinality: 1
subclass of: Restriction
  on property: has as value
  all values from: integer

WIBON thema
author of change: Marinus Vonhof
date of change: 2025-01-16
definition: [IMBOR] Het thema geeft aan welk type leiding het betreft en welke functie de leidingen hebben. Bijvoorbeeld: datatransport, gas lage druk, laagspanning, riool etc. Opmerking: signaleringskabels die data vervoeren vallen onder datatransport.
author at start life: Marinus Vonhof
date of start life: 2020-04-17
validity context: 15d
comment: [is aspect]
scope note: Cof MDS
scope note: Cof DMO
type: Class
subclass of: Kenmerk
subclass of: Restriction
  author at start life: Marinus Vonhof
  date of start life: 2020-04-17
  on class: Leiding
  on property: has as aspect (inverse)
  max qualified cardinality: 1
subclass of: Restriction
  author at start life: Marinus Vonhof
  date of start life: 2020-04-17
  on class: Put
  on property: has as aspect (inverse)
  max qualified cardinality: 1
subclass of: Restriction
  author at start life: Marinus Vonhof
  date of start life: 2026-07-24
  on class: Reservoir
  on property: has as aspect (inverse)
  max qualified cardinality: 1
subclass of: Restriction
  on property: has as reference (qualification)
  all values from: WIBON thema (coll)

Leidingsegment
author of change: Marinus Vonhof
author of change: Johan Post
author of change: Eric van Gorkom
date of change: 2022-09-27
date of change: 2022-09-29
date of change: 2018-12-12
author at start life: Marinus Vonhof
date of start life: 2014-12-02
validity context: 12d
see also: [WSH 20141028] Deel van een persleiding begrensd door wijziging materiaal, wijziging afmeting, locatie inprikpunt of locatie appendages
scope note: Cof MDS
scope note: Cof PLI
scope note: Cof HYD
scope note: Cof DMO
type: Class
subclass of: Mechanische transportleiding
subclass of: Restriction
  author of change: Marinus Vonhof
  date of change: 2016-04-28
  author at start life: Marinus Vonhof
  date of start life: 2014-12-02
  on class: Persleiding
  on property: has as part (inverse)
  max qualified cardinality: 1
subclass of: Restriction
  on property: heeft Uitvoering
  has value: Deel van mechanische transportleiding

Lengte
author of change: Marinus Vonhof
date of change: 2025-01-16
date of change: 2015-05-29
definition: In de richting van de langste afstand
definition: [IMBOR] Kenmerk voor de registratie van de langste horizontale dimensie van het beheerobject.
author at start life: Nic Roest (Idoro)
date of start life: 2006-02-17
comment: [is aspect]
scope note: Cof TOP
type: Class
subclass of: Afstand

Vrijverval transportleiding
author of change: Johan Post
author of change: Wouter van Riel
date of change: 2026-05-01
date of change: 2024-04-22
definition: Een transportleiding waarin de materie door de zwaartekracht wordt verplaatst
author at start life: Marinus Vonhof
date of start life: 2015-09-20
validity context: 3f
scope note: Cof TOP
type: Class
subclass of: Transportleiding
subclass of: Restriction
  author of change: Marinus Vonhof
  date of change: 2015-09-20
  author at start life: Marinus Vonhof
  date of start life: 2014-12-02
  validity context: 1t 10t 12t
  on class: Vrijverval transportstelsel
  on property: has as part (inverse)
  qualified cardinality: 1
subclass of: Restriction
  author at start life: Johan Post
  date of start life: 2026-05-01
  on class: Vrijverval rioolstelsel
  on property: has as part (inverse)
  max qualified cardinality: 1
subclass of: Restriction
  on property: heeft Technologie
  has value: Transport door de zwaartekracht

Luchtpersgemaal
author of change: Marinus Vonhof
date of change: 2025-01-16
date of change: 2018-11-07
definition: Een gemaal uitgevoerd met een luchtcompressor die het afvalwater door de persleiding drukt
author at start life: Marinus Vonhof
date of start life: 2018-05-03
scope note: Cof MDS
scope note: Cof HYD
scope note: Cof RGM
scope note: Cof DMO
type: Class
subclass of: Rioolgemaal
subclass of: Restriction
  author of change: Marinus Vonhof
  date of change: 2018-11-07
  author at start life: Marinus Vonhof
  date of start life: 2018-05-03
  on class: Luchtpersriolering
  on property: has as part (inverse)
  qualified cardinality: 1
subclass of: Restriction
  on property: heeft Uitvoering
  has value: Verpompt met een luchtcompressor

Meetwaarde
author of change: Marinus Vonhof
date of change: 2025-01-16
date of change: 2016-04-29
definition: [IMBOR] Het getal of de categorie die op grond van een meting aan een attribuut bij een entiteit wordt toegewezen.
author at start life: Nic Roest (Idoro)
date of start life: 2008-03-11
comment: [is aspect]
scope note: Cof BAS
scope note: Cof DMO
type: Class
subclass of: Kenmerk
subclass of: Restriction
  author of change: Marinus Vonhof
  date of change: 2016-04-29
  author at start life: Finy Teitsma (Oranjewoud)
  date of start life: 2007-10-23
  on class: Meten
  on property: has as aspect (inverse)
  max qualified cardinality: 1

Schildmuur
author of change: Marinus Vonhof
author of change: Johan Post
date of change: 2025-01-16
date of change: 2019-04-05
definition: [IMBOR] Een scheiding, vaak gemaakt van metselwerk, die in een put aangebracht kan worden om de stroming door de put aan te passen.
author at start life: Marinus Vonhof
date of start life: 2013-10-04
validity context: 1d
comment: Een schildmuur is topologisch gezien een verbinding (zoals wand, pomp, doorlaat). Een schildmuur kan ook als knooppunt beschreven worden, gebruik dan het concept "Schildmuur (eindkap)".
scope note: Cof MDS
scope note: Cof HYD
scope note: Cof DMO
type: Class
subclass of: Wand
subclass of: Restriction
  on property: heeft Functie
  has value: Volledig keren van water

Noodoverstortput
author of change: Finy Teitsma (Oranjewoud)
date of change: 2007-11-12
definition: Een externe overstortput aangelegd voor afvoer als gevolg van een calamiteit.
author at start life: Finy Teitsma (Oranjewoud)
date of start life: 2007-10-23
alternative label: Noodoverlaat
scope note: Cof MDS
scope note: Cof HYD
scope note: Cof DMO
type: Class
subclass of: Externe overstortput
subclass of: Restriction
  on property: heeft Functie
  has value: Bij calamiteit afvalwater afvoeren

Nooduitlaat
author of change: Marinus Vonhof
date of change: 2015-03-01
definition: Een uitlaat aangelegd voor afvoer als gevolg van een calamiteit.
definition: [NEN 3300:1996] constructie voor de lozing van afvalwater op het oppervlaktewater bij calamiteiten
author at start life: Finy Teitsma (Oranjewoud)
date of start life: 2007-10-23
scope note: Cof MDS
scope note: Cof HYD
scope note: Cof DMO
type: Class
subclass of: Uitlaatconstructie
subclass of: Restriction
  on property: heeft Functie
  has value: Bij calamiteit afvalwater afvoeren
subclass of: Restriction
  on property: heeft Toepassing
  has value: Calamiteit
subclass of: Restriction
  on property: heeft Functie
  has value: Lozen afvalwater

Projectreferentie opdrachtnemer
notation: EBI
author at start life: Marinus Vonhof
date of start life: 2015-10-26
validity context: 3d 6d 14d
comment: [is aspect]
scope note: Cof TOP
type: Class
subclass of: Unieke identificatie
subclass of: Restriction
  author at start life: Marinus Vonhof
  date of start life: 2015-10-26
  validity context: 1t 10t 12t
  on class: Project
  on property: has as aspect (inverse)
  max qualified cardinality: 1

Opening in wand
author of change: Marinus Vonhof
date of change: 2025-01-16
date of change: 2019-05-15
definition: Een opening in een wand zonder afvoerregeling
definition: [IMBOR] Een doorlaat in de vorm van een opening in een wand.
author at start life: Marinus Vonhof
date of start life: 2012-04-24
comment: Als de opening gecombineerd is met bijvoorbeeld een klep of schuif, gebruik dan een subtype van Mechanische Afsluiter als hydraulisch element
scope note: Cof MDS
scope note: Cof REV
scope note: Cof HYD
scope note: Cof DMO
type: Class
subclass of: Doorlaat
subclass of: Restriction
  author of change: Marinus Vonhof
  date of change: 2018-12-12
  author at start life: Marinus Vonhof
  date of start life: 2015-09-07
  on class: Stuwconstructie
  on property: has as part (inverse)
  qualified cardinality: 1
subclass of: Restriction
  on property: heeft Uitvoering
  has value: Uitsparing in wand

Waarneming
label: Observation @en
author of change: Marinus Vonhof
date of change: 2018-04-06
author at start life: Marinus Vonhof
date of start life: 2013-01-07
validity context: 5d 6d 11d
comment: Was specialisatie van Inspecteren
scope note: Cof TOP
type: Class
subclass of: Activiteit

Oppervlakte
definition: De oppervlakte van het rioleringsgebied
author at start life: Marinus Vonhof
date of start life: 2020-11-23
units of measurements: m2
comment: [is aspect]
scope note: Cof DMO
type: Class
subclass of: Kengetal
subclass of: Restriction
  author of change: Marinus Vonhof
  date of change: 2020-11-23
  author at start life: Marinus Vonhof
  date of start life: 2018-12-17
  on class: Rioleringsgebied
  on property: has as aspect (inverse)
  max qualified cardinality: 1
subclass of: Restriction
  on property: has as value
  all values from: decimal

Optimalisatie afvalwater studie
author of change: Marinus Vonhof
date of change: 2014-12-12
author at start life: Marinus Vonhof
date of start life: 2014-12-02
see also: [WRIJ] Een OAS is een integrale analyse van de afvalwaterketen gericht op het genereren van voorstellen om de afvalwaterketen te optimaliseren. Per zuivering(regio) wordt afstemming bereikt tussen riolering en zuivering én tussen watersysteemdoelen en waterketenambities. Er wordt geanalyseerd op welke wijze de afvalwaterketendienst aan bewoners en bedrijfsleven verleend kan worden tegen de laagst maatschappelijke kosten. Het watersysteem kan hierbij kaderstellend zijn. De te formuleren duurzame maatregelen zijn gericht op het samen beheersbaar, optimaal en doelmatig laten functioneren van de onderdelen van de afvalwaterketen.
alternative label: OAS
alternative label: Optimalisatie afvalwatersysteem
scope note: Cof DMO
type: Class
subclass of: Informatiedrager
subclass of: Restriction
  author at start life: Marinus Vonhof
  date of start life: 2014-12-12
  on class: Optimaliseren afvalwaterketen
  on property: has as output (inverse)
  max qualified cardinality: 1

Opvoergemaal
author of change: Marinus Vonhof
date of change: 2025-01-16
date of change: 2019-01-11
definition: Een gemaal in een vrijverval rioolstelsel voor het verpompen van afvalwater naar een hoger gelegen vrijverval rioolstelsel zonder gebruik te maken van een persleiding buiten het bouwwerk.
author at start life: Nic Roest (Idoro)
date of start life: 2007-11-29
scope note: Cof MDS
scope note: Cof HYD
scope note: Cof RGM
scope note: Cof DMO
type: Class
subclass of: Rioolgemaal
subclass of: Restriction
  on property: heeft Uitvoering
  has value: Verpompt binnen het bouwwerk

Organisatie afname
definition: Naam van de organisatie die verantwoordelijk is voor de afname van afvalwater (bijvoorbeeld de naam van een waterschap)
author at start life: Marinus Vonhof
date of start life: 2026-07-15
scope note: Cof BAS
scope note: Cof DMO
type: Class
subclass of: Levensvorm
subclass of: Restriction
  on class: Overnamepunt
  on property: has as aspect (inverse)
  max qualified cardinality: 1

Riooleindgemaal
author of change: Marinus Vonhof
date of change: 2025-01-16
date of change: 2017-04-06
definition: Het rioolgemaal waar de overdracht plaatsvindt van een stelsel onder beheer van een gemeente naar een stelsel of ontvangstput onder beheer van een waterschap.
author at start life: Marinus Vonhof
date of start life: 2014-11-30
see also: [IRIS-RIOKEN:2012] Voor het waterschap zijn in principe alleen de riooleindgemalen interessant, waar overdracht van afvalwater plaatsvindt naar een stelsel dat onder beheer van dit waterschap is.
alternative label: Overnamegemaal
scope note: Cof MDS
scope note: Cof HYD
scope note: Cof RGM
scope note: Cof DMO
type: Class
subclass of: Rioolgemaal
subclass of: Restriction
  author at start life: Marinus Vonhof
  date of start life: 2026-07-14
  on class: Overnamepunt
  on property: has as part
  max qualified cardinality: 1
subclass of: Restriction
  on property: heeft Toepassing
  has value: Is overdrachtspunt

Overstortingsgebeurtenis
definition: [NEN 3300:1996] De gebeurtenis bestaande uit alle overstortingsperioden en overstortingspauzes, waarbij een overstortingspauze niet groter is dan een bepaalde tijdsduur
author at start life: Marinus Vonhof
date of start life: 2014-11-30
comment: 20151014: NEN3300-definitie aangepast
see also: [IRIS-RIOKEN:2012] Eén overstorting dan wel een reeks van overstortingen met tussenliggende overstortingspauze(s) van elk minder dan 24 uur, overeenkomstig de definitie volgens de module C2100 van de Leidraad Riolering.
scope note: Cof BAS
scope note: Cof DMO
type: Class
subclass of: NEN 3300 Term

Persluchtpomp
author of change: Finy Teitsma (Oranjewoud)
date of change: 2007-10-25
definition: Een pomp waarbij de vloeistof door middel van perslucht wordt verplaatst.
author at start life: Finy Teitsma (Oranjewoud)
date of start life: 2007-10-24
scope note: Cof BAS
scope note: Cof HYD
scope note: Cof RGM
scope note: Cof DMO
type: Class
subclass of: Pomp
subclass of: Restriction
  on property: heeft Technologie
  has value: Verplaatsing door middel van perslucht

Reinigingsplan
author of change: Marinus Vonhof
date of change: 2018-12-12
definition: Een plan dat beschrijft hoe en wanneer de riolering gereinigd wordt
author at start life: Marinus Vonhof
date of start life: 2018-12-06
scope note: Cof BAS
scope note: Cof DMO
type: Class
subclass of: Rioleringsplan
subclass of: Restriction
  author at start life: Marinus Vonhof
  date of start life: 2018-12-13
  on class: Planvorming rioleringsbeheer
  on property: has as output (inverse)
  max qualified cardinality: 1

Projectreferentie opdrachtgever
label: Employers job reference @en
definition: [EN13508-2+A1] De opdrachtcode van de opdrachtgever
definition: [EN13508-2+A1] The employer’s job reference code @en
notation: ABJ
notation: CBJ
notation: EBJ
notation: GBJ
notation: JBJ
author at start life: Marinus Vonhof
date of start life: 2011-12-02
validity context: 3d 6d 14d
alternative label: Opdrachtcode opdrachtgever (EN)
comment: [is aspect]
scope note: Cof TOP
type: Class
subclass of: Unieke identificatie
subclass of: Restriction
  author of change: Marinus Vonhof
  date of change: 2015-10-26
  author at start life: Marinus Vonhof
  date of start life: 2011-12-02
  validity context: 1t 10t 12t
  on class: Project
  on property: has as aspect (inverse)
  max qualified cardinality: 1

Randvoorziening (coll)
definition: Een voorziening bestemd om de lozing van het vuil uit het rioolstelsel op het oppervlaktewater te verminderen.
definition: [NEN 3300:1996] vloeistofdichte voorziening als onderdeel van het rioolstelsel die als doel heeft de lozing van vuil uit het rioolstelsel op oppervlaktewater te verminderen
validity context: *d
see also: [IRIS-RIOKEN:2012] Vloeistofdichte voorziening als onderdeel van het rioolstelsel, die als doel heeft de lozing van vuil uit het rioolstelsel op het oppervlaktewater te verminderen.
comment: [is coll]
scope note: Cof MDS
scope note: Cof DMO
type: Class
subclass of: Verzameling soorten
subclass of: Class
subclass of: Restriction
  on property: heeft Doel
  has value: Verminderen vuilbelasting van oppervlaktewater

Regenweerafvoer
definition: [Waterwet] Soort afvalwater
notation: RWA
author at start life: Eric van Gorkom
date of start life: 2022-12-24
see also: [IRIS-RIOKEN:2012] Het water dat bij regen door de riolering moet worden afgevoerd. Deze bestaat uit huishoudelijk- en industrieel afvalwater, lekwater en hemelwater.
scope note: Cof BAS
scope note: Cof DMO
type: Class
subclass of: Afvalwater

Rioolwater
author of change: Marinus Vonhof
date of change: 2017-09-09
definition: Alle water waarvan men zich via de riolering wil ontdoen
author at start life: Marinus Vonhof
date of start life: 2013-09-10
scope note: Cof BAS
scope note: Cof DMO
type: Class
subclass of: Afvalwater

Schroefcentrifugaalpomp
author of change: Marinus Vonhof
date of change: 2016-04-13
definition: Een pomp waarbij de vloeistof door middel van een schroefcentrifugaalwaaier wordt verplaatst.
author at start life: Finy Teitsma (Oranjewoud)
date of start life: 2007-10-24
scope note: Cof BAS
scope note: Cof HYD
scope note: Cof RGM
scope note: Cof DMO
type: Class
subclass of: Pomp
subclass of: Restriction
  on property: heeft Technologie
  has value: Verplaatsing door middel van een draaiende schroef

Schroefpomp
author of change: Finy Teitsma (Oranjewoud)
date of change: 2007-10-25
definition: Een pomp waarbij de vloeistof door middel van een schroef wordt verplaatst.
author at start life: Finy Teitsma (Oranjewoud)
date of start life: 2007-10-24
scope note: Cof BAS
scope note: Cof HYD
scope note: Cof RGM
scope note: Cof DMO
type: Class
subclass of: Pomp
subclass of: Restriction
  on property: heeft Technologie
  has value: Verplaatsing door middel van een schroef

Stedelijk afvalwater
definition: [Waterwet] Huishoudelijk afvalwater of een mengsel daarvan met bedrijfsafvalwater, afvloeiend hemelwater, grondwater of ander afvalwater
author at start life: Marinus Vonhof
date of start life: 2014-09-05
scope note: Cof BAS
scope note: Cof DMO
type: Class
subclass of: Afvalwater

Type bebouwing
author at start life: Marinus Vonhof
date of start life: 2013-10-05
alternative label: Multifunctioneel gebied
comment: [is aspect]
scope note: Cof BAS
scope note: Cof DMO
type: Class
subclass of: Kenmerk
subclass of: Restriction
  author of change: Marinus Vonhof
  date of change: 2018-12-11
  author at start life: Marinus Vonhof
  date of start life: 2013-10-05
  on class: Straat
  on property: has as aspect (inverse)
  max qualified cardinality: 1
subclass of: Restriction
  on property: has as reference (qualification)
  all values from: Type bebouwing (coll)

Wervelventiel
label: Vortex flow control @en
author of change: Marinus Vonhof
date of change: 2017-12-13
definition: [NEN 3300:1996] doorlaat die het debiet regelt
notation: D
author at start life: Nic Roest (Idoro)
date of start life: 2007-11-29
validity context: 1d 3d
scope note: Cof MDS
scope note: Cof REV
scope note: Cof HYD
scope note: Cof DMO
type: Class
subclass of: Doorlaat
subclass of: Restriction
  author at start life: Marinus Vonhof
  date of start life: 2018-12-12
  on class: Stuwconstructie
  on property: has as part (inverse)
  max qualified cardinality: 1
subclass of: Restriction
  on property: heeft Functie
  has value: Afremmen van de stroomsnelheid van het afvalwater

Verbeterd gescheiden systeem
author of change: Eric van Gorkom
date of change: 2022-09-27
definition: Een samengesteld vrijverval rioolstelsel waarin het vuilwater en hemelwater gescheiden van elkaar wordt ingezameld en getransporteerd, waarbij een beperkt deel van het hemelwater wordt afgevoerd naar de RWZI.
definition: [NEN 3300:1996] Gescheiden rioolstelsel met voorzieningen waardoor een deel van de neerslag naar het vuilwaterriool wordt afgevoerd
notation: VGS
author at start life: Nic Roest (Idoro)
date of start life: 2007-11-29
comment: 20151014: NEN3300-definitie aangepast
alternative label: Verbeterd gescheiden rioolstelsel
alternative label: Verbeterd gescheiden stelsel
scope note: Cof BAS
scope note: Cof DMO
type: Class
subclass of: Gescheiden systeem
subclass of: Restriction
  author at start life: Marinus Vonhof
  date of start life: 2018-12-06
  on class: Verbeterd hemelwaterstelsel
  on property: has as part
  min qualified cardinality: 1
subclass of: Restriction
  on property: heeft Uitvoering
  has value: Gescheiden met gedeeltelijke afvoer hemelwater naar RWZI

Vrijverval leidingsegment
author of change: Marinus Vonhof
author of change: Johan Post
date of change: 2025-01-16
date of change: 2021-10-01
definition: Deel van een vrijverval rioolleiding begrensd door wijziging materiaal, wijziging afmeting of locatie appendages
author at start life: Marinus Vonhof
date of start life: 2018-12-06
scope note: Cof MDS
scope note: Cof HYD
scope note: Cof DMO
type: Class
subclass of: Vrijverval transportleiding
subclass of: Restriction
  author of change: Marinus Vonhof
  date of change: 2025-01-03
  author at start life: Marinus Vonhof
  date of start life: 2018-12-06
  on class: Transportrioolleiding
  on property: has as part (inverse)
  max qualified cardinality: 1
subclass of: Restriction
  on property: heeft Uitvoering
  has value: Deel van vrijverval transportleiding

Systeemoverzicht stedelijk water
definition: Opvolger van het basisrioleringsplan
author at start life: Marinus Vonhof
date of start life: 2021-08-05
validity context: 6d
scope note: Cof BAS
scope note: Cof DMO
type: Class
subclass of: Informatiedrager

Tracébewaking
author at start life: Marinus Vonhof
date of start life: 2014-12-02
validity context: 6d
scope note: Cof BAS
scope note: Cof DMO
type: Class
subclass of: Inspecteren

Transport en zuiveren afvalwater
author of change: Marinus Vonhof
date of change: 2015-03-01
author at start life: Marinus Vonhof
date of start life: 2014-09-25
scope note: Cof DMO
type: Class
subclass of: Activiteit
subclass of: Restriction
  author of change: Marinus Vonhof
  date of change: 2014-12-02
  author at start life: Marinus Vonhof
  date of start life: 2014-10-04
  on class: Waterschapstaak TRI
  on property: has as part (inverse)
  qualified cardinality: 1

Tunnelgemaal
author of change: Marinus Vonhof
date of change: 2025-01-16
definition: Een gemaal dat hemelwater verpompt uit een tunnel
author at start life: Marinus Vonhof
date of start life: 2018-05-03
scope note: Cof MDS
scope note: Cof HYD
scope note: Cof RGM
scope note: Cof DMO
type: Class
subclass of: Rioolgemaal
subclass of: Restriction
  on property: heeft Doel
  has value: Tunnel drooghouden
subclass of: Restriction
  on property: heeft Functie
  has value: Verpompt tunnelwater

Wijze van afleiden
definition: Type gegevensbron
author at start life: Johan Post
date of start life: 2022-03-27
comment: [is aspect]
scope note: Cof DMO
type: Class
subclass of: Kenmerk
subclass of: Restriction
  author of change: Marinus Vonhof
  date of change: 2019-04-25
  author at start life: Marinus Vonhof
  date of start life: 2015-10-29
  on class: Type capaciteit
  on property: has as aspect (inverse)
  max qualified cardinality: 1
subclass of: Restriction
  on property: has as reference (qualification)
  all values from: Wijze van afleiden (coll)

Uitstroombak
author of change: Marinus Vonhof
date of change: 2025-01-16
definition: [IMBOR] Een uitlaatconstructie aan de onderkant voorzien van een bakconstructie, waar uitgelaten water op terecht komt.
author at start life: Marinus Vonhof
date of start life: 2018-12-05
scope note: Cof MDS
scope note: Cof HYD
scope note: Cof DMO
type: Class
subclass of: Uitlaatconstructie
subclass of: Restriction
  on property: heeft Uitvoering
  has value: Vorm van een bak

Verbeterd gemengd rioolstelsel
author of change: Marinus Vonhof
date of change: 2015-09-20
definition: [NEN 3300:1996] gemengd rioolstelsel met (rand)voorzieningen die de vuiluitworp richting oppervlaktewater beperken ten opzichte van de traditionele gemengde rioolstelsels
author at start life: Marinus Vonhof
date of start life: 2012-04-29
scope note: Cof TOP
type: Class
subclass of: Gemengd rioolstelsel
subclass of: Restriction
  on property: heeft Doel
  has value: Verminderen vuilbelasting van oppervlaktewater

Vervuilingseenheid
author of change: Marinus Vonhof
date of change: 2016-04-23
definition: [NEN 3300:1996] maat waarmee de hoeveelheid van vervuiling van afvalwater wordt berekend
notation: V.e.
author at start life: Marinus Vonhof
date of start life: 2014-11-30
see also: [IRIS-RIOKEN:2012] Rekeneenheid bij de verontreinigingsheffing van oppervlaktewater die de vervuilingswaarde uitdrukt. Een vervuilingeenheid is voor zuurstofbindende stoffen gelijk aan een inwonerequivalent. Voor andere stoffen wordt in de verordening een vracht per heffingsjaar vastgesteld
comment: [is aspect]
scope note: Cof DMO
type: Class
subclass of: Kenmerk

Vijzelgemaal
author of change: Marinus Vonhof
date of change: 2025-01-16
date of change: 2017-05-31
definition: [IMBOR] Gemaal voor het verpompen van (afval)water met behulp van een vijzel.
author at start life: Marinus Vonhof
date of start life: 2013-10-04
scope note: Cof MDS
scope note: Cof HYD
scope note: Cof RGM
scope note: Cof DMO
type: Class
subclass of: Rioolgemaal
subclass of: Restriction
  author at start life: Marinus Vonhof
  date of start life: 2013-10-04
  on class: Vijzelpomp
  on property: has as part
  qualified cardinality: 1
subclass of: Restriction
  on property: heeft Technologie
  has value: Verpompen met een vijzel

Vijzelpomp
author of change: Finy Teitsma (Oranjewoud)
date of change: 2007-10-25
definition: Een pomp waarbij de vloeistof door middel van een vijzel wordt verplaatst.
author at start life: Finy Teitsma (Oranjewoud)
date of start life: 2007-10-24
scope note: Cof BAS
scope note: Cof HYD
scope note: Cof RGM
scope note: Cof DMO
type: Class
subclass of: Pomp
subclass of: Restriction
  author at start life: Marinus Vonhof
  date of start life: 2013-10-04
  on class: Vijzelgemaal
  on property: has as part (inverse)
  qualified cardinality: 1
subclass of: Restriction
  on property: heeft Technologie
  has value: Verplaatsing door middel van een vijzel

Vlinderklep
definition: Afsluitconstructie waarbij stroming in twee richtingen mogelijk is. De klep draait om haar middellijn.
author at start life: Marinus Vonhof
date of start life: 2019-05-15
scope note: Cof BAS
scope note: Cof PLI
scope note: Cof HYD
scope note: Cof DMO
type: Class
subclass of: Mechanische afsluiter
subclass of: Restriction
  on property: heeft Functie
  has value: Afsluiten in twee stroomrichtingen

Waterschapsgebied
author at start life: Marinus Vonhof
date of start life: 2015-10-28
see also: [IMGeo:1.0/2007] Regionaal gebied onder het bestuur van een overheidsinstantie (waterschap) die tot taak heeft de waterhuishouding in dit gebied te regelen.
alternative label: Waterschapgrens
scope note: Cof BAS
scope note: Cof DMO
type: Class
subclass of: Registratief gebied

Watertakenplan
author at start life: Eric van Gorkom
date of start life: 2024-05-13
scope note: Cof BAS
scope note: Cof DMO
type: Class
subclass of: Rioleringsplan
subclass of: Restriction
  author of change: Marinus Vonhof
  date of change: 2018-12-13
  author at start life: Marinus Vonhof
  date of start life: 2014-11-29
  on class: Planvorming rioleringsbeheer
  on property: has as output (inverse)
  qualified cardinality: 1

Werveloverstortput
definition: [NEN 3300:1996] een overstortput waarbij een cilindrische vorm, een spiraalachtige goot, een duikschot en een langere drempel zijn toegepast en de inhoud voor de drempel is vergroot om de vuiluitworp tijdens overstorting te beperken
author at start life: Marinus Vonhof
date of start life: 2012-04-29
scope note: Cof MDS
scope note: Cof HYD
scope note: Cof DMO
type: Class
subclass of: Verbeterde overstortput
subclass of: Restriction
  on property: heeft Structuur
  has value: Cilindrische vorm
subclass of: Restriction
  on property: heeft Uitvoering
  has value: Spiraalachtige goot

Woninglocatie
author at start life: Marinus Vonhof
date of start life: 2017-12-07
scope note: Cof BAS
scope note: Cof DMO
type: Class
subclass of: Perceel

Woonwijk
author of change: Marinus Vonhof
author of change: Wouter van Riel
date of change: 2025-01-16
date of change: 2021-11-19
definition: [IMBOR] Gebied waarop panden of overige bouwwerken staan die voornamelijk gebruikt worden voor bewoning, inclusief erven en tuinen die bij de panden behoren.
author at start life: Marinus Vonhof
date of start life: 2014-12-01
alternative label: Woongebied
scope note: Cof BAS
scope note: Cof DMO
type: Class
subclass of: District

Zuigerpomp
author of change: Marinus Vonhof
date of change: 2015-09-20
definition: Een pomp waarbij de vloeistof door middel van een zuiger wordt verplaatst.
author at start life: Finy Teitsma (Oranjewoud)
date of start life: 2007-10-24
scope note: Cof BAS
scope note: Cof HYD
scope note: Cof RGM
scope note: Cof DMO
type: Class
subclass of: Pomp
subclass of: Restriction
  on property: heeft Technologie
  has value: Verplaatsing door middel van een zuiger

AHN
definition: Actueel Hoogtebestand Nederland (alle versies)
validity context: 16d
comment: Was AHN2 (tm versie 1.4)
type: Wijze van inwinning (coll)

AHN1
definition: Actueel Hoogtebestand Nederland (versie 1)
validity context: 16d
type: Wijze van inwinning (coll)

AHN2
definition: Actueel Hoogtebestand Nederland (versie 2, anno 2011)
validity context: 16d
type: Wijze van inwinning (coll)

AHN3
definition: Actueel Hoogtebestand Nederland (versie 3, anno 2015)
validity context: 16d
type: Wijze van inwinning (coll)

AHN4
definition: Actueel Hoogtebestand Nederland (versie 4, anno 2020)
validity context: 16d
type: Wijze van inwinning (coll)

Afgeleid
definition: Via interpolatie, extrapolatie of berekening
validity context: 16d
type: Wijze van inwinning (coll)

Afvalwaterakkoord
definition: Productie afvalwater gebaseerd op het afvalwaterakkoord
author at start life: Johan Post
date of start life: 2022-03-27
validity context: 16d
type: Wijze van inwinning (coll)

BGT
alternative label: IMGeo of BGT
type: Wijze van inwinning (coll)

Basisregistratie Adressen en Gebouwen (BAG)
definition: Afgeleid uit gegevens van de Basisregistratie Adressen en Gebouwen (BAG)
validity context: 16d
type: Wijze van inwinning (coll)

Bruto vloeroppervlak
definition: Productie afvalwater gebaseerd op een vergunning
author at start life: Johan Post
date of start life: 2022-05-05
validity context: 16d
type: Wijze van inwinning (coll)

CBS
definition: Centraal Bureau voor de Statistiek
validity context: 16d
type: Wijze van inwinning (coll)

Drinkwaterverbruik
definition: Productie afvalwater gebaseerd op het drinkwaterverbruik
author at start life: Johan Post
date of start life: 2022-03-27
validity context: 16d
type: Wijze van inwinning (coll)

GBKN
validity context: 16d
type: Wijze van inwinning (coll)

GNSS Landmeting
author of change: Johan Post
date of change: 2024-05-01
definition: GNSS staat voor global navigation sattelite system, wat naast GPS ook het Europese Galileo, het Russische Glonass en het Chinese Beidoe omvat.
type: Wijze van inwinning (coll)

GNSS Vanuit wagen
author of change: Johan Post
date of change: 2024-05-01
definition: Bijvoorbeeld tijdens kolkenreinigen
type: Wijze van inwinning (coll)

Grondradar
author of change: Marinus Vonhof
date of change: 2025-01-16
date of change: 2024-11-07
definition: Door middel van radarmeting vanaf maaivled
definition: [IMBOR] Het gegeven over het object is ingewonnen door middel van een meetinstrument dat signalen uitzendt richting de bodem en opvangt voor het verrichten van bodemonderzoek. De situatie in de ondergrond wordt in kaart gebracht door een profiel te ontwikkelen op basis van de ontvangen signalen.
author at start life: Marinus Vonhof
date of start life: 2024-11-07
validity context: 16d
type: Wijze van inwinning (coll)

Inmeting
author of change: Marinus Vonhof
date of change: 2025-01-16
definition: Met waterpastoestel, theodoliet, meetlint
definition: [IMBOR] Het gegeven over het object is ingewonnen door middel van een nader te specificeren meetinstrument dat, bijvoorbeeld, gebruikt is om de exacte omvang of de inhoud van een object op te meten.
type: Wijze van inwinning (coll)

Inspectie
author of change: Marinus Vonhof
date of change: 2025-01-16
definition: Via uitgevoerde inspectie
definition: [IMBOR] De wijze waarop het gegeven over het object is ingewonnen is middels het beoordelen van het object in de daadwerkelijke buitenruimte.
validity context: 16d
type: Wijze van inwinning (coll)

LIDAR 3D
author at start life: Johan Post
date of start life: 2026-05-04
type: Wijze van inwinning (coll)

Luchtfoto
author of change: Marinus Vonhof
date of change: 2025-01-16
definition: [IMBOR] Het gegeven over het object is ingewonnen door middel van grootschalige fotografie vanuit een helikopter, vliegtuig of door een drone.
validity context: 16d
type: Wijze van inwinning (coll)

Niet kunnen achterhalen
author of change: Johan Post
date of change: 2022-09-22
definition: Een poging om het gevraagde kenmerk te achterhalen is niet succesvol geweest
validity context: 16d
type: Wijze van inwinning (coll)

Objecttype niet kunnen achterhalen
definition: Een poging om het objecttype te achterhalen is niet succesvol geweest
author at start life: Johan Post
date of start life: 2026-08-12
type: Wijze van inwinning (coll)

Plan/Ontwerp
validity context: 16d
alternative label: Plan of ontwerp
type: Wijze van inwinning (coll)

Revisie
author of change: Marinus Vonhof
date of change: 2025-01-16
definition: Via uitgevoerde revisie
definition: [IMBOR] De wijze waarop het gegeven over het object is ingewonnen is middels gegevens die zijn ontvangen aangaande de herziening van het object of de omgeving.
validity context: 16d
type: Wijze van inwinning (coll)

Schatting
author of change: Marinus Vonhof
date of change: 2025-01-16
definition: [IMBOR] Het gegeven over het object is ingewonnen door middel van een bepaling met een bepaalde onzekerheid van welke aard dan ook.
validity context: 16d
type: Wijze van inwinning (coll)

Sensor (inwinning)
validity context: 16d
type: Wijze van inwinning (coll)

Vergunning
author of change: Marinus Vonhof
date of change: 2025-01-16
definition: Productie afvalwater gebaseerd op een vergunning
definition: [IMBOR] Een document dat een officiële toestemming van de overheid om een bepaalde activiteit uit te voeren vastlegt ter raadpleging door derden.
author at start life: Johan Post
date of start life: 2022-03-27
validity context: 16d
type: Wijze van inwinning (coll)

Waterpassing
definition: Een specificatie van inmeting
author at start life: Marinus Vonhof
date of start life: 2025-10-07
type: Wijze van inwinning (coll)

Direct transport door pompen zonder opvang in een ontvangput/kelder
type: Technologie

Verplaatsing door middel van een draaiend rad
type: Technologie

Door middel van drukverschil
type: Technologie

Transport onder overdruk
type: Technologie

Mechanisch
type: Technologie

Transport onder overdruk of onderdruk
type: Technologie

Verplaatsing door middel van perslucht
type: Technologie

Verplaatsing door middel van een draaiende schroef
type: Technologie

Verplaatsing door middel van een schroef
type: Technologie

Statisch
type: Technologie

Transport door de zwaartekracht
type: Technologie

Transport onder onderdruk
type: Technologie

Verplaatsing door middel van een vijzel
type: Technologie

Verplaatsing door middel van een zuiger
type: Technologie

Verpompen met een vijzel
type: Technologie

Beton
label: Concrete @en
author of change: Marinus Vonhof
date of change: 2025-01-16
definition: [IMBOR] Een kunstmatig, steenachtig materiaal dat veelal is samengesteld uit het bindmiddel cement en uit een of meer toeslagmaterialen zoals zand, grind of steenslag.
notation: BET
notation: AG
notation: BETON
type: Uitvoering
type: Mechanisme
type: Materiaal deksel (coll)
type: Materiaal leiding (coll)
type: Materiaal put (coll)

Constructie van enige omvang
type: Uitvoering

Verbonden met de grond
type: Uitvoering

Deel van mechanische transportleiding
type: Uitvoering

Deel van vrijverval transportleiding
type: Uitvoering

Vrijstaand, overdekt, omsloten en toegankelijk
type: Uitvoering

Gegraven of geboorde kokervormige diepte
type: Uitvoering

Geheel van stelsels
type: Uitvoering

Opstelling pomp(en) buiten de ontvangput/kelder
type: Uitvoering

Opstelling pomp(en) in de ontvangput/kelder
type: Uitvoering

Gescheiden
type: Uitvoering

Gescheiden met gedeeltelijke afvoer hemelwater naar RWZI
validity context: 1d 3d 10d 12d 14d
type: Uitvoering

Langere drempel
type: Uitvoering

Verpompt met een luchtcompressor
type: Uitvoering

Staal
label: Steel @en
author of change: Marinus Vonhof
date of change: 2025-01-16
definition: [IMBOR] Een legering die bestaat uit ijzer en een geringe hoeveelheid koolstof, zodanig dat dit metaal gekarakteriseerd wordt door de eigenschap van vervormbaarheid bij verhitting.
notation: AP
notation: STAAL
notation: STL
type: Uitvoering
type: Materiaal deksel (coll)
type: Materiaal leiding (coll)
type: Materiaal put (coll)

Natuurlijk of kunstmatig gebied
type: Uitvoering

Netwerk van verbonden knooppunten
type: Uitvoering

Uitsparing in wand
type: Uitvoering

Verpompt binnen het bouwwerk
type: Uitvoering

Verticale waterdichte constructie
type: Uitvoering

Schuifbare plaat
type: Uitvoering

Spiraalachtige goot
type: Uitvoering

Zonder aansluitingen
type: Uitvoering

Vorm van een bak
type: Uitvoering

Vergrote inhoud voor de drempel
type: Uitvoering

Aanvoer van afvalwater
type: Functie

Afdekken
type: Functie

Afremmen van de stroomsnelheid van het afvalwater
type: Functie

Afsluiten in één stroomrichting
type: Functie

Afsluiten in twee stroomrichtingen
type: Functie

Afstroming herstellen
type: Functie

Inzameling van afvalwater
type: Functie

Transport van afvalwater
type: Functie

Afvoer van afvalwater naar een RWZI
type: Functie

Afvoeren hemelwater naar de bovengrond
author at start life: Johan Post
date of start life: 2026-05-04
type: Functie

Meten, regelen, controleren en onderhouden
type: Functie

Zuiveren afvalwater
see also: [Saniwijzer] Het verwijderen van schadelijke stoffen uit afvalwater
type: Functie

Beperken debiet
type: Functie

Bezinken stoffen
type: Functie

Tijdelijke berging van afvalwater
type: Functie

Bij calamiteit afvalwater afvoeren
type: Functie

Bovenstrooms waterpeil regelen
type: Functie

Inzameling van hemelwater
type: Functie

Transport van grondwater
type: Functie

Transport van hemelwater
type: Functie

Doorspoelen rioolstelsel
type: Functie

Transport van vuilwater
type: Functie

Lozen buiten het stelsel
type: Functie

Verpompen van water
type: Functie

Inzameling van vuilwater
type: Functie

Inzameling van hemelwater en vuilwater
type: Functie

Tijdelijke berging van hemelwater en vuilwater
type: Functie

Transport van hemelwater en vuilwater
type: Functie

In stand houden onderdruk
type: Functie

Tijdelijke berging van hemelwater
type: Functie

Lozen binnen het stelsel
type: Functie

Keren van water
type: Functie

Opvang van afstromend hemelwater
type: Functie

Voortgeleiding van materie
type: Functie

Leidingen aansluiten
type: Functie

Lozen afvalwater
type: Functie

Overtollig afvalwater laten wegstromen
type: Functie

Zonder toestandswijziging
type: Functie

Opslag van water
type: Functie

Verplaatsen van water
type: Functie

Verpompen van afvalwater
type: Functie

Rioolleidingen aansluiten
type: Functie

Volledig keren van water
type: Functie

Tijdelijke berging van vuilwater
type: Functie

Verpompt tunnelwater
type: Functie

Uitstroom van afvalwater naar oppervlaktewater
type: Functie

Verminderen vuilbelasting van oppervlaktewater
type: Doel

Goed blijven functioneren
validity context: 5d 11d
type: Doel

Tunnel drooghouden
type: Doel

Calamiteit
type: Toepassing

Deel van een op zichzelf staande constructie
type: Toepassing

Deel van pompunit
type: Toepassing

Is overdrachtspunt
type: Toepassing

Gietijzer
label: Cast iron @en
author of change: Marinus Vonhof
date of change: 2025-01-16
definition: [IMBOR] Een in vormen gegoten legering van ijzer, koolstof, mangaan en silicium.
notation: AM
notation: GIJ
type: Materiaal deksel (coll)
type: Materiaal leiding (coll)
type: Materiaal put (coll)

Roestvast staal
label: Stainless steel @en
author of change: Marinus Vonhof
date of change: 2025-01-16
definition: [IMBOR] Afkorting van roestvast staal, een verzamelnaam voor legeringen die hoofdzakelijk uit ijzer bestaan met minimaal 11 tot 12% chroom en maximaal 1,2% koolstof.
notation: C
alternative label: RVS
alternative label: Roestvaststaal
alternative label: Roestvrijstaal
type: Materiaal deksel (coll)
type: Materiaal leiding (coll)

Rechthoekig
label: Rectangular @en
author of change: Marinus Vonhof
date of change: 2025-01-16
date of change: 2025-12-19
definition: [IMBOR] Een vierhoek met louter rechte hoeken.
notation: B
notation: RHK
alternative label: Kokerprofiel
type: Vorm opening (coll)
type: Vorm put (coll)

Rond
label: Circular @en
author of change: Marinus Vonhof
author of change: Johan Post
date of change: 2025-01-16
date of change: 2022-09-29
date of change: 2024-04-30
date of change: 2025-12-19
date of change: 2024-07-15
date of change: 2024-05-20
definition: [IMBOR] Cirkelvormig en zonder hoeken.
notation: A
notation: RND
type: Vorm opening (coll)
type: Vorm put (coll)
type: Structuur

Anders (vorm)
author of change: Marinus Vonhof
date of change: 2025-12-19
definition: Als de vorm van het object niet rechthoeking of rond is. Vul bij de afmeting de grootste waarden in.
type: Vorm opening (coll)
type: Vorm put (coll)

Asbestcement
label: Asbestos cement @en
author of change: Marinus Vonhof
date of change: 2025-01-16
date of change: 2024-08-20
definition: [IMBOR] Een samengeperst en versteend mengsel van cementmateriaal en soms zand waarin 10 tot 15% asbestvezels (golfplaten, vlakke platen) en bij standleidingen 15 tot 30% als versterking verwerkt zijn. (Bron: Wikipedia)
notation: AA
notation: BET
validity context: 16d
type: Materiaal deksel (coll)
type: Materiaal leiding (coll)
type: Materiaal put (coll)

Glasvezel versterkte kunststof
label: Fibre reinforced plastics @en
author of change: Marinus Vonhof
date of change: 2025-01-16
definition: [IMBOR] Een kunststof die is versterkt met een haarfijne vezel gemaakt van glas.
notation: AL
notation: GVK
alternative label: GVK
type: Materiaal deksel (coll)
type: Materiaal leiding (coll)
type: Materiaal put (coll)
type: Materiaal lining (coll)

Metselwerk
author of change: Marinus Vonhof
date of change: 2025-01-16
definition: [IMBOR] Stenen die met cement of een variant daarop aan elkaar verbonden zijn.
notation: METSELWERK
notation: MSW
author at start life: Marinus Vonhof
author at start life: Johan Post
date of start life: 2022-10-03
date of start life: 2026-05-21
validity context: 1d 3d 10d 12d 14d
type: Materiaal leiding (coll)
type: Materiaal put (coll)

Metselwerk (baksteen)
label: Brickwork @en
author of change: Marinus Vonhof
date of change: 2025-01-16
definition: [IMBOR] Gebakken klinkers die met cement of een variant daarop aan elkaar verbonden zijn.
notation: MSW
notation: AD
type: Materiaal leiding (coll)
type: Materiaal put (coll)

Metselwerk (bepleisterd)
label: Masonry (coursed) @en
author of change: Marinus Vonhof
date of change: 2025-01-16
definition: [IMBOR] Gebakken klinkers die met cement of een variant daarop aan elkaar verbonden zijn en waar een pleisterlaag (een smeerbaar materiaal ten behoeve van de afwerking) op is aangebracht.
notation: MSW
notation: AR
type: Materiaal leiding (coll)
type: Materiaal put (coll)

Metselwerk (onbepleisterd)
label: Masonry (uncoursed) @en
author of change: Marinus Vonhof
date of change: 2025-01-16
definition: [IMBOR] Gebakken klinkers die met cement of een variant daarop aan elkaar verbonden zijn en waar geen pleisterlaag (een smeerbaar materiaal ten behoeve van de afwerking) op is aangebracht.
notation: MSW
notation: AS
type: Materiaal leiding (coll)
type: Materiaal put (coll)

Plaatijzer
author of change: Marinus Vonhof
date of change: 2025-01-16
definition: [IMBOR] IJzer dat in de vorm van een plaat is gedrukt.
notation: PIJ
type: Materiaal leiding (coll)

Zwavelbeton
definition: een betonsoort waarbij het aandeel cement en water vervangen is door gemodificeerd zwavel als bindmiddel. Dit geeft een CO2 reductie en maakt het geschikt voor chemisch agressieve omgevingen
author at start life: Johan Post
date of start life: 2026-07-02
type: Materiaal leiding (coll)
type: Materiaal put (coll)

Mergel
definition: [IMBOR] Een sedimentair gesteente dat voor 25-75% uit kalk bestaat en voor het restant uit klei.
author at start life: Johan Post
date of start life: 2026-05-04
type: Materiaal leiding (coll)
type: Materiaal put (coll)

Bedrijven
alternative label: Werkgebied
type: Type bebouwing (coll)

Winkels
alternative label: Winkelgebied
type: Type bebouwing (coll)

Woningen
alternative label: Woongebied
type: Type bebouwing (coll)

Cilindrische vorm
type: Structuur

Gesloten
type: Structuur

Braak terrein
alternative label: Bouwland
type: Inrichting bovengrond (coll)

In de weg
type: Inrichting bovengrond (coll)

In de wegkant
type: Inrichting bovengrond (coll)

Openbaar groen
type: Inrichting bovengrond (coll)

Trottoir / fietspad
type: Inrichting bovengrond (coll)

Particuliere grond
type: Inrichting bovengrond (coll)

Buiten gebruik
author of change: Marinus Vonhof
date of change: 2025-01-16
definition: [IMBOR] Statusbeschrijving die aangeeft dat een object niet bruikbaar is voor zijn gebruikelijke functie.
type: Status functioneren (coll)

In aanleg
author of change: Marinus Vonhof
date of change: 2025-01-16
definition: [IMBOR] Statusbeschrijving die aangeeft dat een object zich bevindt in het proces van realisatie.
type: Status functioneren (coll)

In gebruik
author of change: Marinus Vonhof
date of change: 2025-01-16
definition: [IMBOR] Het object is een actualiteit in de werkelijkheid.
notation: ACT
type: Status functioneren (coll)

In ontwerp
author of change: Marinus Vonhof
date of change: 2025-01-16
definition: [IMBOR] Het object is planmatig geschapen, maar nog niet gerealiseerd in de werkelijkheid.
notation: ONT
type: Status functioneren (coll)

Geïnstalleerde capaciteit
author of change: Johan Post
date of change: 2022-09-29
definition: De bij de aanleg geïnstalleerde capaciteit
author at start life: Johan Post
date of start life: 2022-05-03
type: Wijze van afleiden (coll)

Gemeten capaciteit
definition: Afvoercapaciteit op basis van metingen
author at start life: Johan Post
date of start life: 2022-05-03
type: Wijze van afleiden (coll)

Normcapaciteit
definition: Afgesproken bovengrens voor de afvoercapaciteit
author at start life: Johan Post
date of start life: 2022-05-03
type: Wijze van afleiden (coll)

Ontwerpcapaciteit
definition: Afvoercapaciteit op basis van het ontwerp
author at start life: Johan Post
date of start life: 2022-05-03
type: Wijze van afleiden (coll)

Datatransport (thema)
author of change: Marinus Vonhof
date of change: 2025-01-07
see also: [IMKL: 1.1/2008] De elektronische overdracht van signaalinformatie tussen punten via kabels die deel uitmaken van een net. NB: De aansluitleiding kan ook alleen op (huis)aansluitschetsen voorkomen.
alternative label: Datatransport
type: WIBON thema (coll)

Hoogspanning (thema)
author of change: Marinus Vonhof
date of change: 2025-01-07
see also: [IMKL: 1.1/2008] Toestand waarin het mogelijk is een elektrische stroom te creëren; HS = hoogspanning (36 tot en met 220 kV). Opmerking: In de praktijk kunnen netten vanaf 20 kV t/m 220 kV op de HS themakaart voorkomen.
alternative label: Hoogspanning
type: WIBON thema (coll)

Laagspanning (thema)
author of change: Marinus Vonhof
date of change: 2025-01-07
definition: NB: De aansluitleiding kan ook alleen op (huis)aansluitschetsen voorkomen. Opmerking: In de praktijk kunnen netten tot en met 1000 Volt op de LS themakaart voorkomen.
see also: [IMKL: 1.1/2008] LS kabel bestaat uit hoofdnet en aansluitnet. LS = laagspanning (230 V en 400 V)
alternative label: Laagspanning
type: WIBON thema (coll)

Middenspanning (thema)
author of change: Marinus Vonhof
date of change: 2025-01-07
definition: NB: De aansluitleiding kan ook alleen op (huis)aansluitschetsen voorkomen. Opmerking: In de praktijk kunnen netten van 400 Volt op de MS themakaart voorkomen.
see also: [IMKL: 1.1/2008] MS kabel bestaat uit hoofdnet en aansluitnet. MS = middenspanning (0,4 kV tot 30 kV)
alternative label: Middenspanning
type: WIBON thema (coll)

Riool onder druk (thema)
author of change: Marinus Vonhof
date of change: 2025-01-07
see also: [IMKL: 1.1/2008] Riolering waarbij het transport plaatsvindt door overdruk (uit NEN 3300, Buitenriolering).
alternative label: RioolOnderOverOfOnderdruk
type: WIBON thema (coll)

Riool vrijverval (thema)
author of change: Marinus Vonhof
date of change: 2025-01-07
see also: [IMKL: 1.1/2008] Riool waardoor afvalwater door de zwaartekracht wordt getransporteerd (uit NEN 3300, Buitenriolering).
alternative label: RioolVrijverval
type: WIBON thema (coll)

Wees (thema)
author of change: Marinus Vonhof
date of change: 2025-01-07
see also: [IMKL: 1.1/2008] Alle onbekende leidingen welke bij een eerdere grondroering zijn geconstateerd, die ook na onderzoek niet aan een beheerder waren toe te wijzen en waarvoor de gemeente ingevolge de WIBON de beheerdersverplichtingen vervult.
alternative label: Wees
type: WIBON thema (coll)

Samenloop
author of change: Marinus Vonhof
date of change: 2025-01-16
definition: [IMBOR] Een pomp die niet zelfstandig en juist tegelijk met andere pompen werkt.
type: Pompschakeling (coll)