Deelmodel HydX, filter collectie_HDXHYDTOP_v1.7
type: Ontology
version info: Deelmodel HydX, filter op CoFs HDX HYD TOP, versie=1.7 (2026-08-25T17:14:27)

has as aspect
type: ObjectProperty

has as output (inverse)
type: ObjectProperty
inverse of: has as output

has as aspect (inverse)
type: ObjectProperty
inverse of: has as aspect

has as reference (qualification)
type: ObjectProperty
type: FunctionalProperty

has as part (inverse)
type: ObjectProperty
inverse of: has as part

has as input
type: ObjectProperty

has as output
type: ObjectProperty

has as part
type: ObjectProperty

is connected to
type: ObjectProperty
type: SymmetricProperty

heeft Functie
type: ObjectProperty
range: Functie

has as input (inverse)
type: ObjectProperty
inverse of: has as input

heeft Doel
validity context: 6d
type: ObjectProperty
range: Doel

is represented by
author of change: Marinus Vonhof
date of change: 2026-07-23
comment: Vanaf versie 1.7.0 is deze relatie niet meer functioneel. Documentatie is representatie ipv kenmerk geworden, daarmee kan een subject meerdere representaties (symbool, revisietekening) hebben.
type: ObjectProperty

heeft Uitvoering
validity context: 6d
type: ObjectProperty
range: Uitvoering

heeft Technologie
validity context: 6d
type: ObjectProperty
range: Technologie

heeft Mechanisme
validity context: 6d
type: ObjectProperty
range: Mechanisme

heeft Toepassing
validity context: 6d
type: ObjectProperty
range: Toepassing

heeft Structuur
validity context: 6d
type: ObjectProperty
range: Structuur

is represented by (inverse)
type: ObjectProperty
inverse of: is represented by

author of change
type: AnnotationProperty
range: string

date of change
type: AnnotationProperty
range: date

author at start life
type: AnnotationProperty
range: string

date of start life
type: AnnotationProperty
range: date

units of measurements
type: AnnotationProperty

validity context
type: AnnotationProperty

has as value
type: FunctionalProperty
type: DatatypeProperty

Aantal woningen (datatype)
type: Datatype
equivalent class: Datatype
  on datatype: integer
  with restrictions:
    min inclusive: 0
  with restrictions:
    max inclusive: 9999

Afvloeiingscoëfficiënt (datatype)
type: Datatype
equivalent class: Datatype
  on datatype: decimal
  with restrictions:
    min inclusive: 0
  with restrictions:
    max inclusive: 1

Afvoercoëfficiënt (datatype)
type: Datatype
equivalent class: Datatype
  on datatype: decimal
  with restrictions:
    min inclusive: 0
  with restrictions:
    max inclusive: 99

Breedte bouwwerk (datatype)
type: Datatype
equivalent class: Datatype
  on datatype: integer
  with restrictions:
    min inclusive: 500
  with restrictions:
    max inclusive: 10000

Breedte leiding (datatype)
type: Datatype
equivalent class: Datatype
  on datatype: integer
  with restrictions:
    min inclusive: 63
  with restrictions:
    max inclusive: 4000

Breedte put (datatype)
type: Datatype
equivalent class: Datatype
  on datatype: integer
  with restrictions:
    min inclusive: 300
  with restrictions:
    max inclusive: 4000

Continue lozing (datatype)
type: Datatype
equivalent class: Datatype
  on datatype: decimal
  with restrictions:
    min inclusive: 1
  with restrictions:
    max inclusive: 99999

Contractiecoëfficiënt doorlaatprofiel (datatype)
type: Datatype
equivalent class: Datatype
  on datatype: decimal
  with restrictions:
    min inclusive: 0
  with restrictions:
    max inclusive: 99999

Dakoppervlak hellend (datatype)
type: Datatype
equivalent class: Datatype
  on datatype: decimal
  with restrictions:
    min inclusive: 0
  with restrictions:
    max inclusive: 999999

Dakoppervlak vlak (datatype)
type: Datatype
equivalent class: Datatype
  on datatype: decimal
  with restrictions:
    min inclusive: 0
  with restrictions:
    max inclusive: 999999

Dakoppervlak vlak uitgestrekt (datatype)
type: Datatype
equivalent class: Datatype
  on datatype: decimal
  with restrictions:
    min inclusive: 0
  with restrictions:
    max inclusive: 999999

Diameter leiding (datatype)
type: Datatype
equivalent class: Datatype
  on datatype: integer
  with restrictions:
    min inclusive: 63
  with restrictions:
    max inclusive: 4000

Diameter put (datatype)
type: Datatype
equivalent class: Datatype
  on datatype: integer
  with restrictions:
    min inclusive: 300
  with restrictions:
    max inclusive: 4000

Gesloten verhard oppervlak hellend (datatype)
type: Datatype
equivalent class: Datatype
  on datatype: decimal
  with restrictions:
    min inclusive: 0
  with restrictions:
    max inclusive: 999999

Gesloten verhard oppervlak vlak (datatype)
type: Datatype
equivalent class: Datatype
  on datatype: decimal
  with restrictions:
    min inclusive: 0
  with restrictions:
    max inclusive: 999999

Gesloten verhard oppervlak vlak uitgestrekt (datatype)
type: Datatype
equivalent class: Datatype
  on datatype: decimal
  with restrictions:
    min inclusive: 0
  with restrictions:
    max inclusive: 999999

Hoogte bouwwerk (datatype)
type: Datatype
equivalent class: Datatype
  on datatype: integer
  with restrictions:
    min inclusive: 500
  with restrictions:
    max inclusive: 10000

Hoogte leiding (datatype)
type: Datatype
equivalent class: Datatype
  on datatype: integer
  with restrictions:
    min inclusive: 63
  with restrictions:
    max inclusive: 4000

Hoogte put (datatype)
type: Datatype
equivalent class: Datatype
  on datatype: integer
  with restrictions:
    min inclusive: 500
  with restrictions:
    max inclusive: 4000

Lengte bouwwerk (datatype)
type: Datatype
equivalent class: Datatype
  on datatype: integer
  with restrictions:
    min inclusive: 500
  with restrictions:
    max inclusive: 10000

Lengte leiding (datatype)
type: Datatype
equivalent class: Datatype
  on datatype: decimal
  with restrictions:
    min inclusive: 1
  with restrictions:
    max inclusive: 75

Lengte put (datatype)
type: Datatype
equivalent class: Datatype
  on datatype: integer
  with restrictions:
    min inclusive: 300
  with restrictions:
    max inclusive: 4000

Maximale capaciteit doorlaat (datatype)
type: Datatype
equivalent class: Datatype
  on datatype: decimal
  with restrictions:
    min inclusive: 0
  with restrictions:
    max inclusive: 99999

Onverhard oppervlak hellend (datatype)
type: Datatype
equivalent class: Datatype
  on datatype: decimal
  with restrictions:
    min inclusive: 0
  with restrictions:
    max inclusive: 999999

Onverhard oppervlak vlak (datatype)
type: Datatype
equivalent class: Datatype
  on datatype: decimal
  with restrictions:
    min inclusive: 0
  with restrictions:
    max inclusive: 999999

Onverhard oppervlak vlak uitgestrekt (datatype)
type: Datatype
equivalent class: Datatype
  on datatype: decimal
  with restrictions:
    min inclusive: 0
  with restrictions:
    max inclusive: 999999

Open verhard oppervlak hellend (datatype)
type: Datatype
equivalent class: Datatype
  on datatype: decimal
  with restrictions:
    min inclusive: 0
  with restrictions:
    max inclusive: 999999

Open verhard oppervlak vlak (datatype)
type: Datatype
equivalent class: Datatype
  on datatype: decimal
  with restrictions:
    min inclusive: 0
  with restrictions:
    max inclusive: 999999

Open verhard oppervlak vlak uitgestrekt (datatype)
type: Datatype
equivalent class: Datatype
  on datatype: decimal
  with restrictions:
    min inclusive: 0
  with restrictions:
    max inclusive: 999999

Porositeit (datatype)
type: Datatype
equivalent class: Datatype
  on datatype: decimal
  with restrictions:
    min inclusive: 0
  with restrictions:
    max inclusive: 99

X-coördinaat (datatype)
type: Datatype
equivalent class: Datatype
  on datatype: decimal
  with restrictions:
    min inclusive: -7000
  with restrictions:
    max inclusive: 300000

Y-coördinaat (datatype)
type: Datatype
equivalent class: Datatype
  on datatype: decimal
  with restrictions:
    min inclusive: 289000
  with restrictions:
    max inclusive: 629000

Z-coördinaat (datatype)
type: Datatype
equivalent class: Datatype
  on datatype: decimal
  with restrictions:
    min inclusive: -20
  with restrictions:
    max inclusive: 325

Vorm leiding
label: Shape @en
author of change: Marinus Vonhof
date of change: 2015-05-29
definition: [EN13508-2+A1] The shape of the cross-section of the pipeline as follows @en
notation: ACA
notation: GCA
author at start life: Marinus Vonhof
date of start life: 2012-05-01
comment: Intrinsiek aspect
comment: [is aspect]
scope note: Cof TOP
type: Class
subclass of: Vorm
subclass of: Restriction
  author of change: Marinus Vonhof
  date of change: 2015-10-31
  author at start life: Finy Teitsma (Oranjewoud)
  date of start life: 2006-02-25
  validity context: *t
  on class: Leiding
  on property: has as aspect (inverse)
  max qualified cardinality: 1
subclass of: Restriction
  author at start life: Marinus Vonhof
  date of start life: 2015-10-30
  on class: Inwinning
  on property: has as aspect
  max qualified cardinality: 1
subclass of: Restriction
  on property: has as reference (qualification)
  all values from: Vorm leiding (coll)

Hoogte leiding
label: Height @en
author of change: Marinus Vonhof
date of change: 2019-01-24
definition: De bij het materiaal gebruikelijke aanduiding van de hoogte van een leiding (zie diameter leiding)
definition: [EN13508-2+A1] The height of the section in millimetres @en
notation: ACB
notation: GCB
author at start life: Marinus Vonhof
date of start life: 2011-12-15
units of measurements: mm
comment: Intrinsiek aspect
comment: [is aspect]
scope note: Cof TOP
type: Class
subclass of: Hoogte
subclass of: Restriction
  author of change: Marinus Vonhof
  date of change: 2014-12-03
  author at start life: Marinus Vonhof
  date of start life: 2011-12-15
  validity context: *t
  on class: Leiding
  on property: has as aspect (inverse)
  max qualified cardinality: 1
subclass of: Restriction
  author at start life: Marinus Vonhof
  date of start life: 2024-05-16
  on class: Inwinning
  on property: has as aspect
  max qualified cardinality: 1
subclass of: Restriction
  on property: has as value
  all values from: Hoogte leiding (datatype)

Breedte leiding
label: Width @en
author of change: Marinus Vonhof
date of change: 2019-01-24
definition: De bij het materiaal gebruikelijke aanduiding van de breedte van een leiding (zie diameter leiding)
definition: [EN13508-2+A1] The width of the section in millimetres. (Not required where both dimensions are the same -e.g. circle) @en
notation: ACC
notation: GCC
author at start life: Marinus Vonhof
date of start life: 2013-09-17
units of measurements: mm
comment: Intrinsiek aspect
comment: [is aspect]
scope note: Cof TOP
type: Class
subclass of: Breedte
subclass of: Restriction
  author of change: Marinus Vonhof
  date of change: 2015-05-29
  author at start life: Marinus Vonhof
  date of start life: 2011-12-15
  validity context: *t
  on class: Leiding
  on property: has as aspect (inverse)
  max qualified cardinality: 1
subclass of: Restriction
  author at start life: Marinus Vonhof
  date of start life: 2024-05-16
  on class: Inwinning
  on property: has as aspect
  max qualified cardinality: 1
subclass of: Restriction
  on property: has as value
  all values from: Breedte leiding (datatype)

Materiaal leiding
label: Material sewer @en
author of change: Johan Post
date of change: 2022-09-29
definition: De bouwstof van de leiding
definition: [EN13508-2+A1] The material of the fabric of the sewer, in accordance with Table C.4. Where the pipeline has been lined the material recorded is the material of the original pipeline @en
notation: ACD
notation: GCD
author at start life: Marinus Vonhof
date of start life: 2013-09-17
comment: Intrinsiek aspect
alternative label: Leidingmateriaal
comment: [is aspect]
scope note: Cof TOP
type: Class
subclass of: Materiaal
subclass of: Restriction
  author of change: Marinus Vonhof
  date of change: 2015-06-01
  author at start life: Finy Teitsma (Oranjewoud)
  date of start life: 2006-02-25
  validity context: *t
  on class: Leiding
  on property: has as aspect (inverse)
  max qualified cardinality: 1
subclass of: Restriction
  on property: has as reference (qualification)
  all values from: Materiaal leiding (coll)
subclass of: Restriction
  on class: Inwinning
  on property: has as aspect
  max qualified cardinality: 1

Wijze van inwinning (coll)
author of change: Johan Post
date of change: 2022-11-25
comment: [is coll]
scope note: Cof TOP
type: Class
subclass of: Verzameling soorten
subclass of: Class
  one of: Grondradar
  one of: Afgeleid
  one of: Niet kunnen achterhalen
  one of: Objecttype niet kunnen achterhalen
  one of: Basisregistratie Adressen en Gebouwen (BAG)
  one of: Inmeting
  one of: Inspectie
  one of: CBS
  one of: Luchtfoto
  one of: BGT
  one of: GBKN
  one of: AHN
  one of: AHN1
  one of: AHN2
  one of: AHN3
  one of: AHN4
  one of: GNSS Landmeting
  one of: GNSS Vanuit wagen
  one of: LIDAR 3D
  one of: Plan/Ontwerp
  one of: Revisie
  one of: Sensor (inwinning)
  one of: Schatting
  one of: Aantal i.e.

Technologie
author of change: Marinus Vonhof
date of change: 2021-01-09
definition: Bij activiteit: werkwijze, eisen
author at start life: Nic Roest (Idoro)
date of start life: 2008-03-11
validity context: 6d
comment: Onderscheidend kenmerk
comment: [is aspect]
scope note: Cof TOP
type: Class
subclass of: Onderscheidend kenmerk

Uitvoering
author of change: Marinus Vonhof
date of change: 2021-01-09
definition: Materiaal, afwerking, vorm
author at start life: Nic Roest (Idoro)
date of start life: 2008-03-11
validity context: 6d
comment: Onderscheidend kenmerk
comment: [is aspect]
scope note: Cof TOP
type: Class
subclass of: Onderscheidend kenmerk

Datum
author of change: Marinus Vonhof
date of change: 2025-01-16
date of change: 2017-11-16
definition: [IMBOR] Aanduiding van een bepaalde dag volgens een kalender.
author at start life: Marinus Vonhof
date of start life: 2015-02-28
units of measurements: yyyy-mm-dd
comment: [is aspect]
scope note: Cof TOP
type: Class
subclass of: Kenmerk
subclass of: Restriction
  on property: has as value
  all values from: date

Afstand
author of change: Marinus Vonhof
date of change: 2015-02-28
author at start life: Nic Roest (Idoro)
date of start life: 2006-03-03
comment: [is aspect]
scope note: Cof TOP
type: Class
subclass of: Kenmerk

Aansluiting
author of change: Marinus Vonhof
date of change: 2018-10-17
definition: Het geheel van overdrachtspunt, leiding en inlaat voor de aanvoer van afvalwater
author at start life: Marinus Vonhof
date of start life: 2015-02-28
validity context: 3d 5d 10f 11d 13d 14f 15d
scope note: Cof TOP
type: Class
subclass of: Fysiek object
subclass of: Restriction
  author of change: Marinus Vonhof
  date of change: 2016-04-22
  author at start life: Marinus Vonhof
  date of start life: 2014-03-15
  on class: Vrijverval rioolstelsel
  on property: has as part (inverse)
  qualified cardinality: 1
subclass of: Restriction
  author at start life: Marinus Vonhof
  date of start life: 2019-05-15
  on class: Ondergrond
  on property: has as part (inverse)
  max qualified cardinality: 1
subclass of: Restriction
  author at start life: Marinus Vonhof
  date of start life: 2019-05-15
  on class: Straat
  on property: has as part (inverse)
  max qualified cardinality: 1
subclass of: Restriction
  author at start life: Marinus Vonhof
  date of start life: 2019-05-15
  on class: Goot
  on property: has as part
  min qualified cardinality: 0
subclass of: Restriction
  author at start life: Marinus Vonhof
  date of start life: 2022-10-02
  on class: Verbindingsstuk
  on property: has as part
  min qualified cardinality: 0
subclass of: Restriction
  author at start life: Marinus Vonhof
  date of start life: 2024-07-16
  on class: Maaiveldoriëntatie
  on property: is connected to
  max qualified cardinality: 1
subclass of: Restriction
  on property: heeft Functie
  has value: Aanvoer van afvalwater

Maatregel
author of change: Marinus Vonhof
date of change: 2018-12-10
definition: [IRIS-RIOKEN:2012] Activiteiten die worden uitgevoerd ter verbetering van werken
author at start life: Marinus Vonhof
date of start life: 2013-03-26
validity context: 1f 3f 5d 10f 11d 12f 14f
scope note: Cof TOP
type: Class
subclass of: Activiteit
subclass of: Restriction
  author of change: Marinus Vonhof
  date of change: 2018-05-01
  author at start life: Marinus Vonhof
  date of start life: 2013-03-26
  validity context: 1t 3t 12t
  on class: Datum maatregel
  on property: has as aspect
  max qualified cardinality: 1

Aanname HydX
author of change: Marinus Vonhof
date of change: 2019-05-13
author at start life: Marinus Vonhof
date of start life: 2017-07-25
see also: [HYD] Aanname door de modelleur van noodzakelijke gegevens voor de hydraulische modellering.
comment: [is aspect]
scope note: Cof HDX
type: Class
subclass of: Kenmerk
subclass of: Restriction
  on property: has as reference (qualification)
  all values from: Aanname HydX (coll)

Kenmerk
author of change: Marinus Vonhof
author of change: Wouter van Riel
date of change: 2024-04-22
date of change: 2017-11-16
definition: Eigenschap van iets
definition: [Gellish] Is an individual object that is a phenomenon that is possessed by a totality and cannot exist without the existence of its possessor. It is an intrinsic, non-separable facet of its possessor @en
author at start life: Marinus Vonhof
date of start life: 2013-09-03
validity context: *f
scope note: Cof TOP
type: Class

Aanname HydX (coll)
comment: [is coll]
scope note: Cof HDX
type: Class
subclass of: Verzameling soorten
subclass of: Class
  one of: Expert judgement
  one of: Conform ontwerp
  one of: Conform norm

Verzameling soorten
author of change: Marinus Vonhof
date of change: 2017-11-16
author at start life: Marinus Vonhof
date of start life: 2014-07-11
comment: collection of qualitative aspects is specialisatie van collection of classes
alternative label: Collectie kenmerkwaarden
alternative label: Domeinwaarden
alternative label: Verzameling kenmerkwaarden
scope note: Cof TOP
type: Class

Activiteit
author of change: Marinus Vonhof
date of change: 2025-01-16
date of change: 2016-09-16
definition: [Gellish] Is a deed (a performance by changing a state of affairs) by carrying out an action or pattern of behavior. @en
definition: [IMBOR] Iets dat mogelijk of daadwerkelijke gebeurt in ruimte en tijd.
author at start life: Marinus Vonhof
date of start life: 2011-12-02
validity context: 1f 3f 5d 6d 10f 11d 12f 14f 15d
scope note: Cof TOP
type: Class

Functie
author of change: Marinus Vonhof
date of change: 2025-01-16
date of change: 2021-01-09
definition: Wat doet het
definition: [IMBOR] Een activiteit die het externe gedrag beschrijft van het object die de activiteit uitvoert.
author at start life: Marinus Vonhof
date of start life: 2013-09-03
comment: Onderscheidend kenmerk
comment: [is aspect]
scope note: Cof TOP
type: Class
subclass of: Onderscheidend kenmerk

Doel
author of change: Marinus Vonhof
date of change: 2021-01-09
definition: Bij activiteit: wat te bereiken
author at start life: Marinus Vonhof
date of start life: 2014-04-29
validity context: 6d
comment: Onderscheidend kenmerk
comment: [is aspect]
scope note: Cof TOP
type: Class
subclass of: Onderscheidend kenmerk

Aanslagniveau
author of change: Marinus Vonhof
date of change: 2018-05-03
definition: [NEN 3300:1996] Peil waarop een pomp in werking treedt
author at start life: Nic Roest (Idoro)
date of start life: 2006-02-21
units of measurements: m
see also: [IRIS-RIOKEN:2012] Ingesteld peil in de pompkelder van rioolgemaal. Als de pompkelder tot aan het inslagpeil is gevuld, wordt een pomp gestart om de kelder weer leeg te pompen.
alternative label: Inslagpeil
comment: [is aspect]
scope note: Cof MDS
scope note: Cof HYD
scope note: Cof RGM
type: Class
subclass of: Hoogte t.o.v. NAP
subclass of: Restriction
  on property: has as value
  all values from: decimal

Hoogte t.o.v. NAP
author of change: Marinus Vonhof
author of change: Eric van Gorkom
date of change: 2015-05-29
date of change: 2024-05-13
date of change: 2024-05-20
date of change: 2024-07-12
definition: Conform coordinatenstelsel EPSG:5709
definition: Hoogte aangegeven t.o.v. NAP
author at start life: Nic Roest (Idoro)
date of start life: 2006-02-21
units of measurements: m
alternative label: Normaal Amsterdams Peil
comment: [is aspect]
scope note: Cof TOP
type: Class
subclass of: Kenmerk
subclass of: Restriction
  on property: has as value
  all values from: Z-coördinaat (datatype)

Aanslagniveau benedenstrooms
author of change: Marinus Vonhof
date of change: 2018-05-03
definition: Aanslagniveau aan de uitlaatzijde van de pomp(en)
author at start life: Marinus Vonhof
date of start life: 2013-02-05
units of measurements: m
alternative label: Aanslagniveau stroomafwaarts
comment: [is aspect]
scope note: Cof HYD
scope note: Cof RGM
type: Class
subclass of: Aanslagniveau
subclass of: Restriction
  author of change: Marinus Vonhof
  date of change: 2016-04-23
  author at start life: Marinus Vonhof
  date of start life: 2013-02-05
  on class: Pomp
  on property: has as aspect (inverse)
  max qualified cardinality: 1
subclass of: Restriction
  on property: has as value
  all values from: decimal

Pomp
author of change: Marinus Vonhof
author of change: Johan Post
date of change: 2017-08-31
date of change: 2024-04-30
definition: Een technische installatie die het afvalwater onder druk transporteert.
notation: PMP
author at start life: Finy Teitsma (Oranjewoud)
date of start life: 2007-10-23
validity context: 1d 10d 12d
see also: Vervallen link: https://imgeo.geostandaarden.nl/def/imgeo-object/installatie/pomp-niet-bgt
see also: [IHW:20130706] Werktuig dat door middel van een verschil in druk vloeistoffen of gassen verplaatst
see also: [IMGeo:1.0/2007] Werktuig dat door middel van een verschil in druk vloeistoffen of gassen verplaatst.
see also: [IRIS-RIOKEN:2012] Werktuig dat door middel van een verschil in druk vloeistoffen of gassen verplaatst.
alternative label: Pomp (type installatie)
scope note: Cof MDS
scope note: Cof REV
scope note: Cof HYD
scope note: Cof RGM
scope note: Cof DMO
type: Class
subclass of: Constructieonderdeel
subclass of: Restriction
  author of change: Marinus Vonhof
  date of change: 2016-04-15
  author at start life: Finy Teitsma (Oranjewoud)
  date of start life: 2006-02-25
  on class: Pompput
  on property: has as part (inverse)
  max qualified cardinality: 1
subclass of: Restriction
  author of change: Marinus Vonhof
  date of change: 2017-08-19
  author at start life: Finy Teitsma (Oranjewoud)
  date of start life: 2006-02-25
  on class: Gemaal
  on property: has as part (inverse)
  max qualified cardinality: 1
subclass of: Restriction
  author of change: Marinus Vonhof
  date of change: 2016-04-13
  author at start life: Marinus Vonhof
  date of start life: 2015-05-29
  on class: Ledigingsvoorziening
  on property: has as part (inverse)
  max qualified cardinality: 1
subclass of: Restriction
  author of change: Marinus Vonhof
  date of change: 2016-04-23
  author at start life: Marinus Vonhof
  date of start life: 2013-02-05
  validity context: 11t 14t
  on class: Aanslagniveau benedenstrooms
  on property: has as aspect
  max qualified cardinality: 1
subclass of: Restriction
  author of change: Marinus Vonhof
  date of change: 2016-04-23
  author at start life: Marinus Vonhof
  date of start life: 2013-02-05
  validity context: 11t 14t
  on class: Afslagniveau benedenstrooms
  on property: has as aspect
  max qualified cardinality: 1
subclass of: Restriction
  author of change: Marinus Vonhof
  date of change: 2017-08-31
  author at start life: Marinus Vonhof
  date of start life: 2011-12-15
  validity context: 11t 14t
  on class: Aanslagniveau bovenstrooms
  on property: has as aspect
  max qualified cardinality: 1
subclass of: Restriction
  author of change: Marinus Vonhof
  date of change: 2017-08-31
  author at start life: Marinus Vonhof
  date of start life: 2011-12-15
  validity context: 11t 14t
  on class: Afslagniveau bovenstrooms
  on property: has as aspect
  max qualified cardinality: 1
subclass of: Restriction
  author of change: Marinus Vonhof
  date of change: 2018-05-03
  author at start life: Marinus Vonhof
  date of start life: 2012-04-22
  validity context: 5t 11t 14t
  on class: Onderdeeloriëntatie
  on property: has as aspect
  max qualified cardinality: 1
subclass of: Restriction
  author of change: Marinus Vonhof
  date of change: 2018-05-03
  author at start life: Marinus Vonhof
  date of start life: 2013-02-05
  on class: Compartiment
  on property: has as part (inverse)
  max qualified cardinality: 1
subclass of: Restriction
  author of change: Marinus Vonhof
  date of change: 2018-12-12
  author at start life: Marinus Vonhof
  date of start life: 2011-12-15
  validity context: 5t 11t 14t
  comment: Temporeel kenmerk, met kenmerk Inwinning
  on class: Pompcapaciteit
  on property: has as aspect
  min qualified cardinality: 0
subclass of: Restriction
  author at start life: Marinus Vonhof
  date of start life: 2014-04-29
  on class: Bijzondere putconstructie
  on property: has as part (inverse)
  max qualified cardinality: 1
subclass of: Restriction
  on property: heeft Technologie
  has value: Door middel van drukverschil
subclass of: Restriction
  on property: heeft Technologie
  has value: Mechanisch
subclass of: Restriction
  on property: heeft Functie
  has value: Verplaatsen van water
subclass of: Restriction
  on class: Overstortbemaling
  on property: has as part (inverse)
  max qualified cardinality: 1

Aanslagniveau bovenstrooms
author of change: Marinus Vonhof
date of change: 2018-05-03
definition: Aanslagniveau aan de inlaatzijde van de pomp(en)
author at start life: Marinus Vonhof
date of start life: 2013-02-05
units of measurements: m
alternative label: Aanslagniveau stroomopwaarts
comment: [is aspect]
scope note: Cof HYD
scope note: Cof RGM
type: Class
subclass of: Aanslagniveau
subclass of: Restriction
  author of change: Marinus Vonhof
  date of change: 2017-08-31
  author at start life: Marinus Vonhof
  date of start life: 2011-12-15
  on class: Pomp
  on property: has as aspect (inverse)
  max qualified cardinality: 1
subclass of: Restriction
  on property: has as value
  all values from: decimal

Toepassing
author of change: Marinus Vonhof
date of change: 2021-01-09
definition: Proces waarin iets gebruikt wordt, waarom
author at start life: Nic Roest (Idoro)
date of start life: 2008-03-11
validity context: 6d
comment: Onderscheidend kenmerk
comment: [is aspect]
scope note: Cof TOP
type: Class
subclass of: Onderscheidend kenmerk

Fysiek object
label: Physical object @en
author of change: Eric van Gorkom
date of change: 2021-10-01
definition: [Gellish] That is a distribution of matter or energy in time and space that satisfies the laws of physics. All kinds of physical objects are subtypes of this class. It is the top of the hierarchical network of specializations of kinds of physical objects. @en
definition: [NEN 2660] Een object dat bestaat of kan bestaan binnen de fysieke 4D ruimte-tijd. Het vormt een manifestatie en een afbakening van materie en/of energie, en is (in)direct waarneembaar door de zintuigen.
author at start life: Marinus Vonhof
date of start life: 2013-09-03
validity context: *f
scope note: Cof TOP
type: Class
subclass of: Restriction
  author at start life: Marinus Vonhof
  date of start life: 2013-09-28
  validity context: 14t 15t
  on class: Begindatum
  on property: has as aspect
  max qualified cardinality: 1
subclass of: Restriction
  author at start life: Marinus Vonhof
  date of start life: 2013-09-28
  on class: Einddatum
  on property: has as aspect
  max qualified cardinality: 1
subclass of: Restriction
  on property: has as part
  all values from: Class
    union of: Ruimte
    union of: Fysiek object
disjoint with: Ruimte

Vrijverval rioolstelsel
label: Name of sewer system @en
author of change: Marinus Vonhof
author of change: Johan Post
author of change: Eric van Gorkom
author of change: Wouter van Riel
date of change: 2026-05-01
date of change: 2024-04-22
date of change: 2026-07-17
date of change: 2024-05-13
definition: Een rioolstelsel waarbij het transport door middel van de zwaartekracht plaatsvindt
definition: [EN13508-2+A1] The name of the sewer system, or a sewer system reference as specified by the employing authority @en
definition: [NEN-EN 752:2008] systeem van aansluitleidingen of een buitenriolering waarin het afvalwater door de zwaartekracht wordt getransporteerd en waar de leiding is ontworpen om onder normale omstandigheden deels gevuld te zijn [EN 1085:2007, definitie 2260]
notation: AAP
notation: CAP
notation: GAP
notation: JAP
author at start life: Finy Teitsma (Oranjewoud)
date of start life: 2006-02-17
validity context: *f
comment: 20151014: NEN3300-definitie aangepast
alternative label: Stelsel onder vrij verval
scope note: Cof TOP
type: Class
subclass of: Rioolstelsel
subclass of: Restriction
  author of change: Marinus Vonhof
  date of change: 2016-04-22
  author at start life: Marinus Vonhof
  date of start life: 2014-03-15
  comment: 20160415: Inverse = optioneel, niet elke specialisatie zit in vv stelsel
  on class: Aansluiting
  on property: has as part
  min qualified cardinality: 1
subclass of: Restriction
  author at start life: Johan Post
  date of start life: 2026-05-01
  on class: Vrijverval transportleiding
  on property: has as part
  min qualified cardinality: 0
subclass of: Restriction
  author at start life: Marinus Vonhof
  date of start life: 2023-01-13
  on class: Doorspoelput
  on property: has as part
  min qualified cardinality: 0
subclass of: Restriction
  on property: heeft Functie
  has value: Tijdelijke berging van afvalwater
subclass of: Restriction
  on property: heeft Technologie
  has value: Transport door de zwaartekracht

Ondergrond
author at start life: Marinus Vonhof
date of start life: 2013-10-05
validity context: 1d 3d 5d 10d 11d 12d 14d 16d
comment: De ruimte 'ondergrond' bevat leiding/put, via ondergrond verwijzen naar grondsoort enz
alternative label: Bodem
scope note: Cof TOP
type: Class
subclass of: Ruimte
subclass of: Restriction
  author at start life: Marinus Vonhof
  date of start life: 2018-09-03
  on class: Bouwwerk
  on property: has as part
  min qualified cardinality: 0
subclass of: Restriction
  author at start life: Marinus Vonhof
  date of start life: 2018-09-03
  on class: Leiding
  on property: has as part
  min qualified cardinality: 0
subclass of: Restriction
  author at start life: Marinus Vonhof
  date of start life: 2018-09-03
  on class: Put
  on property: has as part
  min qualified cardinality: 0
subclass of: Restriction
  author at start life: Marinus Vonhof
  date of start life: 2019-05-15
  on class: Aansluiting
  on property: has as part
  min qualified cardinality: 0

Straat
author of change: Marinus Vonhof
author of change: Johan Post
date of change: 2025-01-16
date of change: 2018-12-05
date of change: 2026-04-30
date of change: 2024-11-26
definition: [IMBOR] Deze wegverbinding is al dan niet een openbare weg.
author at start life: Marinus Vonhof
date of start life: 2013-03-26
comment: Ruimte Straat bevat leiding,put, op die manier koppelen aan leiding enz
alternative label: Openbare weg
scope note: Cof TOP
type: Class
subclass of: Bovengrond
subclass of: Restriction
  author of change: Marinus Vonhof
  date of change: 2018-12-05
  author at start life: Marinus Vonhof
  date of start life: 2018-09-03
  on class: Bouwwerk
  on property: has as part
  min qualified cardinality: 0
subclass of: Restriction
  author at start life: Marinus Vonhof
  date of start life: 2019-05-15
  on class: Aansluiting
  on property: has as part
  min qualified cardinality: 0

Goot
author of change: Marinus Vonhof
author of change: Johan Post
author of change: Eric van Gorkom
date of change: 2021-10-01
date of change: 2022-12-24
date of change: 2023-01-10
definition: Aansluitend aan of in de 'verharding' aangebrachte verharde, open afvoer voor hemelwater / Aanvoer afstromend hemelwater vanaf de verharding middels een aansluitend aan de verharding aangebrachte verharde open afvoer
author at start life: Finy Teitsma (Oranjewoud)
date of start life: 2007-10-23
validity context: 1d
alternative label: Lijnafwatering
scope note: Cof MDS
scope note: Cof REV
scope note: Cof HYD
type: Class
subclass of: Open leiding
subclass of: Restriction
  author of change: Marinus Vonhof
  date of change: 2016-04-13
  author at start life: Finy Teitsma (Oranjewoud)
  date of start life: 2007-10-24
  on class: Hemelwaterstelsel
  on property: has as part (inverse)
  max qualified cardinality: 1
subclass of: Restriction
  author of change: Marinus Vonhof
  date of change: 2019-04-30
  author at start life: Marinus Vonhof
  date of start life: 2014-04-30
  on class: Gemengd rioolstelsel
  on property: has as part (inverse)
  max qualified cardinality: 1
subclass of: Restriction
  author at start life: Marinus Vonhof
  date of start life: 2019-05-15
  on class: Aansluiting
  on property: has as part (inverse)
  max qualified cardinality: 1
subclass of: Restriction
  on property: heeft Uitvoering
  has value: Open en aansluitend aan verharding
subclass of: Restriction
  on property: heeft Uitvoering
  has value: Opening aan de bovenzijde
subclass of: Restriction
  on property: heeft Functie
  has value: Opvang en afvoer hemelwater
subclass of: Restriction
  on class: Infiltratiestelsel
  on property: has as part (inverse)
  max qualified cardinality: 1

Verbindingsstuk
author of change: Marinus Vonhof
author of change: Johan Post
date of change: 2018-10-17
date of change: 2024-05-02
definition: Een hulpstuk bestemd voor het verbinden van leidingen.
author at start life: Marinus Vonhof
author at start life: Finy Teitsma (Oranjewoud)
date of start life: 2006-11-29
scope note: Cof MDS
scope note: Cof LDR
scope note: Cof REV
scope note: Cof PLI
scope note: Cof HYD
type: Class
subclass of: Hulpstuk
subclass of: Restriction
  author at start life: Marinus Vonhof
  date of start life: 2022-10-02
  on class: Transportleiding
  on property: has as part (inverse)
  max qualified cardinality: 1
subclass of: Restriction
  on property: heeft Functie
  has value: Verbinden van leidingen
subclass of: Restriction
  on class: Aansluiting
  on property: has as part (inverse)
  max qualified cardinality: 1

Maaiveldoriëntatie
author of change: Marinus Vonhof
date of change: 2018-12-05
definition: Een topologisch element dat het punt (vertex) op het maaiveld beschrijft
author at start life: Marinus Vonhof
date of start life: 2012-04-22
scope note: Cof TOP
type: Class
subclass of: Vertex
subclass of: Restriction
  author of change: Marinus Vonhof
  date of change: 2017-08-21
  author at start life: Marinus Vonhof
  date of start life: 2017-08-19
  on class: Bouwwerkoriëntatie
  on property: is connected to
  max qualified cardinality: 1
subclass of: Restriction
  author of change: Marinus Vonhof
  date of change: 2017-12-12
  author at start life: Marinus Vonhof
  date of start life: 2015-11-07
  validity context: 5t 11t
  on class: Putoriëntatie
  on property: is connected to
  max qualified cardinality: 1
subclass of: Restriction
  author of change: Marinus Vonhof
  date of change: 2018-12-12
  author at start life: Marinus Vonhof
  date of start life: 2012-04-22
  comment: Temporeel kenmerk, met kenmerk Inwinning
  on class: Maaiveldhoogte
  on property: has as aspect
  min qualified cardinality: 1
subclass of: Restriction
  author of change: Marinus Vonhof
  date of change: 2020-04-18
  author at start life: Marinus Vonhof
  date of start life: 2018-12-12
  comment: Temporeel kenmerk, met kenmerk Inwinning
  on class: Punt
  on property: has as aspect
  max qualified cardinality: 1
subclass of: Restriction
  author at start life: Marinus Vonhof
  date of start life: 2017-05-30
  on class: Hulpstukoriëntatie
  on property: is connected to
  max qualified cardinality: 1

Kolk
author of change: Marinus Vonhof
date of change: 2019-04-04
definition: Een reservoir bestemd voor de opvang van hemelwater afkomstig van erop aangesloten oppervlakken, het laten bezinken van in dit water meegevoerde bezinkbare stoffen en de afvoer van dit water naar een rioolstelsel of naar de ondergrond
definition: [NEN 3300:1996] ingegraven bak voor de opvang van neerslag afkomstig van erop aangesloten oppervlakken, voor het laten bezinken van in dit water meegevoerde bezinkbare stoffen en voor de afvoer van dit water naar de riolering
notation: EAA
author at start life: Nic Roest (Idoro)
date of start life: 2006-03-23
validity context: 5d 11d 13d 15d
see also: Vervallen link: https://imgeo.geostandaarden.nl/def/imgeo-object/put/kolk-niet-bgt
see also: [IMGeo:1.0/2007] Open hemelwater afvoer, aangesloten op het transportnet van hemelwater.
alternative label: Afvoerput
scope note: Cof TOP
type: Class
subclass of: Put
subclass of: Oorzaakobject
subclass of: Restriction
  author at start life: Marinus Vonhof
  date of start life: 2026-07-24
  on class: Infiltratievoorziening
  on property: has as part (inverse)
  max qualified cardinality: 1
subclass of: Restriction
  on property: heeft Functie
  has value: Bezinken stoffen
subclass of: Restriction
  on property: heeft Functie
  has value: Opvang van afstromend hemelwater

Spuikolk
definition: Een bovengrondse uitstroomvoorziening die hemelwater vanuit een ondergrondse leiding aan het maaiveld aanbiedt.
notation: EAA
author at start life: Johan Post
date of start life: 2026-05-04
alternative label: Hemelwaterbrievenbus
scope note: Cof TOP
type: Class
subclass of: Put
subclass of: Restriction
  on property: heeft Functie
  has value: Afvoeren hemelwater naar de bovengrond

Aansluitleiding
label: Drain (EN) @en
author of change: Marinus Vonhof
date of change: 2019-03-20
definition: Een leiding voor de aanvoer van afvalwater.
definition: [EN 16323:2014] pipeline, usually underground, designed to carry wastewater from a source to a sewer @en
definition: [NEN 3300:1996] Leiding tussen een gebouw of een kolk en een knooppunt of leiding
definition: [NEN-EN 752:2008] gewoonlijk ondergrondse leiding die afvalwater van een gebouw of een kolk naar een riool voert [EN 1085:2007, definitie 2250]
author at start life: Finy Teitsma (Oranjewoud)
date of start life: 2006-02-20
validity context: 5d 11d 13d 14f 15d
comment: 20151014: NEN3300-definitie aangepast
scope note: Cof TOP
type: Class
subclass of: Leiding
subclass of: Restriction
  on property: heeft Functie
  has value: Aanvoer van afvalwater

Leiding
author of change: Johan Post
author of change: Eric van Gorkom
author of change: Wouter van Riel
date of change: 2024-05-01
date of change: 2026-05-01
date of change: 2021-11-23
date of change: 2024-04-23
date of change: 2026-05-13
date of change: 2026-04-30
definition: Een geheel van geleiders welke voorzien zijn van 1 ommanteling en bestemd is voor transport van materie
author at start life: Finy Teitsma (Oranjewoud)
date of start life: 2006-02-24
validity context: *f
see also: [IMKL:1.1/2008] Holle leiding voor het doorstromen van gassen, vloeistoffen of capsules, bestemd om hetzij gas, een vloeistof of capsules te transporteren, hetzij een vloeistof als intermediair te gebruiken voor het transport van warmte of een opgeloste of verpulverde stof.
see also: [NEN 3610:2010] (Ongeldig) Buis of kabel bestemd voor de voortgeleiding van energie of materie.
alternative label: Buis
alternative label: Pijp
scope note: Cof TOP
type: Class
subclass of: Fysiek object
subclass of: Restriction
  author of change: Marinus Vonhof
  author of change: Johan Post
  date of change: 2018-12-05
  date of change: 2026-04-30
  author at start life: Marinus Vonhof
  date of start life: 2018-09-03
  on class: Bovengrond
  on property: has as part (inverse)
  max qualified cardinality: 1
subclass of: Restriction
  author of change: Marinus Vonhof
  date of change: 2015-06-01
  author at start life: Finy Teitsma (Oranjewoud)
  date of start life: 2006-02-25
  validity context: *t
  on class: Materiaal leiding
  on property: has as aspect
  max qualified cardinality: 1
subclass of: Restriction
  author of change: Marinus Vonhof
  date of change: 2015-08-24
  author at start life: Finy Teitsma (Oranjewoud)
  date of start life: 2006-02-25
  validity context: *t
  on class: Lengte leiding
  on property: has as aspect
  max qualified cardinality: 1
subclass of: Restriction
  author of change: Marinus Vonhof
  date of change: 2015-10-31
  author at start life: Finy Teitsma (Oranjewoud)
  date of start life: 2006-02-25
  validity context: *t
  on class: Vorm leiding
  on property: has as aspect
  max qualified cardinality: 1
subclass of: Restriction
  author of change: Marinus Vonhof
  date of change: 2019-09-02
  author at start life: Finy Teitsma (Oranjewoud)
  date of start life: 2006-02-25
  on class: Wanddikte
  on property: has as aspect
  max qualified cardinality: 1
subclass of: Restriction
  author of change: Marinus Vonhof
  date of change: 2014-12-03
  author at start life: Marinus Vonhof
  date of start life: 2011-12-15
  validity context: *t
  on class: Hoogte leiding
  on property: has as aspect
  max qualified cardinality: 1
subclass of: Restriction
  author of change: Marinus Vonhof
  date of change: 2015-05-29
  author at start life: Marinus Vonhof
  date of start life: 2011-12-15
  validity context: *t
  on class: Breedte leiding
  on property: has as aspect
  max qualified cardinality: 1
subclass of: Restriction
  author of change: Marinus Vonhof
  date of change: 2015-09-20
  author at start life: Marinus Vonhof
  date of start life: 2013-10-01
  on class: Diameter leiding
  on property: has as aspect
  max qualified cardinality: 1
subclass of: Restriction
  author at start life: Finy Teitsma (Oranjewoud)
  date of start life: 2006-02-25
  on property: has as aspect
  some values from: Lengte leiding
subclass of: Restriction
  author at start life: Finy Teitsma (Oranjewoud)
  date of start life: 2006-02-25
  on property: has as aspect
  some values from: Materiaal leiding
subclass of: Restriction
  author at start life: Finy Teitsma (Oranjewoud)
  date of start life: 2006-02-25
  on property: has as aspect
  some values from: Vorm leiding
subclass of: Restriction
  author at start life: Johan Post
  date of start life: 2026-05-13
  on class: Inwinning
  on property: has as aspect
  max qualified cardinality: 1
subclass of: Restriction
  author at start life: Marinus Vonhof
  date of start life: 2011-12-15
  on property: has as aspect
  some values from: Breedte leiding
subclass of: Restriction
  author at start life: Marinus Vonhof
  date of start life: 2011-12-15
  on property: has as aspect
  some values from: Hoogte leiding
subclass of: Restriction
  author at start life: Marinus Vonhof
  date of start life: 2012-04-22
  validity context: *t
  on class: Leidingoriëntatie
  on property: has as aspect
  max qualified cardinality: 1
subclass of: Restriction
  author at start life: Marinus Vonhof
  date of start life: 2013-10-01
  on property: has as aspect
  some values from: Diameter leiding
subclass of: Restriction
  author at start life: Marinus Vonhof
  date of start life: 2018-09-03
  on class: Ondergrond
  on property: has as part (inverse)
  max qualified cardinality: 1
subclass of: Restriction
  on property: heeft Functie
  has value: Voortgeleiding van materie

Aansluitpunt
definition: Een topologisch element (knooppunt) met de aansluitlocatie tussen leidingen, putten en open water. Een aansluitpunt kan ook de koppeling vormen tussen een leiding en een hydraulisch element (zoals een klep), het is dan het knooppunt tussen twee verbindingen.
author at start life: Marinus Vonhof
date of start life: 2017-12-12
scope note: Cof TOP
type: Class
subclass of: Knooppunt
subclass of: Restriction
  author at start life: Finy Teitsma (Oranjewoud)
  date of start life: 2006-02-25
  on class: Invoer
  on property: has as aspect
  max qualified cardinality: 1
subclass of: Restriction
  on property: heeft Functie
  has value: Aanvoer van afvalwater

Knooppunt
label: Node @en
author of change: Marinus Vonhof
author of change: Wouter van Riel
date of change: 2024-04-22
date of change: 2022-10-01
date of change: 2020-11-24
definition: De knoop binnen de netwerkdefinitie, waar verbindingen bij elkaar komen
definition: [NEN 3300:1996] Begin- of eindpunt van 1 of meer leidingen, meestal gevormd door een fysieke constructie
author at start life: Marinus Vonhof
date of start life: 2013-09-03
see also: [GFO/RIO2] Begin- of eindpunt van 1 of meer leidingen, meestal gevormd door een fysieke constructie
alternative label: Knoop
scope note: Cof TOP
type: Class
subclass of: Vertex
subclass of: Restriction
  author of change: Marinus Vonhof
  date of change: 2022-10-01
  author at start life: Marinus Vonhof
  date of start life: 2011-12-02
  on class: Beginpunt leiding
  on property: is connected to
  min qualified cardinality: 0
subclass of: Restriction
  author of change: Marinus Vonhof
  date of change: 2022-10-01
  author at start life: Marinus Vonhof
  date of start life: 2011-12-02
  on class: Eindpunt leiding
  on property: is connected to
  min qualified cardinality: 0
subclass of: Restriction
  author of change: Marinus Vonhof
  date of change: 2022-10-01
  author at start life: Marinus Vonhof
  date of start life: 2017-12-12
  on class: Beginpunt onderdeel
  on property: is connected to
  min qualified cardinality: 0
subclass of: Restriction
  author of change: Marinus Vonhof
  date of change: 2022-10-01
  author at start life: Marinus Vonhof
  date of start life: 2017-12-12
  on class: Eindpunt onderdeel
  on property: is connected to
  min qualified cardinality: 0
subclass of: Restriction
  author at start life: Wouter van Riel
  date of start life: 2022-05-04
  on class: Punt
  on property: has as aspect
  max qualified cardinality: 1

Invoer
author of change: Johan Post
date of change: 2022-11-25
date of change: 2026-05-01
definition: Hoeveelheid afvalwater die per tijdseenheid in een knooppunt wordt geloosd. Deze kan variëren in de tijd
author at start life: Nic Roest (Idoro)
date of start life: 2006-02-21
units of measurements: m3/h
comment: [is aspect]
scope note: Cof HYD
type: Class
subclass of: Capaciteit
subclass of: Restriction
  author of change: Marinus Vonhof
  date of change: 2018-05-03
  author at start life: Finy Teitsma (Oranjewoud)
  date of start life: 2006-02-25
  on class: Rioolput
  on property: has as aspect (inverse)
  max qualified cardinality: 1
subclass of: Restriction
  author at start life: Finy Teitsma (Oranjewoud)
  date of start life: 2006-02-25
  on class: Aansluitpunt
  on property: has as aspect (inverse)
  max qualified cardinality: 1
subclass of: Restriction
  on property: has as value
  all values from: decimal

Put
author of change: Johan Post
author of change: Eric van Gorkom
date of change: 2022-09-27
date of change: 2024-05-01
date of change: 2026-05-01
date of change: 2024-05-13
date of change: 2026-04-30
date of change: 20262-05-13
author at start life: Marinus Vonhof
date of start life: 2013-07-18
validity context: *f
see also: Vervallen link: https://imgeo.geostandaarden.nl/def/imgeo-object/put
see also: [IMGeo:1.0/2007] Gegraven of geboorde kokervormige diepte waarin zich (vloei)stoffen bevinden.
scope note: Cof TOP
type: Class
subclass of: Fysiek object
subclass of: Restriction
  author of change: Johan Post
  date of change: 2018-12-05
  date of change: 2026-04-30
  author at start life: Marinus Vonhof
  date of start life: 2018-09-03
  on class: Bovengrond
  on property: has as part (inverse)
  max qualified cardinality: 1
subclass of: Restriction
  author of change: Marinus Vonhof
  date of change: 2014-08-01
  author at start life: Finy Teitsma (Oranjewoud)
  date of start life: 2006-02-25
  validity context: *t
  on class: Breedte put
  on property: has as aspect
  max qualified cardinality: 1
subclass of: Restriction
  author of change: Marinus Vonhof
  date of change: 2014-08-01
  author at start life: Finy Teitsma (Oranjewoud)
  date of start life: 2006-02-25
  validity context: *t
  on class: Hoogte put
  on property: has as aspect
  max qualified cardinality: 1
subclass of: Restriction
  author of change: Marinus Vonhof
  date of change: 2014-08-01
  author at start life: Finy Teitsma (Oranjewoud)
  date of start life: 2006-02-25
  validity context: *t
  on class: Lengte put
  on property: has as aspect
  max qualified cardinality: 1
subclass of: Restriction
  author of change: Marinus Vonhof
  date of change: 2015-06-01
  author at start life: Finy Teitsma (Oranjewoud)
  date of start life: 2007-10-24
  validity context: 5t 10t 12t 14t
  on class: Materiaal put
  on property: has as aspect
  max qualified cardinality: 1
subclass of: Restriction
  author of change: Marinus Vonhof
  date of change: 2021-08-06
  author at start life: Finy Teitsma (Oranjewoud)
  date of start life: 2006-02-25
  validity context: *t
  on class: Vorm put
  on property: has as aspect
  max qualified cardinality: 1
subclass of: Restriction
  author of change: Marinus Vonhof
  date of change: 2015-08-24
  author at start life: Marinus Vonhof
  date of start life: 2013-10-01
  on class: Diameter put
  on property: has as aspect
  max qualified cardinality: 1
subclass of: Restriction
  author at start life: Finy Teitsma (Oranjewoud)
  date of start life: 2006-02-25
  on property: has as aspect
  some values from: Breedte put
subclass of: Restriction
  author at start life: Finy Teitsma (Oranjewoud)
  date of start life: 2006-02-25
  on property: has as aspect
  some values from: Hoogte put
subclass of: Restriction
  author at start life: Finy Teitsma (Oranjewoud)
  date of start life: 2006-02-25
  on property: has as aspect
  some values from: Lengte put
subclass of: Restriction
  author at start life: Finy Teitsma (Oranjewoud)
  date of start life: 2006-02-25
  on property: has as aspect
  some values from: Vorm put
subclass of: Restriction
  author at start life: Finy Teitsma (Oranjewoud)
  date of start life: 2007-10-24
  on property: has as aspect
  some values from: Materiaal put
subclass of: Restriction
  author at start life: Johan Post
  date of start life: 2026-05-13
  on class: Inwinning
  on property: has as aspect
  max qualified cardinality: 1
subclass of: Restriction
  author at start life: Marinus Vonhof
  date of start life: 2012-04-22
  validity context: *t
  on class: Putoriëntatie
  on property: has as aspect
  max qualified cardinality: 1
subclass of: Restriction
  author at start life: Marinus Vonhof
  date of start life: 2013-10-01
  on property: has as aspect
  some values from: Diameter put
subclass of: Restriction
  author at start life: Marinus Vonhof
  date of start life: 2015-10-21
  on class: Wanddikte
  on property: has as aspect
  max qualified cardinality: 1
subclass of: Restriction
  author at start life: Marinus Vonhof
  date of start life: 2018-09-03
  on class: Ondergrond
  on property: has as part (inverse)
  max qualified cardinality: 1
subclass of: Restriction
  author at start life: Marinus Vonhof
  date of start life: 2020-05-28
  on class: Adresgegevens
  on property: has as aspect
  max qualified cardinality: 1
subclass of: Restriction
  on property: heeft Uitvoering
  has value: Gegraven of geboorde kokervormige diepte

Inwinning
author of change: Johan Post
date of change: 2022-11-25
date of change: 2024-05-02
definition: Informatie over het verzamelen van gegevens
author at start life: Marinus Vonhof
date of start life: 2015-10-29
comment: Kenmerken van kenmerk
alternative label: Inwinning-informatie
comment: [is aspect]
scope note: Cof TOP
type: Class
subclass of: Kenmerk
subclass of: Restriction
  author of change: Marinus Vonhof
  date of change: 2015-11-03
  author at start life: Marinus Vonhof
  date of start life: 2013-03-29
  on class: Lengte leiding
  on property: has as aspect (inverse)
  max qualified cardinality: 1
subclass of: Restriction
  author of change: Marinus Vonhof
  date of change: 2017-05-17
  author at start life: Marinus Vonhof
  date of start life: 2015-10-29
  on class: B.o.b. beginpunt leiding
  on property: has as aspect (inverse)
  max qualified cardinality: 1
subclass of: Restriction
  author of change: Marinus Vonhof
  date of change: 2017-05-17
  author at start life: Marinus Vonhof
  date of start life: 2015-10-30
  on class: Vorm put
  on property: has as aspect (inverse)
  max qualified cardinality: 1
subclass of: Restriction
  author of change: Marinus Vonhof
  date of change: 2017-05-17
  author at start life: Marinus Vonhof
  date of start life: 2015-11-06
  on class: Vorm compartiment
  on property: has as aspect (inverse)
  max qualified cardinality: 1
subclass of: Restriction
  author of change: Marinus Vonhof
  date of change: 2019-04-25
  author at start life: Marinus Vonhof
  date of start life: 2015-10-29
  on class: Datum inwinning
  on property: has as aspect
  max qualified cardinality: 1
subclass of: Restriction
  author of change: Marinus Vonhof
  date of change: 2019-04-25
  author at start life: Marinus Vonhof
  date of start life: 2015-10-29
  on class: Wijze van inwinning
  on property: has as aspect
  max qualified cardinality: 1
subclass of: Restriction
  author of change: Marinus Vonhof
  date of change: 2019-04-25
  author at start life: Marinus Vonhof
  date of start life: 2015-11-03
  on class: Capaciteit
  on property: has as aspect (inverse)
  max qualified cardinality: 1
subclass of: Restriction
  author at start life: Marinus Vonhof
  date of start life: 2015-10-29
  on class: B.o.b. eindpunt leiding
  on property: has as aspect (inverse)
  max qualified cardinality: 1
subclass of: Restriction
  author at start life: Marinus Vonhof
  date of start life: 2015-10-30
  on class: Drempelniveau
  on property: has as aspect (inverse)
  max qualified cardinality: 1
subclass of: Restriction
  author at start life: Marinus Vonhof
  date of start life: 2015-10-30
  on class: Vorm leiding
  on property: has as aspect (inverse)
  max qualified cardinality: 1
subclass of: Restriction
  author at start life: Marinus Vonhof
  date of start life: 2015-11-03
  on class: Niveau buitenwater
  on property: has as aspect (inverse)
  max qualified cardinality: 1
subclass of: Restriction
  author at start life: Marinus Vonhof
  date of start life: 2015-11-07
  on class: Maaiveldhoogte
  on property: has as aspect (inverse)
  max qualified cardinality: 1
subclass of: Restriction
  author at start life: Marinus Vonhof
  date of start life: 2016-11-09
  on class: Geometrie
  on property: has as aspect (inverse)
  max qualified cardinality: 1
subclass of: Restriction
  author at start life: Marinus Vonhof
  date of start life: 2018-12-06
  on class: Waterpeil
  on property: has as aspect (inverse)
  max qualified cardinality: 1
subclass of: Restriction
  author at start life: Marinus Vonhof
  date of start life: 2024-05-16
  on class: Breedte leiding
  on property: has as aspect (inverse)
  max qualified cardinality: 1
subclass of: Restriction
  author at start life: Marinus Vonhof
  date of start life: 2024-05-16
  on class: Diameter leiding
  on property: has as aspect (inverse)
  max qualified cardinality: 1
subclass of: Restriction
  author at start life: Marinus Vonhof
  date of start life: 2024-05-16
  on class: Drempelbreedte
  on property: has as aspect (inverse)
  max qualified cardinality: 1
subclass of: Restriction
  author at start life: Marinus Vonhof
  date of start life: 2024-05-16
  on class: Hoogte leiding
  on property: has as aspect (inverse)
  max qualified cardinality: 1
subclass of: Restriction
  author at start life: Marinus Vonhof
  date of start life: 2026-07-26
  on class: Bergend oppervlak
  on property: has as aspect (inverse)
  max qualified cardinality: 1
subclass of: Restriction
  author at start life: Marinus Vonhof
  date of start life: 2026-07-26
  on class: Porositeit
  on property: has as aspect (inverse)
  max qualified cardinality: 1
subclass of: Restriction
  author at start life: Marinus Vonhof
  date of start life: 2026-07-26
  on class: Retentiewaarde
  on property: has as aspect (inverse)
  max qualified cardinality: 1
subclass of: Restriction
  on class: Aantal woningen
  on property: has as aspect (inverse)
  max qualified cardinality: 1
subclass of: Restriction
  on class: Afvoerend oppervlak
  on property: has as aspect (inverse)
  max qualified cardinality: 1
subclass of: Restriction
  on class: Leiding
  on property: has as aspect (inverse)
  max qualified cardinality: 1
subclass of: Restriction
  on class: Materiaal leiding
  on property: has as aspect (inverse)
  max qualified cardinality: 1
subclass of: Restriction
  on class: Put
  on property: has as aspect (inverse)
  max qualified cardinality: 1

Aantal woningen
author of change: Marinus Vonhof
date of change: 2021-05-10
definition: Het aantal aangesloten wooneenheden
author at start life: Marinus Vonhof
date of start life: 2011-12-15
units of measurements: pcs
validity context: 15d
comment: [is aspect]
scope note: Cof MDS
scope note: Cof HYD
type: Class
subclass of: Kenmerk
subclass of: Restriction
  author of change: Johan Post
  date of change: 2022-11-25
  on class: Inwinning
  on property: has as aspect
  max qualified cardinality: 1
subclass of: Restriction
  author of change: Marinus Vonhof
  date of change: 2016-04-24
  author at start life: Marinus Vonhof
  date of start life: 2015-03-01
  on class: Hemelwaterriool
  on property: has as aspect (inverse)
  max qualified cardinality: 1
subclass of: Restriction
  author of change: Marinus Vonhof
  date of change: 2016-04-24
  author at start life: Marinus Vonhof
  date of start life: 2015-03-01
  on class: Vuilwaterriool
  on property: has as aspect (inverse)
  max qualified cardinality: 1
subclass of: Restriction
  author of change: Marinus Vonhof
  date of change: 2018-05-03
  author at start life: Marinus Vonhof
  date of start life: 2011-12-15
  on class: Rioolput
  on property: has as aspect (inverse)
  max qualified cardinality: 1
subclass of: Restriction
  author of change: Marinus Vonhof
  date of change: 2021-03-10
  author at start life: Marinus Vonhof
  date of start life: 2011-12-15
  on class: Gemengd riool
  on property: has as aspect (inverse)
  max qualified cardinality: 1
subclass of: Restriction
  author at start life: Marinus Vonhof
  date of start life: 2017-08-31
  on class: Compartiment
  on property: has as aspect (inverse)
  max qualified cardinality: 1
subclass of: Restriction
  on property: has as value
  all values from: Aantal woningen (datatype)

Hemelwaterriool
author of change: Johan Post
date of change: 2026-05-18
definition: [NEN 3300:1996] (Regenwaterriool) Riool alleen bestemd voor de inzameling en het transport van neerslag
author at start life: Marinus Vonhof
date of start life: 2012-04-29
alternative label: Regenwaterriool
alternative label: Rwa-riool
scope note: Cof MDS
scope note: Cof REV
scope note: Cof HYD
type: Class
subclass of: Vrijverval rioolleiding
subclass of: Restriction
  author of change: Marinus Vonhof
  date of change: 2014-04-30
  author at start life: Finy Teitsma (Oranjewoud)
  date of start life: 2007-10-24
  on class: Hemelwaterstelsel
  on property: has as part (inverse)
  max qualified cardinality: 1
subclass of: Restriction
  author of change: Marinus Vonhof
  date of change: 2016-04-24
  author at start life: Marinus Vonhof
  date of start life: 2015-03-01
  on class: Aantal woningen
  on property: has as aspect
  max qualified cardinality: 1
subclass of: Restriction
  author of change: Marinus Vonhof
  date of change: 2022-10-02
  author at start life: Marinus Vonhof
  date of start life: 2017-08-31
  on class: Afvoerend oppervlak
  on property: has as aspect
  max qualified cardinality: 12
subclass of: Restriction
  author at start life: Marinus Vonhof
  date of start life: 2017-08-31
  on class: Lateraal afvoerend oppervlak
  on property: has as aspect
  max qualified cardinality: 1
subclass of: Restriction
  author at start life: Marinus Vonhof
  date of start life: 2017-08-31
  on class: Lateraal debiet HWA
  on property: has as aspect
  max qualified cardinality: 1
subclass of: Restriction
  author at start life: Marinus Vonhof
  date of start life: 2020-05-26
  on class: Gemengd rioolstelsel
  on property: has as part (inverse)
  max qualified cardinality: 1
subclass of: Restriction
  author at start life: Marinus Vonhof
  date of start life: 2026-07-16
  on class: Infiltratiestelsel
  on property: has as part (inverse)
  max qualified cardinality: 1
subclass of: Restriction
  author at start life: Marinus Vonhof
  date of start life: 2026-07-24
  on class: Infiltratievoorziening
  on property: has as part (inverse)
  max qualified cardinality: 1
subclass of: Restriction
  author at start life: Marinus Vonhof
  date of start life: 2026-08-04
  on class: Vuilwaterstelsel
  on property: has as part (inverse)
  max qualified cardinality: 1
subclass of: Restriction
  author at start life: Wouter van Riel
  date of start life: 2022-09-26
  on class: Drainage/infiltratie transportstelsel
  on property: has as part (inverse)
  max qualified cardinality: 1
subclass of: Restriction
  on property: heeft Functie
  has value: Inzameling van hemelwater
subclass of: Restriction
  on property: heeft Functie
  has value: Transport van hemelwater

Vuilwaterriool
author of change: Marinus Vonhof
date of change: 2021-08-05
definition: [NEN 3300:1996] Dwa-riool is synoniem van vuilwaterriool
definition: [NEN 3300:1996] riool alleen bestemd voor de inzameling en het transport van huishoudelijk- en bedrijfsafvalwater, niet zijnde neerslag
author at start life: Marinus Vonhof
date of start life: 2012-04-29
alternative label: Dwa-riool
scope note: Cof MDS
scope note: Cof REV
scope note: Cof HYD
type: Class
subclass of: Vrijverval rioolleiding
subclass of: Restriction
  author of change: Marinus Vonhof
  date of change: 2016-04-24
  author at start life: Marinus Vonhof
  date of start life: 2015-03-01
  on class: Aantal woningen
  on property: has as aspect
  max qualified cardinality: 1
subclass of: Restriction
  author at start life: Marinus Vonhof
  date of start life: 2015-03-01
  on class: Aantal i.e. bedrijven
  on property: has as aspect
  max qualified cardinality: 1
subclass of: Restriction
  author at start life: Marinus Vonhof
  date of start life: 2015-03-01
  on class: Aantal i.e. recreatie
  on property: has as aspect
  max qualified cardinality: 1
subclass of: Restriction
  author at start life: Marinus Vonhof
  date of start life: 2017-08-31
  on class: Lateraal debiet DWA
  on property: has as aspect
  max qualified cardinality: 1
subclass of: Restriction
  author at start life: Marinus Vonhof
  date of start life: 2020-05-26
  on class: Gemengd rioolstelsel
  on property: has as part (inverse)
  max qualified cardinality: 1
subclass of: Restriction
  author at start life: Marinus Vonhof
  date of start life: 2020-05-26
  on class: Vuilwaterstelsel
  on property: has as part (inverse)
  max qualified cardinality: 1
subclass of: Restriction
  on property: heeft Functie
  has value: Inzameling van vuilwater
subclass of: Restriction
  on property: heeft Functie
  has value: Transport van vuilwater

Rioolput
author of change: Marinus Vonhof
author of change: Johan Post
author of change: Wouter van Riel
date of change: 2016-08-26
date of change: 2026-05-01
date of change: 2022-12-19
date of change: 2024-04-22
definition: Een put met een verwijderbare deksel, dat toegang geeft tot de aangesloten rioolleidingen
definition: [EN13508-2+A1] The node reference of the manhole or inspection chamber as specified by the employing authority. @en
definition: [NEN 3300:1996] constructie toegang gevend tot het rioolstelsel
notation: CAA
notation: JAA
author at start life: Marinus Vonhof
date of start life: 2013-03-31
validity context: *f
alternative label: Node reference @en
scope note: Cof MLD
scope note: Cof TOP
type: Class
subclass of: Put
subclass of: Oorzaakobject
subclass of: Restriction
  author of change: Marinus Vonhof
  date of change: 2018-05-03
  author at start life: Finy Teitsma (Oranjewoud)
  date of start life: 2006-02-25
  on class: Invoer
  on property: has as aspect
  max qualified cardinality: 1
subclass of: Restriction
  author of change: Marinus Vonhof
  date of change: 2018-05-03
  author at start life: Finy Teitsma (Oranjewoud)
  date of start life: 2006-02-25
  on class: Lengte toegang
  on property: has as aspect
  max qualified cardinality: 1
subclass of: Restriction
  author of change: Marinus Vonhof
  date of change: 2017-03-06
  author at start life: Marinus Vonhof
  date of start life: 2014-04-29
  validity context: *t
  on class: Vrijverval rioolleiding
  on property: is connected to
  min qualified cardinality: 1
subclass of: Restriction
  author of change: Marinus Vonhof
  date of change: 2018-05-03
  date of change: 2022-10-02
  author at start life: Marinus Vonhof
  date of start life: 2014-12-02
  on class: Afvoerend oppervlak
  on property: has as aspect
  max qualified cardinality: 12
subclass of: Restriction
  author of change: Marinus Vonhof
  date of change: 2018-05-03
  author at start life: Marinus Vonhof
  date of start life: 2011-12-15
  validity context: 5t 11t 14t
  on class: Bergend oppervlak
  on property: has as aspect
  max qualified cardinality: 1
subclass of: Restriction
  author of change: Marinus Vonhof
  date of change: 2018-05-03
  author at start life: Marinus Vonhof
  date of start life: 2011-12-15
  validity context: 5t 11t 14t
  on class: Maaiveldschematisering
  on property: has as aspect
  max qualified cardinality: 1
subclass of: Restriction
  author of change: Marinus Vonhof
  date of change: 2018-05-03
  author at start life: Marinus Vonhof
  date of start life: 2011-12-15
  on class: Aantal woningen
  on property: has as aspect
  max qualified cardinality: 1
subclass of: Restriction
  author of change: Marinus Vonhof
  date of change: 2018-05-03
  author at start life: Marinus Vonhof
  date of start life: 2011-12-15
  on class: Aantal i.e. bedrijven
  on property: has as aspect
  max qualified cardinality: 1
subclass of: Restriction
  author of change: Marinus Vonhof
  date of change: 2018-05-03
  author at start life: Marinus Vonhof
  date of start life: 2011-12-15
  on class: Continue lozing
  on property: has as aspect
  max qualified cardinality: 1
subclass of: Restriction
  author of change: Marinus Vonhof
  date of change: 2018-05-03
  author at start life: Marinus Vonhof
  date of start life: 2014-12-01
  on class: Aantal i.e. recreatie
  on property: has as aspect
  max qualified cardinality: 1
subclass of: Restriction
  author of change: Marinus Vonhof
  date of change: 2018-05-03
  author at start life: Marinus Vonhof
  date of start life: 2017-08-31
  on class: Lateraal afvoerend oppervlak
  on property: has as aspect
  max qualified cardinality: 1
subclass of: Restriction
  author of change: Marinus Vonhof
  date of change: 2018-05-03
  author at start life: Marinus Vonhof
  date of start life: 2017-08-31
  on class: Lateraal debiet
  on property: has as aspect
  max qualified cardinality: 2
subclass of: Restriction
  author of change: Marinus Vonhof
  date of change: 2020-04-17
  author at start life: Marinus Vonhof
  date of start life: 2013-02-05
  on class: Rioolafsluiter
  on property: has as part
  min qualified cardinality: 0
subclass of: Restriction
  on property: heeft Functie
  has value: Leidingen aansluiten
subclass of: Restriction
  on property: heeft Functie
  has value: Rioolleidingen aansluiten
subclass of: Restriction
  on property: heeft Uitvoering
  has value: Verticale waterdichte constructie

Gemengd riool
author of change: Marinus Vonhof
date of change: 2019-03-20
definition: Vrijverval rioolleiding ontworpen om zowel verontreinigd afvalwater als afgestroomd hemelwater binnen een stelsel te transporteren
author at start life: Marinus Vonhof
date of start life: 2013-10-02
scope note: Cof MDS
scope note: Cof REV
scope note: Cof HYD
type: Class
subclass of: Vrijverval rioolleiding
subclass of: Restriction
  author of change: Marinus Vonhof
  date of change: 2014-12-01
  author at start life: Marinus Vonhof
  date of start life: 2011-12-15
  on class: Aantal i.e. bedrijven
  on property: has as aspect
  max qualified cardinality: 1
subclass of: Restriction
  author of change: Marinus Vonhof
  date of change: 2021-03-10
  author at start life: Marinus Vonhof
  date of start life: 2011-12-15
  on class: Aantal woningen
  on property: has as aspect
  max qualified cardinality: 1
subclass of: Restriction
  author of change: Marinus Vonhof
  date of change: 2022-10-02
  author at start life: Marinus Vonhof
  date of start life: 2017-08-31
  on class: Afvoerend oppervlak
  on property: has as aspect
  max qualified cardinality: 12
subclass of: Restriction
  author at start life: Marinus Vonhof
  date of start life: 2014-12-01
  on class: Aantal i.e. recreatie
  on property: has as aspect
  max qualified cardinality: 1
subclass of: Restriction
  author at start life: Marinus Vonhof
  date of start life: 2017-08-31
  on class: Lateraal afvoerend oppervlak
  on property: has as aspect
  max qualified cardinality: 1
subclass of: Restriction
  author at start life: Marinus Vonhof
  date of start life: 2017-08-31
  on class: Lateraal debiet
  on property: has as aspect
  max qualified cardinality: 2
subclass of: Restriction
  author at start life: Marinus Vonhof
  date of start life: 2020-05-26
  validity context: *t
  on class: Gemengd rioolstelsel
  on property: has as part (inverse)
  qualified cardinality: 1
subclass of: Restriction
  author at start life: Marinus Vonhof
  date of start life: 2026-08-04
  on class: Vuilwaterstelsel
  on property: has as part (inverse)
  max qualified cardinality: 1
subclass of: Restriction
  on property: heeft Functie
  has value: Inzameling van hemelwater
subclass of: Restriction
  on property: heeft Functie
  has value: Inzameling van vuilwater
subclass of: Restriction
  on property: heeft Functie
  has value: Transport van hemelwater
subclass of: Restriction
  on property: heeft Functie
  has value: Transport van vuilwater

Compartiment
author of change: Marinus Vonhof
author of change: Wouter van Riel
date of change: 2025-01-16
date of change: 2019-05-15
date of change: 2024-04-22
definition: Een ruimtelijk deel van een constructie
definition: [IMBOR] Een onderdeel van een Overstortput, Bijzondere putconstructie, Stuwput, Septictank, Bergingsvijver of Gemaal.
notation: CMP
author at start life: Marinus Vonhof
date of start life: 2011-12-15
validity context: 1d
comment: 2 of meer
scope note: Cof BAS
scope note: Cof HYD
scope note: Cof RGM
type: Class
subclass of: Ruimte
subclass of: Restriction
  author of change: Marinus Vonhof
  date of change: 2015-07-28
  author at start life: Marinus Vonhof
  date of start life: 2011-12-15
  on class: Lengte compartiment
  on property: has as aspect
  max qualified cardinality: 1
subclass of: Restriction
  author of change: Marinus Vonhof
  date of change: 2015-07-28
  author at start life: Marinus Vonhof
  date of start life: 2014-04-29
  on class: Overstortput
  on property: has as part (inverse)
  qualified cardinality: 1
subclass of: Restriction
  author of change: Marinus Vonhof
  date of change: 2016-04-22
  author at start life: Marinus Vonhof
  date of start life: 2014-04-29
  on class: Stuwput
  on property: has as part (inverse)
  qualified cardinality: 1
subclass of: Restriction
  author of change: Marinus Vonhof
  date of change: 2018-05-03
  date of change: 2022-10-02
  author at start life: Marinus Vonhof
  date of start life: 2014-12-02
  on class: Afvoerend oppervlak
  on property: has as aspect
  max qualified cardinality: 12
subclass of: Restriction
  author of change: Marinus Vonhof
  date of change: 2018-05-03
  author at start life: Marinus Vonhof
  date of start life: 2012-04-22
  validity context: 5t 11t
  on class: Compartimentoriëntatie
  on property: has as aspect
  max qualified cardinality: 1
subclass of: Restriction
  author of change: Marinus Vonhof
  date of change: 2018-05-03
  author at start life: Marinus Vonhof
  date of start life: 2013-02-05
  on class: Pomp
  on property: has as part
  min qualified cardinality: 0
subclass of: Restriction
  author of change: Marinus Vonhof
  date of change: 2018-05-03
  author at start life: Marinus Vonhof
  date of start life: 2014-04-29
  on class: Bijzondere putconstructie
  on property: has as part (inverse)
  max qualified cardinality: 1
subclass of: Restriction
  author of change: Marinus Vonhof
  date of change: 2018-05-03
  author at start life: Marinus Vonhof
  date of start life: 2016-04-24
  on class: Gemaal
  on property: has as part (inverse)
  max qualified cardinality: 1
subclass of: Restriction
  author of change: Marinus Vonhof
  date of change: 2018-05-03
  author at start life: Marinus Vonhof
  date of start life: 2017-08-19
  on class: Reservoir
  on property: has as part (inverse)
  qualified cardinality: 1
subclass of: Restriction
  author of change: Wouter van Riel
  date of change: 2024-04-22
  author at start life: Marinus Vonhof
  date of start life: 2011-12-15
  validity context: 5t 11t
  on class: Breedte compartiment
  on property: has as aspect
  max qualified cardinality: 1
subclass of: Restriction
  author of change: Wouter van Riel
  date of change: 2024-04-22
  author at start life: Marinus Vonhof
  date of start life: 2015-11-06
  validity context: 5t 11t
  on class: Vorm compartiment
  on property: has as aspect
  max qualified cardinality: 1
subclass of: Restriction
  author at start life: Marinus Vonhof
  date of start life: 2017-08-31
  on class: Aantal woningen
  on property: has as aspect
  max qualified cardinality: 1
subclass of: Restriction
  author at start life: Marinus Vonhof
  date of start life: 2017-08-31
  on class: Aantal i.e. bedrijven
  on property: has as aspect
  max qualified cardinality: 1
subclass of: Restriction
  author at start life: Marinus Vonhof
  date of start life: 2017-08-31
  on class: Aantal i.e. recreatie
  on property: has as aspect
  max qualified cardinality: 1
subclass of: Restriction
  author at start life: Marinus Vonhof
  date of start life: 2017-08-31
  on class: Lateraal afvoerend oppervlak
  on property: has as aspect
  max qualified cardinality: 1
subclass of: Restriction
  author at start life: Marinus Vonhof
  date of start life: 2017-08-31
  on class: Lateraal debiet
  on property: has as aspect
  max qualified cardinality: 2
subclass of: Restriction
  author at start life: Marinus Vonhof
  date of start life: 2024-05-16
  on class: Pompput
  on property: has as part (inverse)
  qualified cardinality: 1
subclass of: Restriction
  author at start life: Wouter van Riel
  date of start life: 2024-04-22
  on class: Hoogte compartiment
  on property: has as aspect
  max qualified cardinality: 1

Aantal i.e.
definition: [NEN 3300:1996] berekeningseenheid om de hoeveelheid vervuiling in afvalwater per inwoner per dag aan te geven
author at start life: Marinus Vonhof
date of start life: 2016-04-24
units of measurements: pcs
validity context: 15d
see also: [IRIS-RIOKEN:2012] Maat voor de belasting van het afvalwater met organische bestanddelen die een inwoner gemiddeld per dag produceert. Ook het afvalwater van bedrijven wordt in deze maat uitgedrukt.
alternative label: Aantal inwonerequivalenten
comment: [is aspect]
scope note: Cof BAS
scope note: Cof HYD
scope note: Cof DMO
type: Class
subclass of: Kenmerk
subclass of: Restriction
  on property: has as value
  all values from: integer

Aantal i.e. bedrijven
author of change: Marinus Vonhof
date of change: 2020-11-25
definition: Aantal inwonerequivalenten afkomstig van bedrijven
author at start life: Marinus Vonhof
date of start life: 2014-11-30
units of measurements: pcs
comment: [is aspect]
scope note: Cof BAS
scope note: Cof HYD
type: Class
subclass of: Aantal i.e.
subclass of: Restriction
  author of change: Marinus Vonhof
  date of change: 2014-12-01
  author at start life: Marinus Vonhof
  date of start life: 2011-12-15
  on class: Gemengd riool
  on property: has as aspect (inverse)
  max qualified cardinality: 1
subclass of: Restriction
  author of change: Marinus Vonhof
  date of change: 2018-05-03
  author at start life: Marinus Vonhof
  date of start life: 2011-12-15
  on class: Rioolput
  on property: has as aspect (inverse)
  max qualified cardinality: 1
subclass of: Restriction
  author at start life: Marinus Vonhof
  date of start life: 2015-03-01
  on class: Vuilwaterriool
  on property: has as aspect (inverse)
  max qualified cardinality: 1
subclass of: Restriction
  author at start life: Marinus Vonhof
  date of start life: 2017-08-31
  on class: Compartiment
  on property: has as aspect (inverse)
  max qualified cardinality: 1
subclass of: Restriction
  on property: has as value
  all values from: integer

Aantal i.e. per woning
author of change: Marinus Vonhof
date of change: 2017-12-07
definition: Gemiddeld aantal inwonerequivalenten per woning
author at start life: Marinus Vonhof
date of start life: 2015-03-01
units of measurements: pcs
comment: [is aspect]
scope note: Cof BAS
scope note: Cof HYD
type: Class
subclass of: Aantal i.e.
subclass of: Restriction
  on property: has as value
  all values from: integer

Aantal i.e. recreatie
author of change: Marinus Vonhof
date of change: 2020-11-25
definition: Aantal inwonerequivalenten afkomstig van recreatie
author at start life: Marinus Vonhof
date of start life: 2014-12-01
units of measurements: pcs
comment: [is aspect]
scope note: Cof BAS
scope note: Cof HYD
type: Class
subclass of: Aantal i.e.
subclass of: Restriction
  author of change: Marinus Vonhof
  date of change: 2018-05-03
  author at start life: Marinus Vonhof
  date of start life: 2014-12-01
  on class: Rioolput
  on property: has as aspect (inverse)
  max qualified cardinality: 1
subclass of: Restriction
  author at start life: Marinus Vonhof
  date of start life: 2014-12-01
  on class: Gemengd riool
  on property: has as aspect (inverse)
  max qualified cardinality: 1
subclass of: Restriction
  author at start life: Marinus Vonhof
  date of start life: 2015-03-01
  on class: Vuilwaterriool
  on property: has as aspect (inverse)
  max qualified cardinality: 1
subclass of: Restriction
  author at start life: Marinus Vonhof
  date of start life: 2017-08-31
  on class: Compartiment
  on property: has as aspect (inverse)
  max qualified cardinality: 1
subclass of: Restriction
  on property: has as value
  all values from: integer

Absoluut rioolstelsel
author of change: Johan Post
date of change: 2021-10-01
definition: [NEN 3300:1996] een gemengd rioolstelsel zonder overstort, eventueel voorzien van een nooduitlaat
author at start life: Marinus Vonhof
date of start life: 2012-04-29
scope note: Cof MDS
scope note: Cof REV
scope note: Cof HYD
scope note: Cof DMO
type: Class
subclass of: Gemengd rioolstelsel
subclass of: Restriction
  on property: heeft Doel
  has value: Verminderen vuilbelasting van oppervlaktewater

Gemengd rioolstelsel
author of change: Marinus Vonhof
author of change: Johan Post
author of change: Eric van Gorkom
date of change: 2024-05-16
date of change: 2021-10-01
date of change: 2024-05-13
definition: Een vrijverval rioolstelsel bestemd voor de inzameling, het transport en de tijdelijke berging van afvalwater.
definition: [NEN 3300:1996] Rioolstelsel, waarbij afvalwater door 1 leidingstelsel wordt getransporteerd
definition: [NEN-EN 752:2008] riolering ontworpen om zowel verontreinigd afvalwater als afgestroomd hemelwater in 1 leidingstelsel te transporteren [EN 1085:2007, definitie 2110]
author at start life: Finy Teitsma (Oranjewoud)
date of start life: 2007-10-23
comment: 20151014: NEN3300-definitie aangepast
alternative label: GWA stelsel
alternative label: Gemengd stelsel
scope note: Cof TOP
type: Class
subclass of: Vrijverval rioolstelsel
subclass of: Restriction
  author of change: Marinus Vonhof
  date of change: 2016-04-22
  author at start life: Finy Teitsma (Oranjewoud)
  date of start life: 2007-10-24
  validity context: 5t 11t
  on class: Lozingspunt
  on property: has as part
  min qualified cardinality: 1
subclass of: Restriction
  author of change: Marinus Vonhof
  date of change: 2016-04-24
  author at start life: Finy Teitsma (Oranjewoud)
  date of start life: 2007-10-23
  on class: Bezinkbassin
  on property: has as part
  min qualified cardinality: 0
subclass of: Restriction
  author of change: Marinus Vonhof
  date of change: 2016-04-24
  author at start life: Marinus Vonhof
  date of start life: 2013-10-01
  on class: Bergbezinkbassin
  on property: has as part
  min qualified cardinality: 0
subclass of: Restriction
  author of change: Marinus Vonhof
  date of change: 2016-04-24
  author at start life: Marinus Vonhof
  date of start life: 2014-04-30
  on class: Bergingsbassin
  on property: has as part
  min qualified cardinality: 0
subclass of: Restriction
  author of change: Marinus Vonhof
  date of change: 2016-04-24
  author at start life: Marinus Vonhof
  date of start life: 2016-04-22
  on class: Bergingsvijver
  on property: has as part
  min qualified cardinality: 0
subclass of: Restriction
  author of change: Marinus Vonhof
  date of change: 2019-04-30
  author at start life: Marinus Vonhof
  date of start life: 2014-04-30
  on class: Goot
  on property: has as part
  min qualified cardinality: 0
subclass of: Restriction
  author at start life: Marinus Vonhof
  date of start life: 2020-05-26
  validity context: *t
  on class: Gemengd riool
  on property: has as part
  min qualified cardinality: 1
subclass of: Restriction
  author at start life: Marinus Vonhof
  date of start life: 2020-05-26
  on class: Hemelwaterriool
  on property: has as part
  min qualified cardinality: 0
subclass of: Restriction
  author at start life: Marinus Vonhof
  date of start life: 2020-05-26
  on class: Rioolgemaal
  on property: has as part
  min qualified cardinality: 0
subclass of: Restriction
  author at start life: Marinus Vonhof
  date of start life: 2020-05-26
  on class: Vuilwaterriool
  on property: has as part
  min qualified cardinality: 0
subclass of: Restriction
  author at start life: Marinus Vonhof
  date of start life: 2024-05-16
  on class: Externe overstortput
  on property: has as part
  min qualified cardinality: 0
subclass of: Restriction
  on property: heeft Functie
  has value: Inzameling van hemelwater en vuilwater
subclass of: Restriction
  on property: heeft Functie
  has value: Tijdelijke berging van hemelwater en vuilwater
subclass of: Restriction
  on property: heeft Functie
  has value: Transport van hemelwater en vuilwater

Levensvorm
author of change: Marinus Vonhof
date of change: 2016-04-24
definition: Iets dat in staat is tot leven
author at start life: Marinus Vonhof
date of start life: 2014-11-29
validity context: *f 15d
scope note: Cof TOP
type: Class

Adresgegevens
author of change: Marinus Vonhof
author of change: Johan Post
date of change: 2018-12-05
date of change: 2026-05-01
author at start life: Marinus Vonhof
date of start life: 2013-03-29
validity context: 5d 11d 15d 16d
comment: BAG / StUF-berichten - ADR Adres
see also: [NEN 5826:2002] de verzameling van gegevens voor de aanduiding van een individuele woon- of bedrijfseenheid dan wel de aanduiding van een bestemming
alternative label: Adres-informatie
comment: [is aspect]
scope note: Cof TOP
type: Class
subclass of: Kenmerk
subclass of: Restriction
  author at start life: Eric van Gorkom
  date of start life: 2021-11-23
  on class: Gebouw
  on property: has as aspect (inverse)
  max qualified cardinality: 1
subclass of: Restriction
  author at start life: Eric van Gorkom
  date of start life: 2021-11-23
  on class: Gemaal
  on property: has as aspect (inverse)
  max qualified cardinality: 1
subclass of: Restriction
  author at start life: Marinus Vonhof
  date of start life: 2020-05-28
  on class: Put
  on property: has as aspect (inverse)
  max qualified cardinality: 1

Gebouw
author of change: Marinus Vonhof
author of change: Eric van Gorkom
date of change: 2025-01-16
date of change: 2024-05-13
date of change: 2021-12-24
definition: [IMBOR] Overdekte en geheel of gedeeltelijk met wanden omsloten constructief zelfstandige eenheid bedoeld voor het in een afgeschermde omgeving onderbrengen van mensen, dieren of voorwerpen of voor de productie van goederen.
author at start life: Nic Roest (Idoro)
date of start life: 2007-11-29
validity context: *d
see also: [NEN 3610:2010] Vrijstaande, overdekte en geheel of gedeeltelijke met wanden omsloten toegankelijke ruimte, die direct of indirect met de grond is verbonden.
scope note: Cof TOP
type: Class
subclass of: Bouwwerk
subclass of: Restriction
  author at start life: Eric van Gorkom
  date of start life: 2021-11-23
  on class: Adresgegevens
  on property: has as aspect
  max qualified cardinality: 1
subclass of: Restriction
  on property: heeft Uitvoering
  has value: Vrijstaand, overdekt, omsloten en toegankelijk

Gemaal
label: Pumping station @en
author of change: Johan Post
author of change: Eric van Gorkom
date of change: 2021-11-23
date of change: 2026-05-18
definition: Een constructie ten behoeve van het verplaatsen van water
definition: [EN 16323:2014] buildings, structures and equipment used to transfer wastewater through a rising main or otherwise to raise the wastewater @en
author at start life: Marinus Vonhof
date of start life: 2014-03-18
validity context: *f
scope note: Cof TOP
type: Class
subclass of: Bouwwerk
subclass of: Restriction
  author of change: Marinus Vonhof
  date of change: 2017-08-19
  author at start life: Finy Teitsma (Oranjewoud)
  date of start life: 2006-02-25
  comment: per definitie
  on class: Pomp
  on property: has as part
  min qualified cardinality: 1
subclass of: Restriction
  author of change: Marinus Vonhof
  date of change: 2019-07-11
  author at start life: Finy Teitsma (Oranjewoud)
  date of start life: 2006-02-25
  on class: Pompschakeling
  on property: has as aspect
  max qualified cardinality: 1
subclass of: Restriction
  author of change: Marinus Vonhof
  date of change: 2018-05-03
  author at start life: Marinus Vonhof
  date of start life: 2016-04-24
  comment: per definitie
  on class: Compartiment
  on property: has as part
  min qualified cardinality: 0
subclass of: Restriction
  author of change: Marinus Vonhof
  date of change: 2018-12-12
  author at start life: Marinus Vonhof
  date of start life: 2018-12-06
  comment: Temporeel kenmerk, met kenmerk Inwinning
  on class: Capaciteit gemaal
  on property: has as aspect
  min qualified cardinality: 1
subclass of: Restriction
  author at start life: Eric van Gorkom
  date of start life: 2021-11-23
  on class: Adresgegevens
  on property: has as aspect
  max qualified cardinality: 1
subclass of: Restriction
  author at start life: Marinus Vonhof
  date of start life: 2020-04-18
  on class: Ontwerpcapaciteit gemaal
  on property: has as aspect
  qualified cardinality: 1
subclass of: Restriction
  author at start life: Marinus Vonhof
  date of start life: 2026-07-17
  on class: Keerklep
  on property: has as part
  min qualified cardinality: 0
subclass of: Restriction
  on property: heeft Functie
  has value: Verpompen van water

Afdekking
author of change: Eric van Gorkom
date of change: 2022-09-27
author at start life: Marinus Vonhof
date of start life: 2016-04-15
validity context: 5d 10d 11d 12f 13d 14f
scope note: Cof TOP
type: Class
subclass of: Constructieonderdeel
subclass of: Restriction
  author at start life: Finy Teitsma (Oranjewoud)
  date of start life: 2006-02-25
  on property: has as aspect
  some values from: Materiaal afdekking
subclass of: Restriction
  validity context: 12t 14t
  on class: Materiaal afdekking
  on property: has as aspect
  max qualified cardinality: 1
subclass of: Restriction
  on property: heeft Functie
  has value: Afdekken

Constructieonderdeel
author of change: Marinus Vonhof
author of change: Johan Post
date of change: 2025-01-16
date of change: 2015-10-22
date of change: 2024-05-01
definition: [IMBOR] Een onderdeel van een objecttype dat als zelfstandig objecttype beheerd kan worden.
author at start life: Marinus Vonhof
date of start life: 2013-09-28
validity context: *f 15d
scope note: Cof TOP
type: Class
subclass of: Fysiek object
subclass of: Restriction
  on property: heeft Toepassing
  has value: Deel van een op zichzelf staande constructie

Materiaal afdekking
label: Material of cover @en
author of change: Marinus Vonhof
author of change: Eric van Gorkom
date of change: 2016-04-23
date of change: 2022-09-27
definition: [EN13508-2+A1] The material in accordance with Table C.4 @en
notation: CCP
notation: JCP
author at start life: Marinus Vonhof
date of start life: 2014-09-16
comment: Intrinsiek aspect
comment: [is aspect]
scope note: Cof TOP
type: Class
subclass of: Materiaal
subclass of: Restriction
  author of change: Marinus Vonhof
  date of change: 2015-02-22
  author at start life: Finy Teitsma (Oranjewoud)
  date of start life: 2006-02-25
  on class: Afdekking
  on property: has as aspect (inverse)
  max qualified cardinality: 1
subclass of: Restriction
  on property: has as reference (qualification)
  all values from: Materiaal deksel (coll)

Vrijverval rioolleiding
author of change: Johan Post
author of change: Eric van Gorkom
author of change: Wouter van Riel
date of change: 2021-11-23
date of change: 2024-04-23
date of change: 2024-10-21
definition: Een gesloten rioolleiding waarin het afvalwater door de zwaartekracht wordt getransporteerd.
definition: [NEN 3300:1996] riool waardoor afvalwater door middel van de zwaartekracht wordt getransporteerd
definition: [NEN-EN 752:2008] leiding of andere constructie, gewoonlijk ondergronds, die afvalwater vanuit meer één dan lozingspunt transporteert [EN 1085:2007, definitie 2270]
notation: AAA
notation: GAA
author at start life: Finy Teitsma (Oranjewoud)
date of start life: 2006-11-29
validity context: *f 13d
see also: [IMKL:1.1/2008] Riool waardoor afvalwater door de zwaartekracht wordt getransporteerd (uit NEN 3300, Buitenriolering).
see also: [NEN 3398:2004] verzameling buizen tussen twee putten
alternative label: Inzamelleiding
alternative label: Vrijvervalriool
scope note: Cof TOP
type: Class
subclass of: Rioolleiding
subclass of: Restriction
  author of change: Marinus Vonhof
  date of change: 2017-03-06
  author at start life: Marinus Vonhof
  date of start life: 2014-04-29
  validity context: *t
  on class: Rioolput
  on property: is connected to
  min qualified cardinality: 1
subclass of: Restriction
  author of change: Marinus Vonhof
  date of change: 2017-03-06
  author at start life: Marinus Vonhof
  date of start life: 2014-04-29
  on class: Rioolput
  on property: is connected to
  max qualified cardinality: 2
subclass of: Restriction
  author of change: Marinus Vonhof
  date of change: 2016-04-15
  author at start life: Nic Roest (Idoro)
  date of start life: 2007-11-29
  validity context: 1t 10t 12t
  on class: Vrijverval rioolstelsel
  on property: has as part (inverse)
  qualified cardinality: 1
subclass of: Restriction
  author at start life: Marinus Vonhof
  date of start life: 2019-05-15
  on class: Profiel leiding
  on property: has as aspect
  max qualified cardinality: 1
subclass of: Restriction
  on property: heeft Structuur
  has value: Gesloten
subclass of: Restriction
  on property: heeft Technologie
  has value: Transport door de zwaartekracht
subclass of: Restriction
  on class: Continue lozing
  on property: has as aspect
  max qualified cardinality: 1

Mechanisme
author of change: Marinus Vonhof
date of change: 2021-01-09
definition: Bij activiteit: waarmee
author at start life: Marinus Vonhof
date of start life: 2014-04-29
validity context: 6d
comment: Onderscheidend kenmerk
comment: [is aspect]
scope note: Cof TOP
type: Class
subclass of: Onderscheidend kenmerk

Informatiedrager
author of change: Marinus Vonhof
date of change: 2013-12-01
definition: [Gellish] Is a medium intended or actually carrying physical objects from that properties information can be deducted. Typically paper that carries ink, magnetic fields on a disk or tape, electrically or optically modulated substances of electricity or light. @en
author at start life: Marinus Vonhof
date of start life: 2013-09-28
validity context: 10d 11d 12d 13d 14d 15d
scope note: Cof TOP
type: Class

Capaciteit
author of change: Marinus Vonhof
date of change: 2025-01-16
date of change: 2015-05-29
definition: [IMBOR] Vermogen tot opslaan of verwerken.
author at start life: Nic Roest (Idoro)
date of start life: 2006-02-21
validity context: 15d
comment: [is aspect]
scope note: Cof TOP
type: Class
subclass of: Kenmerk
subclass of: Restriction
  date of change: 2019-04-25
  author at start life: Marinus Vonhof
  date of start life: 2015-11-03
  on class: Inwinning
  on property: has as aspect
  max qualified cardinality: 1

Afslagniveau
author of change: Marinus Vonhof
date of change: 2018-05-03
definition: [NEN 3300:1996] peil waarop een pomp afslaat.
author at start life: Nic Roest (Idoro)
date of start life: 2006-02-21
units of measurements: m
see also: [IRIS-RIOKEN:2012] Ingesteld laag peil in de pompkelder van rioolgemaal. Als de riolering en de pompkelder tot aan het uitslagpeil is leeggepompt, wordt de bemaling beëindigd.
alternative label: Uitslagpeil
comment: [is aspect]
scope note: Cof MDS
scope note: Cof HYD
scope note: Cof RGM
type: Class
subclass of: Hoogte t.o.v. NAP
subclass of: Restriction
  on property: has as value
  all values from: decimal

Afslagniveau benedenstrooms
author of change: Marinus Vonhof
date of change: 2017-05-30
definition: Afslagniveau aan de uitlaatzijde van de pomp(en)
author at start life: Marinus Vonhof
date of start life: 2013-02-05
units of measurements: m
alternative label: Afslagniveau stroomafwaarts
comment: [is aspect]
scope note: Cof HYD
scope note: Cof RGM
type: Class
subclass of: Afslagniveau
subclass of: Restriction
  author of change: Marinus Vonhof
  date of change: 2016-04-23
  author at start life: Marinus Vonhof
  date of start life: 2013-02-05
  on class: Pomp
  on property: has as aspect (inverse)
  max qualified cardinality: 1
subclass of: Restriction
  on property: has as value
  all values from: decimal

Afslagniveau bovenstrooms
author of change: Marinus Vonhof
date of change: 2018-05-03
definition: Afslagniveau aan de inlaatzijde van de pomp(en)
author at start life: Marinus Vonhof
date of start life: 2013-02-05
units of measurements: m
alternative label: Afslagniveau stroomopwaarts
comment: [is aspect]
scope note: Cof HYD
scope note: Cof RGM
type: Class
subclass of: Afslagniveau
subclass of: Restriction
  author of change: Marinus Vonhof
  date of change: 2017-08-31
  author at start life: Marinus Vonhof
  date of start life: 2011-12-15
  on class: Pomp
  on property: has as aspect (inverse)
  max qualified cardinality: 1
subclass of: Restriction
  on property: has as value
  all values from: decimal

Mechanische afsluiter
author of change: Marinus Vonhof
author of change: Johan Post
author of change: Wouter van Riel
date of change: 2026-05-21
date of change: 2024-04-22
date of change: 2019-07-11
definition: Een doorlaat met een voorziening om de stroming te regelen
author at start life: Marinus Vonhof
date of start life: 2019-05-15
validity context: 14f
alternative label: Mechanische doorlaat
scope note: Cof MDS
scope note: Cof REV
scope note: Cof PLI
scope note: Cof HYD
scope note: Cof DMO
type: Class
subclass of: Doorlaat
subclass of: Restriction
  author of change: Marinus Vonhof
  date of change: 2019-05-15
  author at start life: Marinus Vonhof
  date of start life: 2013-02-05
  on class: Niveau benedenstrooms openen
  on property: has as aspect
  max qualified cardinality: 1
subclass of: Restriction
  author of change: Marinus Vonhof
  date of change: 2019-05-15
  author at start life: Marinus Vonhof
  date of start life: 2013-02-05
  on class: Niveau benedenstrooms sluiten
  on property: has as aspect
  max qualified cardinality: 1
subclass of: Restriction
  author of change: Marinus Vonhof
  date of change: 2019-05-15
  author at start life: Marinus Vonhof
  date of start life: 2013-02-05
  on class: Niveau bovenstrooms openen
  on property: has as aspect
  max qualified cardinality: 1
subclass of: Restriction
  author of change: Marinus Vonhof
  date of change: 2019-05-15
  author at start life: Marinus Vonhof
  date of start life: 2013-02-05
  on class: Niveau bovenstrooms sluiten
  on property: has as aspect
  max qualified cardinality: 1
subclass of: Restriction
  author of change: Marinus Vonhof
  date of change: 2019-05-16
  author at start life: Marinus Vonhof
  date of start life: 2014-04-29
  on class: Bijzondere putconstructie
  on property: has as part (inverse)
  max qualified cardinality: 1
subclass of: Restriction
  author of change: Marinus Vonhof
  date of change: 2020-04-17
  author at start life: Marinus Vonhof
  date of start life: 2014-12-02
  on class: Transportleiding
  on property: is connected to
  max qualified cardinality: 2
subclass of: Restriction
  author at start life: Wouter van Riel
  date of start life: 2022-09-26
  on class: Overstortput
  on property: has as part (inverse)
  max qualified cardinality: 1
subclass of: Restriction
  on property: heeft Technologie
  has value: Mechanisch

Afsluitstuk (eindkap)
author of change: Marinus Vonhof
date of change: 2017-12-13
definition: Een hulpstuk bestemd voor het afsluiten van een leiding.
author at start life: Finy Teitsma (Oranjewoud)
date of start life: 2006-11-29
alternative label: Eindkap
scope note: Cof MDS
scope note: Cof PLI
scope note: Cof HYD
type: Class
subclass of: Hulpstuk
subclass of: Restriction
  on property: heeft Functie
  has value: Afsluiten van leidingen

Hulpstuk
author of change: Marinus Vonhof
author of change: Johan Post
author of change: Wouter van Riel
date of change: 2025-01-16
date of change: 2022-09-30
date of change: 2026-05-18
date of change: 2021-09-24
definition: [NEN 3300:1996] Verzamelnaam voor een constructieonderdeel van de riolering met een speciaal doel, zoals verloopstuk, overgangsstuk, ontstoppingsstuk
author at start life: Marinus Vonhof
date of start life: 2017-12-13
validity context: *f
scope note: Cof MDS
scope note: Cof LDR
scope note: Cof REV
scope note: Cof PLI
scope note: Cof HYD
type: Class
subclass of: Constructieonderdeel
subclass of: Restriction
  author of change: Marinus Vonhof
  date of change: 2017-12-13
  author at start life: Marinus Vonhof
  date of start life: 2013-03-29
  validity context: 5t 10t 11t 14t
  on class: Hulpstukoriëntatie
  on property: has as aspect
  max qualified cardinality: 1
subclass of: Restriction
  on property: heeft Toepassing
  has value: Onderdeel van een leiding

Systeem
author of change: Marinus Vonhof
date of change: 2015-05-25
date of change: 2022-10-01
definition: De fysieke samenstelling van stelsels en inrichtingen die een functionele eenheid vormen
author at start life: Marinus Vonhof
date of start life: 2013-10-02
validity context: *f 10d 13d 14d 15d
scope note: Cof TOP
type: Class
subclass of: Fysiek object
subclass of: Restriction
  author at start life: Marinus Vonhof
  date of start life: 2020-04-20
  on class: Gebiedsoriëntatie
  on property: has as aspect
  max qualified cardinality: 1
subclass of: Restriction
  on property: heeft Uitvoering
  has value: Geheel van stelsels

Transportstelsel
author of change: Marinus Vonhof
date of change: 2025-01-16
date of change: 2024-05-16
date of change: 2022-10-01
definition: [IMBOR] Voorzieningen voor het transport van afvalwater.
author at start life: Marinus Vonhof
date of start life: 2014-12-02
validity context: *f
scope note: Cof TOP
type: Class
subclass of: Stelsel
subclass of: Restriction
  on property: heeft Functie
  has value: Transport van afvalwater

Rioolstelsel
label: Sewer system @en
definition: [EN 16323:2014] network of pipelines and ancillary works that conveys wastewater from drains to a treatment plant or other place of disposal @en
definition: [NEN 3300:1996] Het geheel aan voorzieningen voor de inzameling en het transport van afvalwater met uitzondering van zuiveringstechnische werken
definition: [NEN 3300:1996] Samenhangend geheel van riolen en rioolputten en de bijbehorende voorzieningen voor de inzameling en het transport van afvalwater
author at start life: Marinus Vonhof
date of start life: 2014-12-02
validity context: *f
alternative label: Riolering
alternative label: Rioleringsnet
scope note: Cof TOP
type: Class
subclass of: Stelsel
subclass of: Restriction
  author at start life: Marinus Vonhof
  date of start life: 2017-12-12
  on class: Hydraulisch rioleringsmodel
  on property: is represented by
  max qualified cardinality: 1
subclass of: Restriction
  on property: heeft Functie
  has value: Inzameling van afvalwater
subclass of: Restriction
  on property: heeft Functie
  has value: Transport van afvalwater

Afvloeiingscoëfficiënt
label: Runoff coefficient @en
definition: [EN 16323:2014] factor dependent on the ground catchment, and by which the rainwater quantity per unit of time is multiplied in order to indicate the flow expected to be carried to the drain or sewer system @en
definition: [NEN 3300:1996] coëfficiënt toegepast op het, volgens de berekening, aangenomen naar de riolering afvoerende oppervlak
definition: [NEN-EN 752:2008] factor die afhankelijk is van het afvoerend oppervlak en waarmee de hoeveelheid regenwater per tijdseenheid moet worden vermenigvuldigd om de verwachte instroom naar het systeem van aansluitleidingen of de buitenriolering af te schatten
author at start life: Johan Post
date of start life: 2026-05-21
comment: [is aspect]
scope note: Cof HYD
type: Class
subclass of: Kenmerk
subclass of: Restriction
  on property: has as value
  all values from: Afvloeiingscoëfficiënt (datatype)

Transportleiding
author of change: Marinus Vonhof
author of change: Johan Post
author of change: Wouter van Riel
date of change: 2025-01-16
date of change: 2024-04-23
date of change: 2026-05-13
date of change: 2025-04-02
definition: [IMBOR] Leiding met als functie de voortgeleiding van materie met mechanische en vrijverval leidingen als subtypen.
author at start life: Marinus Vonhof
date of start life: 2014-12-02
validity context: *f
scope note: Cof TOP
type: Class
subclass of: Leiding
subclass of: Restriction
  author of change: Marinus Vonhof
  date of change: 2020-04-17
  author at start life: Marinus Vonhof
  date of start life: 2014-12-02
  on class: Mechanische afsluiter
  on property: is connected to
  max qualified cardinality: 2
subclass of: Restriction
  author at start life: Marinus Vonhof
  date of start life: 2024-05-16
  on class: Rioolafsluiter
  on property: has as part
  max qualified cardinality: 1
subclass of: Restriction
  author at start life: Marinus Vonhof
  date of start life: 2024-05-16
  on class: SDR-waarde
  on property: has as aspect
  max qualified cardinality: 1
subclass of: Restriction
  author at start life: Marinus Vonhof
  date of start life: 2026-07-20
  on class: Doorlaat
  on property: has as part
  min qualified cardinality: 0
subclass of: Restriction
  on property: heeft Functie
  has value: Transport van afvalwater
subclass of: Restriction
  on class: Verbindingsstuk
  on property: has as part
  min qualified cardinality: 0

Afvoercoëfficiënt
label: Discharge coefficient @en
author of change: Johan Post
date of change: 2026-05-21
definition: factor om de afvoer onder ideale omstandigheden voor verliezen door randcondities, stromingsweerstand en geometrie te corrigeren
author at start life: Marinus Vonhof
date of start life: 2011-12-15
comment: [is aspect]
scope note: Cof MDS
scope note: Cof HYD
type: Class
subclass of: Kenmerk
subclass of: Restriction
  author of change: Marinus Vonhof
  date of change: 2019-03-20
  author at start life: Marinus Vonhof
  date of start life: 2011-12-15
  validity context: 5t 11t
  on class: Stuwmuur
  on property: has as aspect (inverse)
  max qualified cardinality: 1
subclass of: Restriction
  author at start life: Marinus Vonhof
  date of start life: 2015-09-20
  validity context: 5t 11t
  on class: Overstortdrempel
  on property: has as aspect (inverse)
  max qualified cardinality: 1
subclass of: Restriction
  on property: has as value
  all values from: Afvoercoëfficiënt (datatype)

Stuwmuur
author of change: Marinus Vonhof
author of change: Johan Post
date of change: 2025-01-16
date of change: 2024-05-01
date of change: 2015-07-28
date of change: 2026-07-02
definition: [IMBOR] Een onderdeel bestaande uit muur die als functie heeft het keren van water.
author at start life: Marinus Vonhof
date of start life: 2013-09-28
comment: Als de stuwmuur geen drempniveau heeft is er geen overstort mogelijk, er wordt van uitgegaan dat de muur tot aan de bovenzijde van de put reikt.
scope note: Cof MDS
scope note: Cof REV
scope note: Cof HYD
scope note: Cof DMO
type: Class
subclass of: Wand
subclass of: Restriction
  author of change: Marinus Vonhof
  date of change: 2019-03-20
  author at start life: Marinus Vonhof
  date of start life: 2011-12-15
  validity context: 5t 11t 14t
  on class: Afvoercoëfficiënt
  on property: has as aspect
  max qualified cardinality: 1
subclass of: Restriction
  author of change: Marinus Vonhof
  date of change: 2026-07-20
  author at start life: Marinus Vonhof
  date of start life: 2019-03-20
  comment: Temporeel kenmerk, met kenmerk Inwinning
  on class: Drempelniveau
  on property: has as aspect
  min qualified cardinality: 0
subclass of: Restriction
  author at start life: Marinus Vonhof
  date of start life: 2017-03-29
  on class: Stuwconstructie
  on property: has as part (inverse)
  qualified cardinality: 1
subclass of: Restriction
  author at start life: Marinus Vonhof
  date of start life: 2017-12-07
  on class: Stuwput
  on property: has as part (inverse)
  qualified cardinality: 1
subclass of: Restriction
  author at start life: Marinus Vonhof
  date of start life: 2019-03-20
  validity context: 11t 14t
  on class: Vrije overstorthoogte
  on property: has as aspect
  max qualified cardinality: 1
subclass of: Restriction
  author at start life: Marinus Vonhof
  date of start life: 2019-03-20
  validity context: 5t 11t 14t
  on class: Drempelbreedte
  on property: has as aspect
  max qualified cardinality: 1
subclass of: Restriction
  author at start life: Marinus Vonhof
  date of start life: 2019-03-20
  validity context: 5t 11t 14t
  on class: Stromingsrichting
  on property: has as aspect
  max qualified cardinality: 1
subclass of: Restriction
  on property: heeft Functie
  has value: Keren van water

Overstortdrempel
author of change: Marinus Vonhof
author of change: Johan Post
date of change: 2025-01-16
date of change: 2024-05-01
date of change: 2026-07-02
definition: [IMBOR] De bovenste rand van een constructie om pieken in water toevoer te regelen, door water over deze rand te storten wanneer de toegevoerde waterhoeveelheid een bepaald volume overschrijdt.
notation: OVS
author at start life: Marinus Vonhof
date of start life: 2011-12-15
validity context: 1d
scope note: Cof MDS
scope note: Cof REV
scope note: Cof HYD
scope note: Cof DMO
type: Class
subclass of: Wand
subclass of: Restriction
  author of change: Marinus Vonhof
  date of change: 2019-09-02
  author at start life: Finy Teitsma (Oranjewoud)
  date of start life: 2006-02-25
  validity context: 12t
  comment: Temporeel kenmerk, met kenmerk Inwinning
  on class: Drempelniveau
  on property: has as aspect
  min qualified cardinality: 1
subclass of: Restriction
  author of change: Marinus Vonhof
  date of change: 2021-08-06
  author at start life: Finy Teitsma (Oranjewoud)
  date of start life: 2006-02-25
  on class: Overstortput
  on property: has as part (inverse)
  qualified cardinality: 1
subclass of: Restriction
  author of change: Marinus Vonhof
  date of change: 2017-12-07
  author at start life: Marinus Vonhof
  date of start life: 2011-12-15
  validity context: 5t 11t 14t
  on class: Stromingsrichting
  on property: has as aspect
  max qualified cardinality: 1
subclass of: Restriction
  author of change: Marinus Vonhof
  date of change: 2017-12-07
  author at start life: Marinus Vonhof
  date of start life: 2015-09-20
  validity context: 11t 14t
  on class: Vrije overstorthoogte
  on property: has as aspect
  max qualified cardinality: 1
subclass of: Restriction
  author of change: Marinus Vonhof
  date of change: 2021-08-05
  author at start life: Marinus Vonhof
  date of start life: 2015-05-29
  on class: Overstortconstructie
  on property: has as part (inverse)
  qualified cardinality: 1
subclass of: Restriction
  author at start life: Finy Teitsma (Oranjewoud)
  date of start life: 2006-02-25
  validity context: 5t 11t 14t
  on class: Drempelbreedte
  on property: has as aspect
  max qualified cardinality: 1
subclass of: Restriction
  author at start life: Marinus Vonhof
  date of start life: 2015-09-20
  validity context: 5t 11t 14t
  on class: Afvoercoëfficiënt
  on property: has as aspect
  max qualified cardinality: 1
subclass of: Restriction
  author at start life: Marinus Vonhof
  date of start life: 2019-05-15
  on class: Slokop
  on property: has as part (inverse)
  qualified cardinality: 1
subclass of: Restriction
  on property: heeft Functie
  has value: Keren van water

Afvoerend oppervlak
label: Catchment area @en
author of change: Marinus Vonhof
author of change: Wouter van Riel
date of change: 2014-05-11
date of change: 2024-04-20
definition: Het oppervlak van de bovenlaag dat water afvoert naar het object
definition: [EN 16323:2014] area draining to a drain, sewer or watercourse @en
definition: [NEN 3300:1996] het naar de riolering afwaterende oppervlak
author at start life: Marinus Vonhof
date of start life: 2011-12-15
units of measurements: m2
validity context: 1d 3d 10d 12d 15d
comment: [is aspect]
scope note: Cof MDS
scope note: Cof HYD
scope note: Cof DMO
type: Class
subclass of: Kenmerk
subclass of: Restriction
  author of change: Marinus Vonhof
  date of change: 2018-05-03
  author at start life: Marinus Vonhof
  date of start life: 2014-12-02
  validity context: 5t 11t
  on class: Rioolput
  on property: has as aspect (inverse)
  max qualified cardinality: 1
subclass of: Restriction
  author of change: Marinus Vonhof
  date of change: 2018-05-03
  author at start life: Marinus Vonhof
  date of start life: 2014-12-02
  on class: Compartiment
  on property: has as aspect (inverse)
  max qualified cardinality: 1
subclass of: Restriction
  author at start life: Marinus Vonhof
  date of start life: 2017-08-31
  validity context: 5t 11t
  on class: Gemengd riool
  on property: has as aspect (inverse)
  max qualified cardinality: 1
subclass of: Restriction
  author at start life: Marinus Vonhof
  date of start life: 2017-08-31
  validity context: 5t 11t
  on class: Hemelwaterriool
  on property: has as aspect (inverse)
  max qualified cardinality: 1
subclass of: Restriction
  author at start life: Marinus Vonhof
  date of start life: 2019-05-15
  validity context: 5t 11t
  on class: Open leiding
  on property: has as aspect (inverse)
  max qualified cardinality: 1
subclass of: Restriction
  date of change: 2022-11-25
  on class: Inwinning
  on property: has as aspect
  max qualified cardinality: 1
subclass of: Restriction
  on property: has as value
  all values from: decimal

Open leiding
author of change: Marinus Vonhof
date of change: 2019-04-30
definition: Een rioolleiding waarvan de bovenzijde niet is afgesloten.
notation: OPL
author at start life: Marinus Vonhof
author at start life: Finy Teitsma (Oranjewoud)
date of start life: 2006-03-23
validity context: *f
scope note: Cof MDS
scope note: Cof REV
scope note: Cof HYD
type: Class
subclass of: Leiding
subclass of: Restriction
  author of change: Marinus Vonhof
  date of change: 2022-10-02
  author at start life: Marinus Vonhof
  date of start life: 2019-05-15
  on class: Afvoerend oppervlak
  on property: has as aspect
  max qualified cardinality: 12
subclass of: Restriction
  on property: heeft Structuur
  has value: Open

Afvoerend oppervlak hellend
author of change: Marinus Vonhof
date of change: 2016-04-24
definition: Afvoerend oppervlak met een helling groter dan 4%
author at start life: Marinus Vonhof
date of start life: 2011-12-15
units of measurements: m2
comment: [is aspect]
scope note: Cof MDS
scope note: Cof HYD
type: Class
subclass of: Afvoerend oppervlak
subclass of: Restriction
  on property: has as value
  all values from: decimal

Afvoerend oppervlak vlak
definition: Afvoerend oppervlak met een helling kleiner of gelijk aan 4% en anders dan vlak uitgestrekt afvoerend oppervlak
author at start life: Marinus Vonhof
date of start life: 2011-12-15
units of measurements: m2
comment: [is aspect]
scope note: Cof MDS
scope note: Cof HYD
type: Class
subclass of: Afvoerend oppervlak
subclass of: Restriction
  on property: has as value
  all values from: decimal

Afvoerend oppervlak vlak uitgestrekt
author of change: Marinus Vonhof
date of change: 2016-04-24
definition: Oppervlak met een afstroomlengte naar het lozingspunt op het rioolstelsel die groter is dan 100 m. Bijvoorbeeld: platte daken van fabrieken of parkeerplaatsen.
author at start life: Marinus Vonhof
date of start life: 2011-12-15
units of measurements: m2
comment: [is aspect]
scope note: Cof MDS
scope note: Cof HYD
type: Class
subclass of: Afvoerend oppervlak
subclass of: Restriction
  on property: has as value
  all values from: decimal

Representatie fysiek object
author of change: Marinus Vonhof
date of change: 2017-12-12
date of change: 2024-07-17
definition: Een topologisch element met als enige functie het dragen van de geometrie voor het representeren van fysieke objecten. Het vormt dus geen onderdeel van een netwerkdefinitie
author at start life: Marinus Vonhof
date of start life: 2013-02-03
scope note: Cof TOP
type: Class
subclass of: Topologisch element

Gebied
author of change: Marinus Vonhof
date of change: 2017-11-16
date of change: 2024-11-22
author at start life: Marinus Vonhof
date of start life: 2014-11-29
validity context: *f
see also: [IRIS-RIOKEN:2012] Het geheel van virtuele en fysieke (aanwijsbare) opdelingen en indelingen van het aardoppervlak.
alternative label: Ruimtelijk gebied
scope note: Cof TOP
type: Class
subclass of: Ruimte
subclass of: Restriction
  author of change: Marinus Vonhof
  date of change: 2016-11-09
  author at start life: Marinus Vonhof
  date of start life: 2015-07-28
  on class: Gebiedsoriëntatie
  on property: has as aspect
  max qualified cardinality: 1

Reservoir
author of change: Marinus Vonhof
author of change: Wouter van Riel
date of change: 2025-01-16
date of change: 2024-04-22
date of change: 2017-08-21
definition: Constructies met een specifieke functie binnen het rioolstelsel.
definition: Een natuurlijk of kunstmatig gebied dat gebruikt wordt om water op te slaan
author at start life: Marinus Vonhof
date of start life: 2013-03-30
validity context: *f 12f 13d
scope note: Cof TOP
type: Class
subclass of: Bouwwerk
subclass of: Restriction
  author of change: Marinus Vonhof
  date of change: 2018-05-03
  author at start life: Marinus Vonhof
  date of start life: 2017-08-19
  on class: Compartiment
  on property: has as part
  min qualified cardinality: 0
subclass of: Restriction
  author at start life: Marinus Vonhof
  date of start life: 2018-12-06
  on class: Bergend oppervlak
  on property: has as aspect
  max qualified cardinality: 1
subclass of: Restriction
  on property: heeft Uitvoering
  has value: Natuurlijk of kunstmatig gebied
subclass of: Restriction
  on property: heeft Functie
  has value: Opslag van water

Stelsel
author of change: Marinus Vonhof
date of change: 2025-01-16
date of change: 2014-12-02
date of change: 2022-10-01
definition: Een netwerk van leidingen en aanverwante constructies
author at start life: Marinus Vonhof
date of start life: 2012-04-29
validity context: *f
scope note: Cof TOP
type: Class
subclass of: Fysiek object
subclass of: Restriction
  author at start life: Marinus Vonhof
  date of start life: 2020-04-20
  validity context: 14t
  on class: Gebiedsoriëntatie
  on property: has as aspect
  max qualified cardinality: 1
subclass of: Restriction
  on property: heeft Uitvoering
  has value: Netwerk van verbonden knooppunten

Verbinding
author of change: Marinus Vonhof
date of change: 2024-07-17
date of change: 2017-12-22
definition: De verbinding van de knopen binnen de netwerkdefinitie
author at start life: Marinus Vonhof
date of start life: 2013-09-03
see also: [SUF-HYD 1.10] Een stroomvoerend element
scope note: Cof TOP
type: Class
subclass of: Edge

Lijn
author of change: Marinus Vonhof
author of change: Johan Post
date of change: 2019-05-15
date of change: 2024-05-02
definition: Eéndimensionaal geometrisch element. Voor geografische beschrijvingen conform het coordinatenstelsel EPSG:7415 (x/y conform EPSG:28992, optioneel z conform EPSG:5709).
author at start life: Marinus Vonhof
date of start life: 2016-11-09
units of measurements: gml
comment: [is aspect]
scope note: Cof TOP
type: Class
subclass of: Geometrie
subclass of: Restriction
  author of change: Marinus Vonhof
  date of change: 2020-04-18
  author at start life: Marinus Vonhof
  date of start life: 2016-11-09
  on class: Leidingoriëntatie
  on property: has as aspect (inverse)
  max qualified cardinality: 1
subclass of: Restriction
  on property: has as value
  all values from: gmlLiteral
subclass of: Restriction
  on class: Constructieonderdeeloriëntatie
  on property: has as aspect (inverse)
  max qualified cardinality: 1

Bouwwerk
author of change: Marinus Vonhof
author of change: Johan Post
author of change: Eric van Gorkom
date of change: 2025-01-16
date of change: 2024-05-01
date of change: 2021-11-23
definition: [IMBOR] Gegevens die specifiek zijn voor een met de aarde verbonden duurzaam constructie, dat niet valt onder de definities van een pand of kunstwerk.
definition: [Omgevingswet] Constructie van enige omvang van hout, steen, metaal of ander materiaal, die op de plaats van bestemming hetzij direct of indirect met de grond verbonden is, hetzij direct of indirect steun vindt in of op de grond, bedoeld om ter plaatse te functioneren, met inbegrip van de daarvan deel uitmakende bouwwerkgebonden installaties
author at start life: Marinus Vonhof
date of start life: 2016-04-20
validity context: *f
scope note: Cof TOP
type: Class
subclass of: Fysiek object
subclass of: Restriction
  author of change: Marinus Vonhof
  date of change: 2017-08-21
  author at start life: Finy Teitsma (Oranjewoud)
  date of start life: 2006-02-25
  validity context: 5t 11t 14t
  comment: Vorm = niet rond
  on class: Breedte bouwwerk
  on property: has as aspect
  max qualified cardinality: 1
subclass of: Restriction
  author of change: Marinus Vonhof
  date of change: 2017-08-21
  author at start life: Finy Teitsma (Oranjewoud)
  date of start life: 2006-02-25
  validity context: 5t 11t
  comment: Vorm = niet rond
  on class: Lengte bouwwerk
  on property: has as aspect
  max qualified cardinality: 1
subclass of: Restriction
  author of change: Marinus Vonhof
  date of change: 2017-08-21
  author at start life: Finy Teitsma (Oranjewoud)
  date of start life: 2006-02-25
  validity context: 5t 11t
  on class: Vorm bouwwerk
  on property: has as aspect
  max qualified cardinality: 1
subclass of: Restriction
  author of change: Marinus Vonhof
  date of change: 2017-08-21
  author at start life: Finy Teitsma (Oranjewoud)
  date of start life: 2006-02-25
  on class: Hoogte bouwwerk
  on property: has as aspect
  max qualified cardinality: 1
subclass of: Restriction
  author of change: Marinus Vonhof
  date of change: 2018-05-03
  author at start life: Marinus Vonhof
  date of start life: 2017-08-19
  validity context: 5t 10t 11t 14t
  on class: Bouwwerkoriëntatie
  on property: has as aspect
  max qualified cardinality: 1
subclass of: Restriction
  author of change: Marinus Vonhof
  date of change: 2018-12-05
  author at start life: Marinus Vonhof
  date of start life: 2018-09-03
  on class: Straat
  on property: has as part (inverse)
  max qualified cardinality: 1
subclass of: Restriction
  author at start life: Finy Teitsma (Oranjewoud)
  date of start life: 2006-02-25
  on property: has as aspect
  some values from: Breedte bouwwerk
subclass of: Restriction
  author at start life: Finy Teitsma (Oranjewoud)
  date of start life: 2006-02-25
  on property: has as aspect
  some values from: Hoogte bouwwerk
subclass of: Restriction
  author at start life: Finy Teitsma (Oranjewoud)
  date of start life: 2006-02-25
  on property: has as aspect
  some values from: Vorm bouwwerk
subclass of: Restriction
  author at start life: Marinus Vonhof
  date of start life: 2017-08-21
  validity context: 5t 11t 14t
  on class: Materiaal bouwwerk
  on property: has as aspect
  max qualified cardinality: 1
subclass of: Restriction
  author at start life: Marinus Vonhof
  date of start life: 2017-08-21
  on property: has as aspect
  some values from: Materiaal bouwwerk
subclass of: Restriction
  author at start life: Marinus Vonhof
  date of start life: 2018-09-03
  on class: Ondergrond
  on property: has as part (inverse)
  max qualified cardinality: 1
subclass of: Restriction
  on property: heeft Uitvoering
  has value: Constructie van enige omvang
subclass of: Restriction
  on property: heeft Uitvoering
  has value: Verbonden met de grond

Vorm leiding (coll)
comment: [is coll]
scope note: Cof MDS
scope note: Cof EN
scope note: Cof RRB
scope note: Cof REV
scope note: Cof HYD
type: Class
subclass of: Verzameling soorten
subclass of: Class
  one of: Rond
  one of: Rechthoekig
  one of: Eivormig
  one of: Eivormig omgekeerd
  one of: U-vorm

Vorm opening (coll)
comment: [is coll]
scope note: Cof TOP
type: Class
subclass of: Verzameling soorten
subclass of: Class
  one of: Rechthoekig
  one of: Rond
  one of: Anders (vorm)

Vorm put (coll)
comment: [is coll]
scope note: Cof TOP
type: Class
subclass of: Verzameling soorten
subclass of: Class
  one of: Rechthoekig
  one of: Rond
  one of: Anders (vorm)

Apparatuur
author of change: Marinus Vonhof
author of change: Johan Post
author of change: Wouter van Riel
date of change: 2025-01-16
date of change: 2024-05-01
date of change: 2017-05-31
date of change: 2024-04-22
date of change: 2024-12-16
definition: De apparatuur bestemd voor meten, regelen, controleren en onderhouden van het transport van afvalwater.
definition: [IMBOR] Een (vaak compact) mechanisch of elektronisch ding dat is gemaakt of toegepast voor een specifieke toepassing en doorgaans in één behuizing gevat is.
author at start life: Marinus Vonhof
date of start life: 2016-04-20
validity context: 1d 3d 10d 11d 12d 13d 14f 15d
alternative label: Apparaat
scope note: Cof TOP
type: Class
subclass of: Fysiek object
subclass of: Restriction
  on property: heeft Functie
  has value: Meten, regelen, controleren en onderhouden

Punt
author of change: Marinus Vonhof
date of change: 2026-07-24
definition: Nuldimensionaal element van geografische informatie. Conform coordinatenstelsel EPSG:7415 (x/y conform EPSG:28992, optioneel z conform EPSG:5709).
author at start life: Marinus Vonhof
date of start life: 2016-11-09
units of measurements: gml
comment: [is aspect]
scope note: Cof TOP
type: Class
subclass of: Geometrie
subclass of: Restriction
  author of change: Marinus Vonhof
  date of change: 2020-04-18
  author at start life: Marinus Vonhof
  date of start life: 2016-11-09
  on class: Aansluitpunt
  on property: has as aspect (inverse)
  qualified cardinality: 1
subclass of: Restriction
  author of change: Marinus Vonhof
  date of change: 2020-04-18
  author at start life: Marinus Vonhof
  date of start life: 2016-11-09
  on class: Knooppunt
  on property: has as aspect (inverse)
  qualified cardinality: 1
subclass of: Restriction
  author of change: Marinus Vonhof
  date of change: 2020-04-18
  author at start life: Marinus Vonhof
  date of start life: 2016-11-09
  on class: Putoriëntatie
  on property: has as aspect (inverse)
  qualified cardinality: 1
subclass of: Restriction
  author of change: Marinus Vonhof
  date of change: 2020-04-18
  author at start life: Marinus Vonhof
  date of start life: 2018-12-12
  on class: Maaiveldoriëntatie
  on property: has as aspect (inverse)
  max qualified cardinality: 1
subclass of: Restriction
  on property: has as value
  all values from: gmlLiteral

Materiaal deksel (coll)
author of change: Marinus Vonhof
date of change: 2025-12-19
comment: [is coll]
scope note: Cof TOP
type: Class
subclass of: Verzameling soorten
subclass of: Class

Materiaal (hydx) (coll)
comment: [is coll]
scope note: Cof HDX
type: Class
subclass of: Verzameling soorten
subclass of: Class
  one of: Beton
  one of: Gewapend beton
  one of: PVC
  one of: Asbestcement
  one of: Gres
  one of: Gietijzer
  one of: Metselwerk
  one of: Metselwerk (baksteen)
  one of: Metselwerk (bepleisterd)
  one of: Metselwerk (onbepleisterd)
  one of: HDPE
  one of: Polyester
  one of: Polyetheen
  one of: Polypropyleen
  one of: Plaatijzer
  one of: Staal

Materiaal leiding (coll)
author of change: Marinus Vonhof
author of change: Johan Post
date of change: 2026-05-04
date of change: 2025-12-19
comment: [is coll]
scope note: Cof TOP
type: Class
subclass of: Verzameling soorten
subclass of: Class

Materiaal put (coll)
author of change: Marinus Vonhof
author of change: Johan Post
author of change: Eric van Gorkom
date of change: 2026-05-04
date of change: 2022-10-03
date of change: 2026-05-21
date of change: 2024-05-13
author at start life: Marinus Vonhof
date of start life: 2026-05-01
comment: [is coll]
scope note: Cof TOP
type: Class
subclass of: Verzameling soorten
subclass of: Class

Unieke identificatie
label: Resource identifier @en
author of change: Marinus Vonhof
date of change: 2025-01-16
date of change: 2015-08-24
date of change: 2024-11-22
definition: [IMBOR] Een ondubbelzinnige en unieke aanduiding van een object.
author at start life: Nic Roest (Idoro)
date of start life: 2006-03-23
comment: [is aspect]
scope note: Cof TOP
type: Class
subclass of: Kenmerk

Materiaal
author of change: Marinus Vonhof
date of change: 2015-06-01
author at start life: Marinus Vonhof
date of start life: 2013-09-03
validity context: 15d
comment: [is aspect]
scope note: Cof TOP
type: Class
subclass of: Kenmerk

Materiaal lining (coll)
author at start life: Marinus Vonhof
date of start life: 2026-07-17
comment: [is coll]
scope note: Cof TOP
type: Class
subclass of: Verzameling soorten
subclass of: Class
  one of: Betonnen segmenten
  one of: Vezelcement
  one of: Glasvezel versterkte kunststof
  one of: Epoxy
  one of: Polyester

Rioolleiding
label: Pipeline (EN) @en
author of change: Johan Post
author of change: Eric van Gorkom
author of change: Wouter van Riel
date of change: 2022-09-27
date of change: 2024-04-23
date of change: 2026-05-13
definition: [EN 16323:2014] hollow structure for transporting wastewater between manholes or other structures @en
definition: [EN 16323:2014] pipeline or other construction, usually underground, designed to carry wastewater from more than one source @en
definition: [NEN 3300:1996] samenstel van buizen tussen twee putten bestemd voor de inzameling en/of het transport van afvalwater
author at start life: Marinus Vonhof
date of start life: 2014-04-28
validity context: *f
alternative label: Riool
alternative label: Rioolstreng
alternative label: Sewer @en
alternative label: Streng
scope note: Cof TOP
type: Class
subclass of: Leiding
subclass of: Oorzaakobject
subclass of: Restriction
  author of change: Marinus Vonhof
  date of change: 2024-05-16
  date of change: 2020-04-17
  author at start life: Finy Teitsma (Oranjewoud)
  date of start life: 2006-05-23
  on class: Rioolafsluiter
  on property: has as part
  max qualified cardinality: 1
subclass of: Restriction
  author at start life: Marinus Vonhof
  date of start life: 2024-05-16
  on class: SDR-waarde
  on property: has as aspect
  max qualified cardinality: 1
subclass of: Restriction
  author at start life: Marinus Vonhof
  date of start life: 2026-07-20
  on class: Doorlaat
  on property: has as part
  max qualified cardinality: 2
subclass of: Restriction
  on property: heeft Functie
  has value: Inzameling van afvalwater
subclass of: Restriction
  on property: heeft Functie
  has value: Transport van afvalwater

Balkeerklep
definition: Functioneert door middel van een inwendige bal die reageert op de vloeistofdruk.
author at start life: Marinus Vonhof
date of start life: 2026-07-17
scope note: Cof PLI
scope note: Cof HYD
type: Class
subclass of: Keerklep
subclass of: Restriction
  on property: heeft Uitvoering
  has value: Voorzien van een inwendige bal

Keerklep
label: Non-return valve @en
definition: [EN 16323:2014] device that prevents backflow of wastewater @en
author at start life: Marinus Vonhof
date of start life: 2026-07-17
validity context: 1d 3d
scope note: Cof PLI
scope note: Cof HYD
type: Class
subclass of: Mechanische afsluiter
subclass of: Restriction
  author of change: Marinus Vonhof
  date of change: 2019-05-15
  author at start life: Marinus Vonhof
  date of start life: 2014-04-29
  on class: Overstortput
  on property: has as part (inverse)
  max qualified cardinality: 1
subclass of: Restriction
  author of change: Marinus Vonhof
  date of change: 2019-05-15
  author at start life: Marinus Vonhof
  date of start life: 2015-05-29
  on class: Overstortconstructie
  on property: has as part (inverse)
  max qualified cardinality: 1
subclass of: Restriction
  author at start life: Marinus Vonhof
  date of start life: 2026-07-17
  on class: Gemaal
  on property: has as part (inverse)
  max qualified cardinality: 1
subclass of: Restriction
  author at start life: Marinus Vonhof
  date of start life: 2026-07-17
  on class: Uitlaatconstructie
  on property: has as part (inverse)
  max qualified cardinality: 1
subclass of: Restriction
  on property: heeft Functie
  has value: Afsluiten in één stroomrichting

Beginpunt leiding
label: Node 1 reference @en
author of change: Marinus Vonhof
date of change: 2016-04-24
definition: Het uiteinde van een leiding, anders dan het eindpunt. Ter plaatse van het leidingmidden op de bovenkant bodem.
definition: [EN13508-2+A1] The node reference of the second node as specified by the employing authority. @en
notation: AAD
notation: GAD
author at start life: Marinus Vonhof
date of start life: 2012-04-22
alternative label: Knooppuntreferentie 1
scope note: Cof TOP
type: Class
subclass of: Vertex
subclass of: Restriction
  author of change: Marinus Vonhof
  date of change: 2018-12-06
  author at start life: Marinus Vonhof
  date of start life: 2016-11-09
  validity context: *t
  comment: Temporeel kenmerk, met kenmerk Inwinning
  on class: B.o.b. beginpunt leiding
  on property: has as aspect
  min qualified cardinality: 0
subclass of: Restriction
  author at start life: Marinus Vonhof
  date of start life: 2011-12-02
  validity context: *t
  on class: Knooppunt
  on property: is connected to
  max qualified cardinality: 1
subclass of: Restriction
  author at start life: Marinus Vonhof
  date of start life: 2011-12-02
  on class: Leidingoriëntatie
  on property: has as part (inverse)
  qualified cardinality: 1

Eindpunt leiding
label: Node 2 reference @en
author of change: Marinus Vonhof
date of change: 2016-04-24
definition: [EN13508-2+A1] The node reference of the second node as specified by the employing authority. @en
definition: Het uiteinde van een leiding, anders dan het beginpunt. Ter plaatse van het leidingmidden op de bovenkant bodem.
notation: AAF
notation: GAF
author at start life: Marinus Vonhof
date of start life: 2012-04-22
alternative label: Knooppuntreferentie 2
scope note: Cof TOP
type: Class
subclass of: Vertex
subclass of: Restriction
  author of change: Marinus Vonhof
  date of change: 2018-12-06
  author at start life: Marinus Vonhof
  date of start life: 2016-11-09
  validity context: *t
  comment: Temporeel kenmerk, met kenmerk Inwinning
  on class: B.o.b. eindpunt leiding
  on property: has as aspect
  min qualified cardinality: 0
subclass of: Restriction
  author at start life: Marinus Vonhof
  date of start life: 2011-12-02
  validity context: *t
  on class: Knooppunt
  on property: is connected to
  max qualified cardinality: 1
subclass of: Restriction
  author at start life: Marinus Vonhof
  date of start life: 2011-12-02
  on class: Leidingoriëntatie
  on property: has as part (inverse)
  qualified cardinality: 1

Begindatum
author of change: Marinus Vonhof
author of change: Wouter van Riel
date of change: 2024-04-22
date of change: 2015-05-29
date of change: 2023-01-10
definition: Datum waarop het fysieke object is geplaatst of geïnstalleerd (het wordt daarmee onderdeel van een fysiek systeem). Dus bijvoorbeeld niet de datum van fabricage.
author at start life: Marinus Vonhof
date of start life: 2011-12-15
units of measurements: yyyy-mm-dd
validity context: 5d 16d
alternative label: Installatiedatum
comment: [is aspect]
scope note: Cof TOP
type: Class
subclass of: Datum
subclass of: Restriction
  author at start life: Marinus Vonhof
  date of start life: 2013-09-28
  on class: Fysiek object
  on property: has as aspect (inverse)
  max qualified cardinality: 1
subclass of: Restriction
  on property: has as value
  all values from: date

Beginknooppunt
definition: Het knooppunt dat koppelt aan het (topologische) beginpunt van een leiding.
definition: [EN13508-2+A1] The node reference of the first node as specified by the employing authority. @en
author at start life: Marinus Vonhof
date of start life: 2026-07-17
alternative label: Beginknoop
scope note: Cof TOP
type: Class
subclass of: Extra objecttype (rol)

Extra objecttype (rol)
definition: Aanvullende niet-functionele objecttypering, bijvoorbeeld voor onderscheid van de uitvoeringswijze of de toegevoegde rol van het object. Het subtype is altijd multiparent, met ook een functioneel supertype
author at start life: Marinus Vonhof
date of start life: 2024-08-01
validity context: *f
scope note: Cof TOP
type: Class
subclass of: Informatiedrager

Vertex
author of change: Marinus Vonhof
date of change: 2020-11-24
definition: Het punt waar lijnstukken bij elkaar komen, in de grafentheorie een knoop, in de meetkunde een hoekpunt
author at start life: Marinus Vonhof
date of start life: 2012-04-22
validity context: *f
alternative label: Knoop
scope note: Cof TOP
type: Class
subclass of: Topologisch element

B.o.b. beginpunt leiding
definition: Binnenonderkant buis ter plaatse van het beginpunt
notation: AXG
notation: GXG
author at start life: Marinus Vonhof
date of start life: 2013-03-26
units of measurements: m
alternative label: B.o.b. bij beginknoop t.o.v. NAP
comment: [is aspect]
scope note: Cof TOP
type: Class
subclass of: Binnenonderkant buis
subclass of: Restriction
  author of change: Marinus Vonhof
  date of change: 2017-05-17
  date of change: 2024-05-15
  author at start life: Marinus Vonhof
  date of start life: 2015-10-29
  on class: Inwinning
  on property: has as aspect
  max qualified cardinality: 1
subclass of: Restriction
  author of change: Marinus Vonhof
  date of change: 2018-12-06
  author at start life: Marinus Vonhof
  date of start life: 2016-11-09
  validity context: *t
  on class: Beginpunt leiding
  on property: has as aspect (inverse)
  max qualified cardinality: 1
subclass of: Restriction
  on property: has as value
  all values from: decimal

Leidingoriëntatie
author of change: Marinus Vonhof
date of change: 2020-04-18
definition: Een topologisch element dat het beginpunt, eindpunt (vertices) en de verbindingslijn (edge) daartussen beschrijft. De geometrie volgt het midden van de binnenonderkant van de leiding
notation: AXY
notation: GXY
author at start life: Marinus Vonhof
date of start life: 2017-12-12
scope note: Cof TOP
type: Class
subclass of: Verbinding
subclass of: Restriction
  author of change: Marinus Vonhof
  date of change: 2020-04-18
  author at start life: Marinus Vonhof
  date of start life: 2016-11-09
  comment: Temporeel kenmerk, met kenmerk Inwinning
  on class: Lijn
  on property: has as aspect
  max qualified cardinality: 1
subclass of: Restriction
  author of change: Marinus Vonhof
  date of change: 2020-11-25
  author at start life: Marinus Vonhof
  date of start life: 2014-05-02
  on class: Hydraulisch rioleringsmodel
  on property: has as part (inverse)
  qualified cardinality: 1
subclass of: Restriction
  author at start life: Marinus Vonhof
  date of start life: 2011-12-02
  on class: Beginpunt leiding
  on property: has as part
  qualified cardinality: 1
subclass of: Restriction
  author at start life: Marinus Vonhof
  date of start life: 2011-12-02
  on class: Eindpunt leiding
  on property: has as part
  qualified cardinality: 1
subclass of: Restriction
  author at start life: Marinus Vonhof
  date of start life: 2012-04-22
  validity context: *t
  on class: Leiding
  on property: has as aspect (inverse)
  max qualified cardinality: 1

Beginpunt onderdeel
author of change: Marinus Vonhof
date of change: 2017-12-08
definition: Bij een pomp, externe doorlaat of externe overstort bepaalt het beginpunt ook de stromingsrichting (= stroming van begin- naar eindpunt).
author at start life: Marinus Vonhof
date of start life: 2012-04-22
scope note: Cof MDS
scope note: Cof REV
scope note: Cof HYD
type: Class
subclass of: Vertex
subclass of: Restriction
  author of change: Marinus Vonhof
  date of change: 2017-12-07
  author at start life: Marinus Vonhof
  date of start life: 2012-04-22
  on class: Onderdeeloriëntatie
  on property: has as part (inverse)
  qualified cardinality: 1
subclass of: Restriction
  author at start life: Marinus Vonhof
  date of start life: 2017-12-12
  validity context: 5t 11t
  on class: Knooppunt
  on property: is connected to
  max qualified cardinality: 1

Onderdeeloriëntatie
author of change: Marinus Vonhof
author of change: Wouter van Riel
date of change: 2018-12-05
date of change: 2024-04-20
definition: Een topologisch element dat de verbindingslijn (edge) tussen het beginpunt en het eindpunt van het onderdeel beschrijft. Voor een wand, pomp of doorlaat beschrijft dit topologisch element de verbinding ervan binnen het netwerk, zie daarvoor de concepten "beginpunt/eindpunt onderdeel". Dit element kan een geometrie (punt of lijn) bevatten voor presentaties. Bij een wand (stuw-/overstortconstructie) beschrijft de geometrie het midden van de bovenkant wand in de breedterichting.
author at start life: Marinus Vonhof
date of start life: 2017-12-12
scope note: Cof MDS
scope note: Cof REV
scope note: Cof HYD
scope note: Cof DMO
type: Class
subclass of: Verbinding
subclass of: Restriction
  author of change: Marinus Vonhof
  date of change: 2015-06-08
  author at start life: Marinus Vonhof
  date of start life: 2012-04-22
  validity context: 5t 11t
  on class: Wand
  on property: has as aspect (inverse)
  max qualified cardinality: 1
subclass of: Restriction
  author of change: Marinus Vonhof
  date of change: 2017-12-07
  author at start life: Marinus Vonhof
  date of start life: 2012-04-22
  on class: Beginpunt onderdeel
  on property: has as part
  qualified cardinality: 1
subclass of: Restriction
  author of change: Marinus Vonhof
  date of change: 2017-12-07
  author at start life: Marinus Vonhof
  date of start life: 2012-04-22
  on class: Eindpunt onderdeel
  on property: has as part
  qualified cardinality: 1
subclass of: Restriction
  author of change: Marinus Vonhof
  date of change: 2018-05-03
  author at start life: Marinus Vonhof
  date of start life: 2012-04-22
  validity context: 5t 11t
  on class: Pomp
  on property: has as aspect (inverse)
  max qualified cardinality: 1
subclass of: Restriction
  author at start life: Marinus Vonhof
  date of start life: 2012-04-22
  validity context: 5t 11t
  on class: Doorlaat
  on property: has as aspect (inverse)
  max qualified cardinality: 1
subclass of: Restriction
  author at start life: Marinus Vonhof
  date of start life: 2025-03-19
  on class: Lijn
  on property: has as aspect
  max qualified cardinality: 1
subclass of: Restriction
  author at start life: Wouter van Riel
  date of start life: 2024-04-20
  on class: Punt
  on property: has as aspect
  max qualified cardinality: 1

Begroeide infiltratievoorziening
definition: Een begroeide, onverharde verlaging in het maaiveld (wadi, veld, berm, greppel of sloot), waarin het hemelwater tijdelijk wordt geborgen en waarbij het hemelwater via een waterdoorlatende (zuiverende) bodempassage infiltreert in de ondergrond. In de ondergrond onder de bodempassage kan een infiltratiekoffer en/of infiltratiekrat aanwezig zijn. Bij overbelasting en voor de vertraagde leegloop van de voorziening kunnen onderdelen (drainage, noodoverstort, slokop etc.) zijn aangebracht voor het reguleren van hemelwater- en grondwater.
author at start life: Marinus Vonhof
date of start life: 2026-07-13
alternative label: Bovengrondse infiltratievoorziening
alternative label: Groene infiltratievoorziening
alternative label: Onverharde infiltratievoorziening
scope note: Cof MDS
scope note: Cof HYD
type: Class
subclass of: Infiltratievoorziening
subclass of: Restriction
  on property: heeft Uitvoering
  has value: Verdiept terrein met waterdoorlatende bodem
subclass of: Restriction
  on class: Slokop
  on property: has as part
  min qualified cardinality: 0
subclass of: Restriction
  on class: Infiltratiecompartiment
  on property: has as part
  min qualified cardinality: 1

Infiltratievoorziening
author of change: Marinus Vonhof
author of change: Johan Post
author of change: Eric van Gorkom
date of change: 2024-04-30
date of change: 2026-07-13
date of change: 2024-05-13
definition: Het geheel van componenten bestemd voor de inzameling van hemelwater en afvoer ervan door infiltratie.
author at start life: Marinus Vonhof
date of start life: 2014-03-20
validity context: *f
scope note: Cof MDS
scope note: Cof HYD
type: Class
subclass of: Fysiek object
subclass of: Restriction
  author of change: Marinus Vonhof
  date of change: 2026-07-14
  author at start life: Marinus Vonhof
  date of start life: 2019-07-10
  on class: Rioolstelsel
  on property: has as part (inverse)
  max qualified cardinality: 1
subclass of: Restriction
  author at start life: Marinus Vonhof
  date of start life: 2022-10-01
  on class: Retentiewaarde
  on property: has as aspect
  max qualified cardinality: 1
subclass of: Restriction
  author at start life: Marinus Vonhof
  date of start life: 2026-07-14
  on class: Gebiedsoriëntatie
  on property: has as aspect
  max qualified cardinality: 1
subclass of: Restriction
  author at start life: Marinus Vonhof
  date of start life: 2026-07-24
  on class: Bergend oppervlak
  on property: has as aspect
  max qualified cardinality: 1
subclass of: Restriction
  author at start life: Marinus Vonhof
  date of start life: 2026-07-24
  on class: DIT-riool
  on property: has as part
  min qualified cardinality: 0
subclass of: Restriction
  author at start life: Marinus Vonhof
  date of start life: 2026-07-24
  on class: DT-riool
  on property: has as part
  min qualified cardinality: 0
subclass of: Restriction
  author at start life: Marinus Vonhof
  date of start life: 2026-07-24
  on class: Drain
  on property: has as part
  min qualified cardinality: 0
subclass of: Restriction
  author at start life: Marinus Vonhof
  date of start life: 2026-07-24
  on class: Hemelwaterriool
  on property: has as part
  min qualified cardinality: 0
subclass of: Restriction
  author at start life: Marinus Vonhof
  date of start life: 2026-07-24
  on class: Infiltratiekoffer
  on property: has as part
  min qualified cardinality: 0
subclass of: Restriction
  author at start life: Marinus Vonhof
  date of start life: 2026-08-20
  on class: Infiltratieriool
  on property: has as part
  min qualified cardinality: 0
subclass of: Restriction
  author at start life: Marinus Vonhof
  date of start life: 2026-07-24
  on class: Infiltratiekrat
  on property: has as part
  min qualified cardinality: 0
subclass of: Restriction
  author at start life: Marinus Vonhof
  date of start life: 2026-07-24
  on class: Infiltratieput
  on property: has as part
  min qualified cardinality: 0
subclass of: Restriction
  author at start life: Marinus Vonhof
  date of start life: 2026-07-24
  on class: Inspectieput
  on property: has as part
  min qualified cardinality: 0
subclass of: Restriction
  author at start life: Marinus Vonhof
  date of start life: 2026-07-24
  on class: Kolk
  on property: has as part
  min qualified cardinality: 0
subclass of: Restriction
  author at start life: Marinus Vonhof
  date of start life: 2026-08-04
  on class: Infiltratiestelsel
  on property: has as part (inverse)
  max qualified cardinality: 1
subclass of: Restriction
  on property: heeft Functie
  has value: Hemelwater afvoeren naar ondergrond

Slokop
author of change: Marinus Vonhof
date of change: 2017-05-31
definition: Een regelvoorziening voor het laten wegstromen van overtollig hemelwater bij een infiltratievoorziening
author at start life: Finy Teitsma (Oranjewoud)
date of start life: 2007-10-23
validity context: 1d 3d
scope note: Cof BAS
scope note: Cof HYD
type: Class
subclass of: Put
subclass of: Restriction
  author at start life: Marinus Vonhof
  date of start life: 2019-05-15
  on class: Overstortdrempel
  on property: has as part
  qualified cardinality: 1
subclass of: Restriction
  author at start life: Marinus Vonhof
  date of start life: 2026-07-24
  on class: Begroeide infiltratievoorziening
  on property: has as part (inverse)
  qualified cardinality: 1
subclass of: Restriction
  on property: heeft Functie
  has value: Opvang hemelwater
subclass of: Restriction
  on property: heeft Functie
  has value: Overtollig hemelwater infiltratievoorziening afvoeren

Infiltratiecompartiment
definition: Een bovengrondse ruimte binnen een infiltratievoorziening waarin zich het hemelwater verzameld, waarna het infiltreert in de ondergrond en/of daarin aanwezige objecten
author at start life: Marinus Vonhof
date of start life: 2026-07-14
scope note: Cof MDS
scope note: Cof HYD
type: Class
subclass of: Reservoir
subclass of: Restriction
  author at start life: Marinus Vonhof
  date of start life: 2026-07-24
  on class: Compartimentoriëntatie
  on property: has as aspect
  max qualified cardinality: 1
subclass of: Restriction
  on property: heeft Functie
  has value: Afvoer van hemelwater
subclass of: Restriction
  on class: Begroeide infiltratievoorziening
  on property: has as part (inverse)
  qualified cardinality: 1

Infiltratiekoffer
author of change: Marinus Vonhof
author of change: Johan Post
author of change: Eric van Gorkom
date of change: 2024-05-01
date of change: 2021-10-01
date of change: 2026-07-13
date of change: 2024-05-13
definition: Een in de ondergrond aangebrachte ruimte gevuld met een substraat met een hoge porositeit, waarin het hemelwater wordt verdeeld over de ruimte en daarin tijdelijk wordt geborgen, waarbij het hemelwater via de bodem en wanden infiltreert in de ondergrond.
author at start life: Marinus Vonhof
date of start life: 2016-04-20
comment: Vanaf versie 1.7.0 vervangt Infiltratiekoffer/-krat het concept Infiltratiereservoir
comment: Vanaf versie 1.7.0 kan het substraat-materiaal expliciet worden beschreven, daarmee is het gebruik van de subtypes Zandkoffer, Grindkoffer en dergelijke (voor gegevensuitwisseling) niet meer nodig.
alternative label: Infiltratiereservoir
scope note: Cof MDS
scope note: Cof HYD
type: Class
subclass of: Reservoir
subclass of: Restriction
  author at start life: Marinus Vonhof
  date of start life: 2019-07-10
  on class: Drain
  on property: has as part
  min qualified cardinality: 0
subclass of: Restriction
  author at start life: Marinus Vonhof
  date of start life: 2026-07-13
  on class: Substraat kern
  on property: has as part
  qualified cardinality: 1
subclass of: Restriction
  author at start life: Marinus Vonhof
  date of start life: 2026-07-14
  on class: Omhulling
  on property: has as part
  min qualified cardinality: 0
subclass of: Restriction
  author at start life: Marinus Vonhof
  date of start life: 2026-07-24
  on class: Infiltratievoorziening
  on property: has as part (inverse)
  qualified cardinality: 1
subclass of: Restriction
  on property: heeft Functie
  has value: Afvoeren hemelwater naar de ondergrond
subclass of: Restriction
  on property: heeft Technologie
  has value: Infiltreren
subclass of: Restriction
  on property: heeft Functie
  has value: Tijdelijke berging van hemelwater

Infiltratiekrat
author of change: Marinus Vonhof
author of change: Johan Post
date of change: 2024-04-30
date of change: 2026-07-13
definition: Een ondergrondse holle ruimte gevuld met individuele kratjes bestemd voor de berging van hemelwater, waarbij het hemelwater door middel van infiltratie door de wanden kan worden afgevoerd.
author at start life: Marinus Vonhof
date of start life: 2015-09-20
validity context: 1d 10d 12d
scope note: Cof MDS
scope note: Cof HYD
type: Class
subclass of: Reservoir
subclass of: Restriction
  author of change: Marinus Vonhof
  date of change: 2026-07-24
  author at start life: Marinus Vonhof
  date of start life: 2017-05-31
  on class: Infiltratievoorziening
  on property: has as part (inverse)
  qualified cardinality: 1
subclass of: Restriction
  author of change: Marinus Vonhof
  date of change: 2017-05-20
  date of change: 2026-07-14
  author at start life: Nic Roest (Idoro)
  date of start life: 2007-11-29
  on class: Porositeit
  on property: has as aspect
  max qualified cardinality: 1
subclass of: Restriction
  author at start life: Marinus Vonhof
  date of start life: 2026-07-24
  on class: Omhulling
  on property: has as part
  min qualified cardinality: 0
subclass of: Restriction
  on property: heeft Functie
  has value: Hemelwater afvoeren naar ondergrond

Benedenstrooms eindriool
author of change: Marinus Vonhof
date of change: 2016-04-28
definition: Een gesloten rioolleiding die het afvalwater afvoert van het eindgemaal naar de RWZI
author at start life: Finy Teitsma (Oranjewoud)
date of start life: 2007-10-23
scope note: Cof MDS
scope note: Cof HYD
scope note: Cof DMO
type: Class
subclass of: Transportrioolleiding
subclass of: Restriction
  on property: heeft Functie
  has value: Afvoer van afvalwater naar een RWZI

Transportrioolleiding
author of change: Marinus Vonhof
date of change: 2015-07-28
definition: Een gesloten rioolleiding waarop in principe geen aansluitleidingen zijn aangesloten.
definition: [NEN 3300:1996] Riool hoofdzakelijk bestemd voor het transport van afvalwater
author at start life: Finy Teitsma (Oranjewoud)
date of start life: 2006-11-29
comment: 20151014: NEN3300-definitie aangepast
alternative label: Hoofdriool
alternative label: Moerriool
alternative label: Transportriool
scope note: Cof MDS
scope note: Cof REV
scope note: Cof HYD
scope note: Cof DMO
type: Class
subclass of: Vrijverval transportleiding
subclass of: Restriction
  author of change: Marinus Vonhof
  date of change: 2025-12-03
  author at start life: Marinus Vonhof
  date of start life: 2018-12-06
  on class: Vrijverval leidingsegment
  on property: has as part
  min qualified cardinality: 0
subclass of: Restriction
  on property: heeft Uitvoering
  has value: Zonder aansluitingen

Oorzaakobject
author of change: Marinus Vonhof
date of change: 2016-08-25
author at start life: Marinus Vonhof
date of start life: 2016-08-05
see also: [SUF-MELD] Type object waarop de oorzaak van het probleem betrekking heeft
scope note: Cof MLD
type: Class
subclass of: Fysiek object

Bergbezinkbassin
author of change: Eric van Gorkom
author of change: Wouter van Riel
date of change: 2024-05-13
date of change: 2021-09-23
definition: Een gesloten reservoir waarin het afvalwater tijdelijk wordt opgevangen met een slibreinigende voorziening
definition: [NEN 3300:1996] reservoir voor de tijdelijke opslag van afvalwater waarin tevens slibafzetting plaatsvindt met een voorziening om het slib te kunnen verwijderen en waaruit overstortingen kunnen plaatsvinden
notation: BBB
author at start life: Marinus Vonhof
date of start life: 2013-09-29
scope note: Cof MDS
scope note: Cof HYD
scope note: Cof RGM
type: Class
subclass of: Reservoir
subclass of: Restriction
  author of change: Eric van Gorkom
  date of change: 2021-11-23
  author at start life: Marinus Vonhof
  date of start life: 2015-05-29
  on class: Overstortconstructie
  on property: has as part
  min qualified cardinality: 0
subclass of: Restriction
  author of change: Marinus Vonhof
  date of change: 2016-04-24
  author at start life: Marinus Vonhof
  date of start life: 2013-10-01
  on class: Gemengd rioolstelsel
  on property: has as part (inverse)
  qualified cardinality: 1
subclass of: Restriction
  author at start life: Marinus Vonhof
  date of start life: 2015-05-29
  on class: Ledigingsvoorziening
  on property: has as part
  max qualified cardinality: 1
subclass of: Restriction
  author at start life: Marinus Vonhof
  date of start life: 2017-12-07
  on class: Stuwconstructie
  on property: has as part
  min qualified cardinality: 0
subclass of: Restriction
  author at start life: Marinus Vonhof
  date of start life: 2026-08-20
  on class: Bezinkcompartiment
  on property: has as part
  qualified cardinality: 1
subclass of: Restriction
  author at start life: Marinus Vonhof
  date of start life: 2020-04-17
  on class: Verbeterd hemelwaterstelsel
  on property: has as part (inverse)
  max qualified cardinality: 1
subclass of: Restriction
  author at start life: Wouter van Riel
  date of start life: 2021-09-23
  on property: heeft Functie
  has value: Bezinken stoffen
subclass of: Restriction
  author at start life: Wouter van Riel
  date of start life: 2021-09-23
  on property: heeft Functie
  has value: Tijdelijke berging van afvalwater
subclass of: Restriction
  author at start life: Wouter van Riel
  date of start life: 2021-09-23
  on property: heeft Doel
  has value: Verminderen vuilbelasting van oppervlaktewater
subclass of: Restriction
  author at start life: Wouter van Riel
  date of start life: 2021-09-23
  on property: heeft Doel
  has value: Verwijderen bezinksel
subclass of: Restriction
  on property: heeft Functie
  has value: Regeling van de afvoer van het afvalwater

Overstortconstructie
author of change: Marinus Vonhof
author of change: Johan Post
author of change: Wouter van Riel
date of change: 2024-04-22
date of change: 2015-06-01
date of change: 2026-06-30
definition: Een constructie die het overstorten van water bij een ontworpen peilverschil mogelijk maakt, gerealiseerd door een overstortdrempel eventueel aangevuld met een op elkaar afgestemde combinatie van terugslagklep en duikschot.
author at start life: Marinus Vonhof
date of start life: 2015-05-29
validity context: 10f 11f 14f
scope note: Cof MDS
scope note: Cof HYD
type: Class
subclass of: Constructieonderdeel
subclass of: Restriction
  author of change: Marinus Vonhof
  date of change: 2017-03-06
  author at start life: Marinus Vonhof
  date of start life: 2015-07-27
  on class: Bergingsleiding
  on property: has as part (inverse)
  max qualified cardinality: 1
subclass of: Restriction
  author of change: Marinus Vonhof
  date of change: 2018-05-03
  author at start life: Marinus Vonhof
  date of start life: 2015-05-29
  on class: Bergbezinkbassin
  on property: has as part (inverse)
  max qualified cardinality: 1
subclass of: Restriction
  author of change: Marinus Vonhof
  date of change: 2018-05-03
  author at start life: Marinus Vonhof
  date of start life: 2015-07-27
  on class: Bergbezinkleiding
  on property: has as part (inverse)
  max qualified cardinality: 1
subclass of: Restriction
  author of change: Marinus Vonhof
  date of change: 2019-05-15
  author at start life: Marinus Vonhof
  date of start life: 2015-05-29
  on class: Keerklep
  on property: has as part
  max qualified cardinality: 1
subclass of: Restriction
  author of change: Marinus Vonhof
  date of change: 2021-08-05
  author at start life: Marinus Vonhof
  date of start life: 2015-05-29
  comment: per definitie
  on class: Overstortdrempel
  on property: has as part
  min qualified cardinality: 1
subclass of: Restriction
  author at start life: Marinus Vonhof
  date of start life: 2015-05-29
  on class: Bergingsbassin
  on property: has as part (inverse)
  max qualified cardinality: 1
subclass of: Restriction
  on property: heeft Functie
  has value: Overtollig afvalwater laten wegstromen

Ledigingsvoorziening
author of change: Marinus Vonhof
date of change: 2025-01-16
definition: Voorziening voor het verwijderen van afvalwater
author at start life: Marinus Vonhof
date of start life: 2015-05-29
scope note: Cof BAS
scope note: Cof HYD
scope note: Cof RGM
type: Class
subclass of: Constructieonderdeel
subclass of: Restriction
  author of change: Marinus Vonhof
  date of change: 2016-04-13
  author at start life: Marinus Vonhof
  date of start life: 2015-05-29
  on class: Pomp
  on property: has as part
  min qualified cardinality: 1
subclass of: Restriction
  author of change: Marinus Vonhof
  date of change: 2018-05-03
  author at start life: Marinus Vonhof
  date of start life: 2015-07-27
  on class: Bergbezinkleiding
  on property: has as part (inverse)
  max qualified cardinality: 1
subclass of: Restriction
  author at start life: Marinus Vonhof
  date of start life: 2015-05-29
  on class: Bergbezinkbassin
  on property: has as part (inverse)
  max qualified cardinality: 1
subclass of: Restriction
  author at start life: Marinus Vonhof
  date of start life: 2015-05-29
  on class: Bergingsbassin
  on property: has as part (inverse)
  max qualified cardinality: 1
subclass of: Restriction
  author at start life: Marinus Vonhof
  date of start life: 2015-05-29
  on class: Bezinkbassin
  on property: has as part (inverse)
  max qualified cardinality: 1
subclass of: Restriction
  author at start life: Marinus Vonhof
  date of start life: 2024-05-17
  on class: Schuif
  on property: has as part
  min qualified cardinality: 0
subclass of: Restriction
  on property: heeft Functie
  has value: Verwijderen van water

Stuwconstructie
label: Weir @en
author of change: Marinus Vonhof
author of change: Wouter van Riel
date of change: 2025-01-16
date of change: 2024-04-22
date of change: 2018-05-17
definition: [EN 16323:2014] overflow structure that can be used for controlling upstream surface level or for measuring discharge, or for both @en
definition: [IMBOR] Een inrichting waarmee bij regen de afstroming van rioolwater uit hooggelegen riolen wordt vertraagd.
author at start life: Marinus Vonhof
date of start life: 2013-09-28
validity context: 1d
scope note: Cof MDS
scope note: Cof HYD
scope note: Cof DMO
type: Class
subclass of: Constructieonderdeel
subclass of: Restriction
  author of change: Marinus Vonhof
  date of change: 2017-12-07
  author at start life: Finy Teitsma (Oranjewoud)
  date of start life: 2006-02-25
  on class: Bergingsbassin
  on property: has as part (inverse)
  qualified cardinality: 1
subclass of: Restriction
  author of change: Marinus Vonhof
  date of change: 2018-12-12
  author at start life: Marinus Vonhof
  date of start life: 2015-09-07
  on class: Opening in wand
  on property: has as part
  min qualified cardinality: 0
subclass of: Restriction
  author of change: Marinus Vonhof
  date of change: 2020-04-17
  author at start life: Marinus Vonhof
  date of start life: 2014-04-29
  comment: per definitie
  on class: Stuwklep
  on property: has as part
  max qualified cardinality: 1
subclass of: Restriction
  author at start life: Marinus Vonhof
  date of start life: 2017-03-29
  on class: Stuwmuur
  on property: has as part
  qualified cardinality: 1
subclass of: Restriction
  author at start life: Marinus Vonhof
  date of start life: 2017-12-07
  on class: Bergbezinkbassin
  on property: has as part (inverse)
  max qualified cardinality: 1
subclass of: Restriction
  author at start life: Marinus Vonhof
  date of start life: 2018-12-12
  on class: Wervelventiel
  on property: has as part
  max qualified cardinality: 1
subclass of: Restriction
  on property: heeft Functie
  has value: Bovenstrooms waterpeil regelen

Bezinkcompartiment
definition: Een compartiment (fysiek onderdeel) van een bergbezinkvoorziening dat is bedoeld voor tijdelijke berging van afvalwater en het bevorderen van bezinking van zwevende stoffen door lage stroomsnelheid. Het compartiment wordt doorgaans gemodelleerd met leiding-eigenschappen: een leiding met ronde of vierkante vorm, aangelegd met bodemverhang.
author at start life: Marinus Vonhof
date of start life: 2026-08-21
scope note: Cof HYD
type: Class
subclass of: Leiding
subclass of: Restriction
  on property: heeft Functie
  has value: Bezinken stoffen
subclass of: Restriction
  on property: heeft Functie
  has value: Transport van afvalwater
subclass of: Restriction
  on class: Bergbezinkbassin
  on property: has as part (inverse)
  qualified cardinality: 1

Verbeterd hemelwaterstelsel
author of change: Marinus Vonhof
date of change: 2019-03-20
definition: Hemelwaterstelsel met voorzieningen waardoor een deel van de neerslag naar het vuilwaterriool wordt afgevoerd of wordt gezuiverd door bijvoorbeeld een filterconstructie of wadi.
author at start life: Marinus Vonhof
date of start life: 2018-12-06
scope note: Cof TOP
type: Class
subclass of: Hemelwaterstelsel
subclass of: Restriction
  author at start life: Marinus Vonhof
  date of start life: 2020-04-17
  on class: Bergbezinkbassin
  on property: has as part
  min qualified cardinality: 0
subclass of: Restriction
  author at start life: Marinus Vonhof
  date of start life: 2020-04-17
  on class: Bergingsbassin
  on property: has as part
  min qualified cardinality: 0
subclass of: Restriction
  author at start life: Marinus Vonhof
  date of start life: 2020-04-17
  on class: Bergingsvijver
  on property: has as part
  min qualified cardinality: 0
subclass of: Restriction
  author at start life: Marinus Vonhof
  date of start life: 2020-04-17
  on class: Bezinkbassin
  on property: has as part
  min qualified cardinality: 0
subclass of: Restriction
  author at start life: Marinus Vonhof
  date of start life: 2020-05-26
  on class: Rioolgemaal
  on property: has as part
  min qualified cardinality: 0
subclass of: Restriction
  on property: heeft Functie
  has value: Tijdelijke berging van hemelwater

Bergbezinkleiding
author of change: Marinus Vonhof
date of change: 2018-05-03
date of change: 2026-08-20
definition: Een bergbezinkbassin voorzien van een gesloten leiding waarin het afvalwater tijdelijk wordt opgevangen met een slibreinigende voorziening
definition: [NEN 3300:1996] riool voor de tijdelijke opslag van afvalwater waarin tevens slibafzetting plaatsvindt met een voorziening om het slib te kunnen verwijderen en waaruit overstortingen kunnen plaatsvinden
notation: BBL
author at start life: Nic Roest (Idoro)
date of start life: 2006-03-23
alternative label: Bergbezinkriool
scope note: Cof MDS
scope note: Cof HYD
scope note: Cof RGM
type: Class
subclass of: Bergbezinkbassin
subclass of: Restriction
  on property: heeft Uitvoering
  has value: Uitgevoerd als leiding

Bergend oppervlak
author of change: Marinus Vonhof
date of change: 2019-04-29
definition: Het oppervlak waarover het water op straat uitstroomt
author at start life: Marinus Vonhof
date of start life: 2011-12-15
units of measurements: m2
validity context: 15d
alternative label: Oppervlak water op straat
comment: [is aspect]
scope note: Cof MDS
scope note: Cof HYD
type: Class
subclass of: Kenmerk
subclass of: Restriction
  author of change: Marinus Vonhof
  date of change: 2018-05-03
  author at start life: Marinus Vonhof
  date of start life: 2011-12-15
  validity context: 5t 11t
  on class: Rioolput
  on property: has as aspect (inverse)
  max qualified cardinality: 1
subclass of: Restriction
  author at start life: Marinus Vonhof
  date of start life: 2018-12-06
  on class: Reservoir
  on property: has as aspect (inverse)
  max qualified cardinality: 1
subclass of: Restriction
  author at start life: Marinus Vonhof
  date of start life: 2026-07-24
  on class: Infiltratievoorziening
  on property: has as aspect (inverse)
  max qualified cardinality: 1
subclass of: Restriction
  author at start life: Marinus Vonhof
  date of start life: 2026-07-26
  on class: Inwinning
  on property: has as aspect
  max qualified cardinality: 1
subclass of: Restriction
  on property: has as value
  all values from: decimal

Inhoud
author of change: Marinus Vonhof
date of change: 2025-01-16
date of change: 2015-05-29
definition: [IMBOR] Kenmerk voor het volume van het beheerobject.
author at start life: Nic Roest (Idoro)
date of start life: 2006-02-21
units of measurements: m3
comment: [is aspect]
scope note: Cof TOP
type: Class
subclass of: Kenmerk
subclass of: Restriction
  on property: has as value
  all values from: decimal

Bergingsbassin
label: Detention tank @en
author of change: Eric van Gorkom
author of change: Wouter van Riel
date of change: 2024-05-13
date of change: 2021-09-23
definition: Een gesloten reservoir waarin het afvalwater tijdelijk wordt opgevangen
definition: [EN 16323:2014] closed or open tank for the temporary storage of wastewater @en
definition: [NEN 3300:1996] reservoir voor de tijdelijke opslag van afvalwater, ter regeling van de afvoerhoeveelheid
definition: [NEN-EN 752:2008] tank of reservoir voor de tijdelijke opslag van afvalwater [EN1085:2007, definitie 2240]
author at start life: Nic Roest (Idoro)
date of start life: 2006-03-23
alternative label: Bufferbassin
alternative label: Retentiebassin
scope note: Cof MDS
scope note: Cof HYD
type: Class
subclass of: Reservoir
subclass of: Restriction
  author of change: Marinus Vonhof
  date of change: 2017-12-07
  author at start life: Finy Teitsma (Oranjewoud)
  date of start life: 2006-02-25
  on class: Stuwconstructie
  on property: has as part
  min qualified cardinality: 0
subclass of: Restriction
  author of change: Marinus Vonhof
  date of change: 2016-04-24
  author at start life: Marinus Vonhof
  date of start life: 2014-04-30
  on class: Gemengd rioolstelsel
  on property: has as part (inverse)
  qualified cardinality: 1
subclass of: Restriction
  author at start life: Marinus Vonhof
  date of start life: 2015-05-29
  on class: Ledigingsvoorziening
  on property: has as part
  max qualified cardinality: 1
subclass of: Restriction
  author at start life: Marinus Vonhof
  date of start life: 2015-05-29
  on class: Overstortconstructie
  on property: has as part
  max qualified cardinality: 1
subclass of: Restriction
  author at start life: Marinus Vonhof
  date of start life: 2020-04-17
  on class: Verbeterd hemelwaterstelsel
  on property: has as part (inverse)
  max qualified cardinality: 1
subclass of: Restriction
  author at start life: Wouter van Riel
  date of start life: 2021-09-23
  on property: heeft Functie
  has value: Regeling van de afvoer van het afvalwater
subclass of: Restriction
  author at start life: Wouter van Riel
  date of start life: 2021-09-23
  on property: heeft Functie
  has value: Tijdelijke berging van afvalwater
subclass of: Restriction
  author at start life: Wouter van Riel
  date of start life: 2021-09-23
  on property: heeft Doel
  has value: Verminderen vuilbelasting van oppervlaktewater

Bergingsleiding
author of change: Marinus Vonhof
date of change: 2015-07-27
definition: Een gesloten leiding waarin het afvalwater tijdelijk wordt opgevangen.
definition: [NEN 3300:1996] riool waardoor extra berging in het rioolstelsel wordt verkregen
definition: [NEN-EN 752:2008] deel van een riool dat als bergingsbassin fungeert
author at start life: Finy Teitsma (Oranjewoud)
date of start life: 2006-05-23
alternative label: Bergingsriool
alternative label: Retentieleiding
scope note: Cof MDS
scope note: Cof REV
scope note: Cof HYD
type: Class
subclass of: Vrijverval rioolleiding
subclass of: Restriction
  author of change: Marinus Vonhof
  date of change: 2017-03-06
  author at start life: Marinus Vonhof
  date of start life: 2015-07-27
  on class: Overstortconstructie
  on property: has as part
  max qualified cardinality: 1
subclass of: Restriction
  on property: heeft Functie
  has value: Tijdelijke berging van afvalwater

Bergingsvijver
author of change: Johan Post
date of change: 2021-09-23
definition: Een open reservoir (vijver, sloot, gracht, etc.), bestemd voor de berging van afvalwater ter regeling van de afvoer van het afvalwater.
definition: [NEN 3300:1996] open water voor de tijdelijke opslag van afvalwater
author at start life: Nic Roest (Idoro)
date of start life: 2006-03-23
validity context: 11d 12d
alternative label: Retentievijver
scope note: Cof MDS
scope note: Cof HYD
type: Class
subclass of: Reservoir
subclass of: Restriction
  author of change: Marinus Vonhof
  date of change: 2016-04-24
  author at start life: Marinus Vonhof
  date of start life: 2016-04-22
  on class: Gemengd rioolstelsel
  on property: has as part (inverse)
  qualified cardinality: 1
subclass of: Restriction
  author at start life: Finy Teitsma (Oranjewoud)
  date of start life: 2007-11-30
  on class: Lozingspunt
  on property: has as part
  min qualified cardinality: 1
subclass of: Restriction
  author at start life: Johan Post
  date of start life: 2021-09-23
  on property: heeft Functie
  has value: Regeling van de afvoer van het afvalwater
subclass of: Restriction
  author at start life: Johan Post
  date of start life: 2021-09-23
  on property: heeft Functie
  has value: Tijdelijke berging van afvalwater
subclass of: Restriction
  author at start life: Johan Post
  date of start life: 2021-09-23
  on property: heeft Doel
  has value: Verminderen vuilbelasting van oppervlaktewater
subclass of: Restriction
  author at start life: Marinus Vonhof
  date of start life: 2016-04-22
  on class: Hemelwaterstelsel
  on property: has as part (inverse)
  max qualified cardinality: 1
subclass of: Restriction
  author at start life: Marinus Vonhof
  date of start life: 2020-04-17
  on class: Verbeterd hemelwaterstelsel
  on property: has as part (inverse)
  max qualified cardinality: 1

Lozingspunt
label: Discharge point @en
definition: Een knooppunt in een stelsel waar het afvalwater het stelsel verlaat of binnenkomt.
definition: [EN 16323:2014] point where wastewater is discharged into a receiving water @en
definition: [NEN 3300:1996] het punt waar afvalwater het in beschouwing genomen rioolstelsel in- of uitstroomt
author at start life: Marinus Vonhof
date of start life: 2015-07-27
see also: [20150227] Vanuit het stelsel gezien het punt waar het afvalwater het stelsel verlaat
see also: [IRIS-RIOKEN:2012] Het punt waar door middel van een werk (afval)water in het oppervlaktewater wordt gebracht. Het water is niet afkomstig uit een ander oppervlaktewater.
scope note: Cof MDS
scope note: Cof PLI
scope note: Cof HYD
type: Class
subclass of: Aansluitpunt
subclass of: Restriction
  author of change: Marinus Vonhof
  date of change: 2016-04-13
  author at start life: Finy Teitsma (Oranjewoud)
  date of start life: 2007-10-24
  validity context: 5t 11t
  on class: Hemelwaterstelsel
  on property: has as part (inverse)
  max qualified cardinality: 1
subclass of: Restriction
  author of change: Marinus Vonhof
  date of change: 2016-04-22
  author at start life: Finy Teitsma (Oranjewoud)
  date of start life: 2007-10-24
  validity context: 5t 11t
  on class: Gemengd rioolstelsel
  on property: has as part (inverse)
  max qualified cardinality: 1
subclass of: Restriction
  author at start life: Finy Teitsma (Oranjewoud)
  date of start life: 2007-11-30
  on class: Bergingsvijver
  on property: has as part (inverse)
  max qualified cardinality: 1
subclass of: Restriction
  author at start life: Marinus Vonhof
  date of start life: 2015-03-01
  validity context: 5t 11t
  on class: Vuilwaterstelsel
  on property: has as part (inverse)
  max qualified cardinality: 1
subclass of: Restriction
  on property: heeft Functie
  has value: Lozen afvalwater

Hemelwaterstelsel
author of change: Marinus Vonhof
author of change: Johan Post
author of change: Wouter van Riel
date of change: 2024-05-16
date of change: 2021-10-01
date of change: 2024-04-22
definition: Een enkelvoudig vrijverval rioolstelsel bestemd voor de inzameling, het transport en de tijdelijke berging van hemelwater.
definition: [NEN 3300:1996] Rwa-rioolstelsel is synoniem van hemelwaterstelsel
definition: [NEN 3300:1996] rioolstelsel alleen bestemd voor de inzameling en het transport van neerslag
author at start life: Finy Teitsma (Oranjewoud)
date of start life: 2007-10-23
alternative label: HWA stelsel
alternative label: RWA-rioolstelsel
alternative label: Regenwaterrioolstelsel
scope note: Cof TOP
type: Class
subclass of: Vrijverval rioolstelsel
subclass of: Restriction
  author of change: Marinus Vonhof
  date of change: 2014-04-30
  author at start life: Finy Teitsma (Oranjewoud)
  date of start life: 2007-10-24
  validity context: *t
  on class: Hemelwaterriool
  on property: has as part
  min qualified cardinality: 1
subclass of: Restriction
  author of change: Marinus Vonhof
  date of change: 2016-04-13
  author at start life: Finy Teitsma (Oranjewoud)
  date of start life: 2007-10-24
  validity context: 5t 11t
  on class: Lozingspunt
  on property: has as part
  min qualified cardinality: 1
subclass of: Restriction
  author of change: Marinus Vonhof
  date of change: 2016-04-13
  author at start life: Finy Teitsma (Oranjewoud)
  date of start life: 2007-10-24
  on class: Goot
  on property: has as part
  min qualified cardinality: 0
subclass of: Restriction
  author at start life: Marinus Vonhof
  date of start life: 2016-04-22
  on class: Bergingsvijver
  on property: has as part
  min qualified cardinality: 0
subclass of: Restriction
  author at start life: Marinus Vonhof
  date of start life: 2020-04-18
  on class: DIT-riool
  on property: has as part
  min qualified cardinality: 0
subclass of: Restriction
  author at start life: Marinus Vonhof
  date of start life: 2020-04-18
  on class: DT-riool
  on property: has as part
  min qualified cardinality: 0
subclass of: Restriction
  author at start life: Marinus Vonhof
  date of start life: 2020-05-26
  on class: Infiltratieriool
  on property: has as part
  min qualified cardinality: 0
subclass of: Restriction
  author at start life: Marinus Vonhof
  date of start life: 2024-05-16
  on class: Uitlaat (punt)
  on property: has as part
  min qualified cardinality: 1
subclass of: Restriction
  on property: heeft Functie
  has value: Inzameling van hemelwater
subclass of: Restriction
  on property: heeft Functie
  has value: Transport van hemelwater

Pompput
author of change: Finy Teitsma (Oranjewoud)
author of change: Johan Post
date of change: 2026-05-01
date of change: 2007-11-12
date of change: 2026-05-18
definition: Een rioolput met een inrichting bestemd voor het verpompen van afvalwater.
definition: [NEN 3300:1996] rioolput met een inrichting voor het verpompen van afvalwater
author at start life: Finy Teitsma (Oranjewoud)
date of start life: 2006-02-20
scope note: Cof TOP
type: Class
subclass of: Rioolput
subclass of: Restriction
  author of change: Marinus Vonhof
  date of change: 2016-04-15
  author at start life: Finy Teitsma (Oranjewoud)
  date of start life: 2006-02-25
  comment: per definitie
  on class: Pomp
  on property: has as part
  min qualified cardinality: 1
subclass of: Restriction
  author at start life: Marinus Vonhof
  date of start life: 2019-07-11
  on class: Pompschakeling
  on property: has as aspect
  max qualified cardinality: 1
subclass of: Restriction
  author at start life: Marinus Vonhof
  date of start life: 2024-05-16
  on class: Compartiment
  on property: has as part
  min qualified cardinality: 0
subclass of: Restriction
  on property: heeft Functie
  has value: Verpompen van afvalwater
subclass of: Restriction
  on class: Rioolstelsel
  on property: has as part (inverse)
  max qualified cardinality: 1

Materie
author of change: Marinus Vonhof
date of change: 2024-05-16
date of change: 2024-12-23
author at start life: Wouter Johan Eric
date of start life: 2021-08-30
validity context: *d
scope note: Cof TOP
type: Class

Structuur
author of change: Marinus Vonhof
date of change: 2021-01-09
definition: Onderscheidende beschrijving van topologie, afmetingen, opbouw (delen)
author at start life: Marinus Vonhof
date of start life: 2013-09-29
validity context: 6d
comment: Onderscheidend kenmerk
comment: [is aspect]
scope note: Cof TOP
type: Class
subclass of: Onderscheidend kenmerk

Bezinkbassin
author of change: Wouter van Riel
date of change: 2021-09-23
definition: [NEN 3300:1996] reservoir waardoor afvalwater wordt gevoerd en waarin slibafzetting plaatsvindt, met een voorziening om het slib te kunnen verwijderen
author at start life: Marinus Vonhof
date of start life: 2012-04-29
scope note: Cof MDS
scope note: Cof HYD
scope note: Cof RGM
type: Class
subclass of: Reservoir
subclass of: Restriction
  author of change: Marinus Vonhof
  date of change: 2016-04-24
  author at start life: Finy Teitsma (Oranjewoud)
  date of start life: 2007-10-23
  on class: Gemengd rioolstelsel
  on property: has as part (inverse)
  qualified cardinality: 1
subclass of: Restriction
  author at start life: Marinus Vonhof
  date of start life: 2015-05-29
  on class: Ledigingsvoorziening
  on property: has as part
  max qualified cardinality: 1
subclass of: Restriction
  author at start life: Marinus Vonhof
  date of start life: 2020-04-17
  on class: Verbeterd hemelwaterstelsel
  on property: has as part (inverse)
  max qualified cardinality: 1
subclass of: Restriction
  author at start life: Wouter van Riel
  date of start life: 2021-09-23
  on property: heeft Functie
  has value: Bezinken stoffen
subclass of: Restriction
  author at start life: Wouter van Riel
  date of start life: 2021-09-23
  on property: heeft Functie
  has value: Regeling van de afvoer van het afvalwater
subclass of: Restriction
  author at start life: Wouter van Riel
  date of start life: 2021-09-23
  on property: heeft Functie
  has value: Tijdelijke berging van afvalwater
subclass of: Restriction
  author at start life: Wouter van Riel
  date of start life: 2021-09-23
  on property: heeft Doel
  has value: Verminderen vuilbelasting van oppervlaktewater
subclass of: Restriction
  author at start life: Wouter van Riel
  date of start life: 2021-09-23
  on property: heeft Doel
  has value: Verwijderen bezinksel

Bijzondere putconstructie
author of change: Marinus Vonhof
author of change: Johan Post
date of change: 2025-01-16
date of change: 2021-10-01
definition: Put met een constructie die niet onder bekend type is onder te brengen
author at start life: Marinus Vonhof
date of start life: 2014-04-29
scope note: Cof MDS
scope note: Cof REV
scope note: Cof HYD
type: Class
subclass of: Rioolput
subclass of: Restriction
  author of change: Marinus Vonhof
  date of change: 2016-04-13
  author at start life: Marinus Vonhof
  date of start life: 2014-04-29
  on class: Wand
  on property: has as part
  min qualified cardinality: 0
subclass of: Restriction
  author of change: Marinus Vonhof
  date of change: 2018-05-03
  author at start life: Marinus Vonhof
  date of start life: 2014-04-29
  on class: Compartiment
  on property: has as part
  min qualified cardinality: 0
subclass of: Restriction
  author of change: Marinus Vonhof
  date of change: 2019-05-16
  author at start life: Marinus Vonhof
  date of start life: 2014-04-29
  on class: Mechanische afsluiter
  on property: has as part
  min qualified cardinality: 0
subclass of: Restriction
  author at start life: Marinus Vonhof
  date of start life: 2014-04-29
  on class: Pomp
  on property: has as part
  min qualified cardinality: 0
subclass of: Restriction
  on property: heeft Uitvoering
  has value: Put met speciale voorzieningen

Wand
author of change: Marinus Vonhof
date of change: 2019-04-05
date of change: 2022-10-01
date of change: 2025-03-19
author at start life: Marinus Vonhof
date of start life: 2012-04-24
validity context: *f
scope note: Cof MDS
scope note: Cof REV
scope note: Cof HYD
scope note: Cof DMO
type: Class
subclass of: Constructieonderdeel
subclass of: Restriction
  author of change: Marinus Vonhof
  date of change: 2015-06-08
  author at start life: Marinus Vonhof
  date of start life: 2012-04-22
  validity context: 5t 11t 14t
  on class: Onderdeeloriëntatie
  on property: has as aspect
  max qualified cardinality: 1
subclass of: Restriction
  author of change: Marinus Vonhof
  date of change: 2016-04-13
  author at start life: Marinus Vonhof
  date of start life: 2014-04-29
  on class: Bijzondere putconstructie
  on property: has as part (inverse)
  max qualified cardinality: 1
subclass of: Restriction
  on property: heeft Technologie
  has value: Statisch

Diameter leiding
author of change: Marinus Vonhof
date of change: 2019-01-24
definition: De lengte van de middellijn van de cirkel die de binnen- of de buitenzijde van de leidingdoorsnede beschrijft. Gehanteerd wordt de handelsmaat (de nominale diameter). Voor kunststof is deze lengte de buitenmaat, voor de overige materialen de binnenmaat. Dat geldt ook voor (de kunststof) Polypropyleen (PP), hoewel daarvoor in andere praktijken soms de binnenmaat wordt gebruikt.
author at start life: Marinus Vonhof
date of start life: 2013-10-01
units of measurements: mm
comment: Intrinsiek aspect
comment: In datasets kan voor de afmeting van ronde leidingen zowel de diameter, hoogte of breedte als kenmerk worden gebruikt
comment: [is aspect]
scope note: Cof MDS
scope note: Cof PLI
scope note: Cof HYD
scope note: Cof DMO
type: Class
subclass of: Diameter
subclass of: Restriction
  author of change: Marinus Vonhof
  date of change: 2015-09-20
  author at start life: Marinus Vonhof
  date of start life: 2013-10-01
  on class: Leiding
  on property: has as aspect (inverse)
  max qualified cardinality: 1
subclass of: Restriction
  author at start life: Marinus Vonhof
  date of start life: 2024-05-16
  on class: Inwinning
  on property: has as aspect
  max qualified cardinality: 1
subclass of: Restriction
  on property: has as value
  all values from: Diameter leiding (datatype)

Binnenonderkant buis
author of change: Marinus Vonhof
date of change: 2015-06-01
definition: Hoogteligging t.o.v. NAP van de binnen-onderkant-buis van de leiding
author at start life: Marinus Vonhof
date of start life: 2014-11-28
units of measurements: m
see also: [IRIS-RIOKEN:2012] Binnonderkant buis
alternative label: B.o.b.
alternative label: B.o.k.
comment: [is aspect]
scope note: Cof TOP
type: Class
subclass of: Hoogte t.o.v. NAP
subclass of: Restriction
  on property: has as value
  all values from: decimal

Eindpunt onderdeel
author of change: Marinus Vonhof
date of change: 2017-12-12
definition: Als het eindpunt ontbreekt bij het onderdeel (doorlaat, pomp, wand) wordt uitgegaan van externe lozing. Het transport verdwijnt uit het stelsel
author at start life: Marinus Vonhof
date of start life: 2012-04-22
scope note: Cof MDS
scope note: Cof REV
scope note: Cof HYD
type: Class
subclass of: Vertex
subclass of: Restriction
  author of change: Marinus Vonhof
  date of change: 2017-12-07
  author at start life: Marinus Vonhof
  date of start life: 2012-04-22
  on class: Onderdeeloriëntatie
  on property: has as part (inverse)
  qualified cardinality: 1
subclass of: Restriction
  author at start life: Marinus Vonhof
  date of start life: 2017-12-12
  validity context: 5t 11t
  on class: Knooppunt
  on property: is connected to
  max qualified cardinality: 1

Blinde put
author of change: Marinus Vonhof
author of change: Eric van Gorkom
date of change: 2022-09-27
date of change: 2015-07-09
author at start life: Marinus Vonhof
date of start life: 2012-05-01
scope note: Cof REV
scope note: Cof BAS
scope note: Cof HYD
type: Class
subclass of: Put
subclass of: Extra objecttype (rol)
subclass of: Restriction
  on property: heeft Uitvoering
  has value: Geen opening aan de bovenzijde

B.o.b. eindpunt leiding
definition: Binnenonderkant buis ter plaatse van het eindpunt
notation: AXH
notation: GXH
author at start life: Marinus Vonhof
date of start life: 2013-03-26
units of measurements: m
alternative label: B.o.b. bij eindknoop t.o.v. NAP
comment: [is aspect]
scope note: Cof TOP
type: Class
subclass of: Binnenonderkant buis
subclass of: Restriction
  author of change: Marinus Vonhof
  date of change: 2018-12-06
  author at start life: Marinus Vonhof
  date of start life: 2016-11-09
  validity context: *t
  on class: Eindpunt leiding
  on property: has as aspect (inverse)
  max qualified cardinality: 1
subclass of: Restriction
  author at start life: Marinus Vonhof
  date of start life: 2015-10-29
  on class: Inwinning
  on property: has as aspect
  max qualified cardinality: 1
subclass of: Restriction
  on property: has as value
  all values from: decimal

Bochtstuk
author of change: Marinus Vonhof
date of change: 2017-12-13
definition: Een buis of buisstuk in de vorm van een bocht.
author at start life: Finy Teitsma (Oranjewoud)
date of start life: 2006-05-23
scope note: Cof MDS
scope note: Cof LDR
scope note: Cof REV
scope note: Cof PLI
scope note: Cof HYD
type: Class
subclass of: Verbindingsstuk
subclass of: Restriction
  on property: heeft Uitvoering
  has value: Buis in gebogen vorm
subclass of: Restriction
  on property: heeft Functie
  has value: Verbinden van leidingen in een hoek

Vorm
author of change: Marinus Vonhof
date of change: 2025-01-16
definition: Geometrische omschrijving
definition: [IMBOR] Kwalitatieve aanduiding van de contouren van een beheerobject.
author at start life: Marinus Vonhof
date of start life: 2016-04-23
validity context: 15d
comment: [is aspect]
scope note: Cof TOP
type: Class
subclass of: Kenmerk

Onderzoeken
author of change: Marinus Vonhof
date of change: 2015-08-24
definition: [NEN 3300:1996] Verzamelen, ordenen, analyseren en verwerken van gegevens, zodat informatie kan worden afgeleid over de toestand en het functioneren van de buitenriolering
author at start life: Marinus Vonhof
date of start life: 2013-03-26
validity context: 1f 3f 5d 10f 11d 12f 14f
scope note: Cof TOP
type: Class
subclass of: Maatregel

Boostergemaal
author of change: Marinus Vonhof
date of change: 2018-05-03
definition: Een gemaal voor het verhogen van de vloeistofdruk door het afvalwater rechtstreeks van een pompinstallatie naar de volgende te persen
author at start life: Finy Teitsma (Oranjewoud)
date of start life: 2007-10-23
scope note: Cof MDS
scope note: Cof HYD
scope note: Cof RGM
scope note: Cof DMO
type: Class
subclass of: Rioolgemaal
subclass of: Restriction
  on property: heeft Technologie
  has value: Direct transport door pompen zonder opvang in een ontvangput/kelder

Rioolgemaal
author of change: Marinus Vonhof
author of change: Johan Post
date of change: 2024-04-30
date of change: 2017-08-19
definition: Een gemaal voor het verpompen van afvalwater.
definition: [NEN 3300:1996] een inrichting voor het verpompen van afvalwater
definition: [NEN-EN 752:2008] geheel van gebouw, constructies en apparatuur dat wordt gebruikt om afvalwater via een persleiding te transporteren of om het afvalwater op andere wijze omhoog te brengen
author at start life: Marinus Vonhof
date of start life: 2012-04-29
see also: [IRIS-RIOKEN:2012] Civiel werk waarin alle technische voorzieningen zijn ondergebracht die benodigd zijn voor het verpompen van rioolwater. Voor het waterschap zijn in principe alleen de riooleindgemalen interessant, waar overdracht van afvalwater plaatsvindt naar een stelsel dat onder beheer van dit waterschap is.
see also: [IRIS-RIOKEN:2012] Influentgemaal is synoniem van Rioolgemaal
alternative label: Influentgemaal
scope note: Cof TOP
type: Class
subclass of: Gemaal
subclass of: Oorzaakobject
subclass of: Restriction
  author of change: Marinus Vonhof
  date of change: 2019-07-10
  author at start life: Marinus Vonhof
  date of start life: 2014-10-14
  on class: Transportstelsel
  on property: has as part (inverse)
  max qualified cardinality: 1
subclass of: Restriction
  author of change: Marinus Vonhof
  date of change: 2017-03-06
  author at start life: Nic Roest (Idoro)
  date of start life: 2007-11-29
  on class: Persleiding
  on property: is connected to
  min qualified cardinality: 0
subclass of: Restriction
  author at start life: Marinus Vonhof
  date of start life: 2020-05-26
  on class: Gemengd rioolstelsel
  on property: has as part (inverse)
  max qualified cardinality: 1
subclass of: Restriction
  author at start life: Marinus Vonhof
  date of start life: 2020-05-26
  on class: Verbeterd hemelwaterstelsel
  on property: has as part (inverse)
  max qualified cardinality: 1
subclass of: Restriction
  author at start life: Marinus Vonhof
  date of start life: 2020-05-26
  on class: Vuilwaterstelsel
  on property: has as part (inverse)
  max qualified cardinality: 1
subclass of: Restriction
  author at start life: Marinus Vonhof
  date of start life: 2024-07-15
  on class: Overstortbemaling
  on property: has as part
  min qualified cardinality: 0
subclass of: Restriction
  on property: heeft Functie
  has value: Verpompen van afvalwater

Onderhouden
label: Maintenance @en
author of change: Marinus Vonhof
date of change: 2020-10-28
definition: [EN 16323:2014] routine work undertaken to ensure the continuing performance of an asset @en
definition: [NEN 3300:1996] herstel van het oorspronkelijke functioneren, waarbij de toestand van objecten ongewijzigd gehandhaafd wordt
definition: [NEN-EN 752:2008] activiteiten die routinematig worden uitgevoerd om ervoor te zorgen dat de riolering goed blijft functioneren
author at start life: Marinus Vonhof
date of start life: 2013-02-05
validity context: 1f 3f 5d 10f 11d 12f 14f 16d
see also: [EN ISO 11298-1:2018] routine work undertaken to ensure the existing performance of an asset
scope note: Cof TOP
type: Class
subclass of: Maatregel
subclass of: Restriction
  on property: heeft Doel
  has value: Goed blijven functioneren
subclass of: Restriction
  on property: heeft Functie
  has value: Zonder toestandswijziging

Breedte bouwwerk
author of change: Marinus Vonhof
date of change: 2024-05-16
date of change: 2017-08-21
definition: De inwendige breedte van het bouwwerk
author at start life: Nic Roest (Idoro)
date of start life: 2006-02-21
units of measurements: mm
comment: Intrinsiek aspect
comment: [is aspect]
scope note: Cof MDS
scope note: Cof REV
scope note: Cof HYD
scope note: Cof RGM
type: Class
subclass of: Breedte
subclass of: Restriction
  author of change: Marinus Vonhof
  date of change: 2017-08-21
  author at start life: Finy Teitsma (Oranjewoud)
  date of start life: 2006-02-25
  validity context: 5t 11t
  on class: Bouwwerk
  on property: has as aspect (inverse)
  max qualified cardinality: 1
subclass of: Restriction
  on property: has as value
  all values from: Breedte bouwwerk (datatype)

Lengte bouwwerk
author of change: Marinus Vonhof
date of change: 2024-05-16
date of change: 2017-08-21
definition: De inwendige lengte van het bouwwerk
author at start life: Nic Roest (Idoro)
date of start life: 2006-02-21
units of measurements: mm
validity context: 15d
comment: [is aspect]
scope note: Cof MDS
scope note: Cof REV
scope note: Cof HYD
scope note: Cof RGM
type: Class
subclass of: Lengte
subclass of: Restriction
  author of change: Marinus Vonhof
  date of change: 2017-08-21
  author at start life: Finy Teitsma (Oranjewoud)
  date of start life: 2006-02-25
  validity context: 5t 11t
  on class: Bouwwerk
  on property: has as aspect (inverse)
  max qualified cardinality: 1
subclass of: Restriction
  on property: has as value
  all values from: Lengte bouwwerk (datatype)

Vorm bouwwerk
author of change: Marinus Vonhof
date of change: 2013-09-20
author at start life: Marinus Vonhof
date of start life: 2012-05-01
comment: Intrinsiek aspect
alternative label: Bouwwerkvorm
comment: [is aspect]
scope note: Cof MDS
scope note: Cof REV
scope note: Cof HYD
scope note: Cof RGM
type: Class
subclass of: Vorm
subclass of: Restriction
  author of change: Marinus Vonhof
  date of change: 2017-08-21
  author at start life: Finy Teitsma (Oranjewoud)
  date of start life: 2006-02-25
  validity context: 5t 11t
  on class: Bouwwerk
  on property: has as aspect (inverse)
  max qualified cardinality: 1
subclass of: Restriction
  on property: has as reference (qualification)
  all values from: Vorm put (coll)

Hoogte bouwwerk
author of change: Marinus Vonhof
date of change: 2024-05-16
date of change: 2017-08-21
definition: De inwendige hoogte van het bouwwerk
author at start life: Nic Roest (Idoro)
date of start life: 2006-02-21
units of measurements: mm
validity context: 5t 11t
comment: Intrinsiek aspect
comment: [is aspect]
scope note: Cof MDS
scope note: Cof REV
scope note: Cof HYD
type: Class
subclass of: Hoogte
subclass of: Restriction
  author of change: Marinus Vonhof
  date of change: 2017-08-21
  author at start life: Finy Teitsma (Oranjewoud)
  date of start life: 2006-02-25
  on class: Bouwwerk
  on property: has as aspect (inverse)
  max qualified cardinality: 1
subclass of: Restriction
  on property: has as value
  all values from: Hoogte bouwwerk (datatype)

Bouwwerkoriëntatie
author of change: Marinus Vonhof
date of change: 2018-12-05
definition: Een topologisch element dat de contouren (edge) of het zwaartepunt (vertex) van een bouwwerk beschrijft
author at start life: Marinus Vonhof
date of start life: 2017-12-12
scope note: Cof TOP
type: Class
subclass of: Knooppunt
subclass of: Restriction
  author of change: Marinus Vonhof
  date of change: 2017-08-21
  author at start life: Marinus Vonhof
  date of start life: 2017-08-19
  on class: Maaiveldoriëntatie
  on property: is connected to
  max qualified cardinality: 1
subclass of: Restriction
  author of change: Marinus Vonhof
  date of change: 2018-05-03
  author at start life: Marinus Vonhof
  date of start life: 2017-08-19
  validity context: 5t 11t
  on class: Bouwwerk
  on property: has as aspect (inverse)
  max qualified cardinality: 1
subclass of: Restriction
  author of change: Marinus Vonhof
  date of change: 2020-04-18
  date of change: 2026-07-24
  author at start life: Marinus Vonhof
  date of start life: 2016-11-09
  comment: Temporeel kenmerk, met kenmerk Inwinning
  on class: Buitengrens
  on property: has as aspect
  max qualified cardinality: 1

Materiaal bouwwerk
author at start life: Marinus Vonhof
date of start life: 2015-05-29
comment: Intrinsiek aspect
comment: [is aspect]
scope note: Cof MDS
scope note: Cof REV
scope note: Cof HYD
scope note: Cof RGM
type: Class
subclass of: Materiaal
subclass of: Restriction
  author at start life: Marinus Vonhof
  date of start life: 2017-08-21
  validity context: 5t 11t
  on class: Bouwwerk
  on property: has as aspect (inverse)
  max qualified cardinality: 1
subclass of: Restriction
  on property: has as reference (qualification)
  all values from: Materiaal put (coll)

Buitengrens
author of change: Marinus Vonhof
date of change: 2024-07-17
date of change: 2020-11-24
date of change: 2024-12-07
definition: Het vlak dat de buitengrens beschrijft van de ruimte of de bovenkant van de constructie (topini: outer boundary/1661)
author at start life: Marinus Vonhof
date of start life: 2013-09-03
units of measurements: gml
comment: [is aspect]
scope note: Cof TOP
type: Class
subclass of: Vlak
subclass of: Restriction
  author of change: Marinus Vonhof
  date of change: 2020-04-18
  author at start life: Marinus Vonhof
  date of start life: 2012-11-23
  on class: Putoriëntatie
  on property: has as aspect (inverse)
  max qualified cardinality: 1
subclass of: Restriction
  author of change: Marinus Vonhof
  date of change: 2020-04-18
  author at start life: Marinus Vonhof
  date of start life: 2016-11-09
  on class: Bouwwerkoriëntatie
  on property: has as aspect (inverse)
  max qualified cardinality: 1
subclass of: Restriction
  author of change: Marinus Vonhof
  date of change: 2020-04-18
  author at start life: Marinus Vonhof
  date of start life: 2016-11-09
  on class: Gebiedsoriëntatie
  on property: has as aspect (inverse)
  max qualified cardinality: 1
subclass of: Restriction
  on property: has as value
  all values from: gmlLiteral

Bovengrond
author of change: Marinus Vonhof
author of change: Johan Post
date of change: 2015-06-01
date of change: 2026-04-30
author at start life: Marinus Vonhof
date of start life: 2013-10-05
validity context: *f 16d
scope note: Cof TOP
type: Class
subclass of: Ruimte
subclass of: Restriction
  author at start life: Johan Post
  date of start life: 2026-04-30
  on class: Leiding
  on property: has as part
  min qualified cardinality: 0
subclass of: Restriction
  author at start life: Johan Post
  date of start life: 2026-04-30
  on class: Put
  on property: has as part
  min qualified cardinality: 0

Ruimte
author of change: Marinus Vonhof
date of change: 2017-11-16
definition: [Gellish] Is an inanimate physical object (a physical object that is not capable of life) that is volumetric and is enclosed by physical or imaginary boundaries and exists in time. This is distinguished from a volumetric spatial aspect and from a volume as a property. @en
author at start life: Marinus Vonhof
date of start life: 2013-09-03
validity context: *f 15d
comment: 2 of meer
scope note: Cof TOP
type: Class
subclass of: Restriction
  on property: has as part
  all values from: Class
    union of: Ruimte
    union of: Fysiek object
disjoint with: Fysiek object

Breedte
author of change: Marinus Vonhof
date of change: 2015-05-29
definition: In zelfde vlak als lengte, haaks op lengtemeting
author at start life: Nic Roest (Idoro)
date of start life: 2006-02-21
validity context: 15d
comment: [is aspect]
scope note: Cof TOP
type: Class
subclass of: Afstand

Breedte compartiment
author at start life: Marinus Vonhof
date of start life: 2011-12-15
units of measurements: mm
comment: Intrinsiek aspect
comment: [is aspect]
scope note: Cof MDS
scope note: Cof HYD
type: Class
subclass of: Breedte
subclass of: Restriction
  author of change: Marinus Vonhof
  date of change: 2018-05-03
  author at start life: Marinus Vonhof
  date of start life: 2011-12-15
  validity context: 5t 11t
  on class: Compartiment
  on property: has as aspect (inverse)
  max qualified cardinality: 1
subclass of: Restriction
  on property: has as value
  all values from: integer

Breedte opening
author of change: Marinus Vonhof
date of change: 2015-06-01
author at start life: Marinus Vonhof
date of start life: 2011-12-15
units of measurements: mm
comment: Intrinsiek aspect
comment: [is aspect]
scope note: Cof MDS
scope note: Cof REV
scope note: Cof HYD
type: Class
subclass of: Breedte
subclass of: Restriction
  author of change: Marinus Vonhof
  date of change: 2017-12-07
  author at start life: Marinus Vonhof
  date of start life: 2011-12-15
  validity context: 5t 11t
  on class: Doorlaat
  on property: has as aspect (inverse)
  max qualified cardinality: 1
subclass of: Restriction
  on property: has as value
  all values from: integer

Doorlaat
author of change: Marinus Vonhof
date of change: 2018-12-13
definition: Een regelvoorziening voor de stroming van het afvalwater.
notation: DRL
author at start life: Marinus Vonhof
date of start life: 2012-05-05
validity context: *f
scope note: Cof MDS
scope note: Cof REV
scope note: Cof PLI
scope note: Cof HYD
scope note: Cof DMO
type: Class
subclass of: Constructieonderdeel
subclass of: Restriction
  author of change: Marinus Vonhof
  date of change: 2016-04-15
  author at start life: Marinus Vonhof
  date of start life: 2011-12-15
  validity context: 5t 11t 14t
  on class: Contractiecoëfficiënt doorlaatprofiel
  on property: has as aspect
  max qualified cardinality: 1
subclass of: Restriction
  author of change: Marinus Vonhof
  date of change: 2017-09-06
  author at start life: Marinus Vonhof
  date of start life: 2011-12-15
  validity context: 5t 11t 14t
  on class: Maximale capaciteit doorlaat
  on property: has as aspect
  max qualified cardinality: 1
subclass of: Restriction
  author of change: Marinus Vonhof
  date of change: 2017-12-07
  author at start life: Marinus Vonhof
  date of start life: 2011-12-15
  validity context: 11t 14t
  on class: Hoogte opening
  on property: has as aspect
  max qualified cardinality: 1
subclass of: Restriction
  author of change: Marinus Vonhof
  date of change: 2017-12-07
  author at start life: Marinus Vonhof
  date of start life: 2011-12-15
  validity context: 5t 11t 14t
  on class: Breedte opening
  on property: has as aspect
  max qualified cardinality: 1
subclass of: Restriction
  author of change: Marinus Vonhof
  date of change: 2017-12-07
  author at start life: Marinus Vonhof
  date of start life: 2011-12-15
  validity context: 5t 11t 14t
  on class: Vorm opening
  on property: has as aspect
  max qualified cardinality: 1
subclass of: Restriction
  author of change: Marinus Vonhof
  date of change: 2017-12-07
  author at start life: Marinus Vonhof
  date of start life: 2017-08-31
  on class: Diameter opening
  on property: has as aspect
  max qualified cardinality: 1
subclass of: Restriction
  author at start life: Marinus Vonhof
  date of start life: 2011-12-15
  on property: has as aspect
  some values from: Breedte opening
subclass of: Restriction
  author at start life: Marinus Vonhof
  date of start life: 2011-12-15
  on property: has as aspect
  some values from: Hoogte opening
subclass of: Restriction
  author at start life: Marinus Vonhof
  date of start life: 2011-12-15
  on property: has as aspect
  some values from: Vorm opening
subclass of: Restriction
  author at start life: Marinus Vonhof
  date of start life: 2012-04-22
  validity context: 5t 11t 14t
  on class: Onderdeeloriëntatie
  on property: has as aspect
  max qualified cardinality: 1
subclass of: Restriction
  author at start life: Marinus Vonhof
  date of start life: 2017-08-31
  on property: has as aspect
  some values from: Diameter opening
subclass of: Restriction
  author at start life: Marinus Vonhof
  date of start life: 2017-09-06
  validity context: 5t 11t 14t
  on class: Stromingsrichting
  on property: has as aspect
  max qualified cardinality: 1
subclass of: Restriction
  author at start life: Marinus Vonhof
  date of start life: 2017-12-07
  validity context: 5t 11t 14t
  on class: Doorlaatniveau
  on property: has as aspect
  max qualified cardinality: 1
subclass of: Restriction
  author at start life: Marinus Vonhof
  date of start life: 2026-07-20
  on class: Rioolleiding
  on property: has as part (inverse)
  max qualified cardinality: 1
subclass of: Restriction
  author at start life: Marinus Vonhof
  date of start life: 2026-07-20
  on class: Transportleiding
  on property: has as part (inverse)
  max qualified cardinality: 1
subclass of: Restriction
  on property: heeft Functie
  has value: Beperken debiet

Breedte put
author of change: Marinus Vonhof
author of change: Johan Post
date of change: 2021-08-06
date of change: 2026-05-01
definition: De inwendige breedte (horizontaal, uit het bovenaanzicht). Indien aanwezig de breedte van de onderbak - zie afbeelding dc (bron EN13508-2)
author at start life: Marinus Vonhof
date of start life: 2018-10-17
units of measurements: mm
comment: Intrinsiek aspect
comment: [is aspect]
scope note: Cof TOP
type: Class
subclass of: Breedte
subclass of: Restriction
  author of change: Marinus Vonhof
  date of change: 2014-08-01
  author at start life: Finy Teitsma (Oranjewoud)
  date of start life: 2006-02-25
  validity context: *t
  on class: Put
  on property: has as aspect (inverse)
  max qualified cardinality: 1
subclass of: Restriction
  on property: has as value
  all values from: Breedte put (datatype)

Overstortput
label: Combined sewer overflow @en
author of change: Marinus Vonhof
author of change: Wouter van Riel
date of change: 2024-04-20
date of change: 2024-05-17
definition: Een rioolput voorzien van een overstortdrempel met een ontworpen drempellengte en -hoogte.
definition: [EN 16323:2014] device on a combined system that relieves the system of excess flow @en
definition: [NEN 3300:1996] rioolput voorzien van een overstortdrempel
definition: [Omgevingswet] Een kunstwerk waarmee rioolwater op het oppervlaktewater wordt geloosd, zodra het riool door te grote neerslaghoeveelheden niet al het rioolwater kan verwerken
author at start life: Finy Teitsma (Oranjewoud)
date of start life: 2006-02-20
validity context: 3f 10f 11f 14f
see also: [IRIS-RIOKEN:2012] Een inzamelknooppunt, uitgevoerd als voorziening met drempel, voor het onder bepaalde omstandigheden lozen van afvalwater uit het rioleringsnetwerk naar een ander rioleringsnetwerk of oppervlaktewater in de zin van de Wet verontreiniging oppervlaktewateren. Een riooloverstort is dus een voorziening door middel waarvan bij de neerslag van hemelwater het teveel aan hemelwater, al of niet vermengd met afvalwater dat niet in het stelsel wordt geborgen, kan worden geloosd op oppervlaktewater.
alternative label: Overstort
alternative label: Riooloverstort
scope note: Cof TOP
type: Class
subclass of: Rioolput
subclass of: Oorzaakobject
subclass of: Restriction
  author of change: Marinus Vonhof
  date of change: 2021-08-06
  author at start life: Finy Teitsma (Oranjewoud)
  date of start life: 2006-02-25
  comment: per definitie
  on class: Overstortdrempel
  on property: has as part
  min qualified cardinality: 1
subclass of: Restriction
  author of change: Wouter van Riel
  date of change: 2022-09-26
  author at start life: Marinus Vonhof
  date of start life: 2014-04-29
  comment: per definitie
  on class: Keerklep
  on property: has as part
  min qualified cardinality: 0
subclass of: Restriction
  author of change: Wouter van Riel
  date of change: 2024-04-20
  author at start life: Marinus Vonhof
  date of start life: 2014-04-29
  on class: Compartiment
  on property: has as part
  min qualified cardinality: 1
subclass of: Restriction
  author at start life: Marinus Vonhof
  date of start life: 2024-05-17
  on class: Overstortbemaling
  on property: has as part
  min qualified cardinality: 0
subclass of: Restriction
  on property: heeft Toepassing
  has value: Calamiteit
subclass of: Restriction
  on property: heeft Functie
  has value: Overtollig afvalwater laten wegstromen

Constructieonderdeeloriëntatie
author of change: Marinus Vonhof
date of change: 2024-07-30
definition: Een topologisch element dat de ligging van het constructieonderdeel beschrijft, de bijbehorend geometrie kan een punt of lijn zijn. Bij een buisvormig deel (deelliner, buisdeel) beschrijft de geometrie (punt of lijn) het midden van de binnenonderkant
author at start life: Wouter van Riel
date of start life: 2024-04-22
scope note: Cof BAS
scope note: Cof PLI
scope note: Cof HYD
type: Class
subclass of: Representatie fysiek object
subclass of: Restriction
  author at start life: Marinus Vonhof
  date of start life: 2024-07-30
  on class: Punt
  on property: has as aspect
  max qualified cardinality: 1
subclass of: Restriction
  author at start life: Marinus Vonhof
  date of start life: 2024-07-30
  on class: Wand
  on property: has as aspect (inverse)
  max qualified cardinality: 1
subclass of: Restriction
  author at start life: Wouter van Riel
  date of start life: 2024-04-22
  on class: Lijn
  on property: has as aspect
  max qualified cardinality: 1

Wanddikte
author of change: Marinus Vonhof
author of change: Johan Post
date of change: 2024-05-02
date of change: 2019-09-02
definition: Dikte van de wand van de constructie
notation: AXE
notation: CXE
author at start life: Nic Roest (Idoro)
date of start life: 2006-02-21
units of measurements: mm
comment: [is aspect]
scope note: Cof MDS
scope note: Cof EN
scope note: Cof RRB
scope note: Cof PLI
scope note: Cof HYD
type: Class
subclass of: Dikte
subclass of: Restriction
  author of change: Marinus Vonhof
  date of change: 2019-09-02
  author at start life: Finy Teitsma (Oranjewoud)
  date of start life: 2006-02-25
  on class: Leiding
  on property: has as aspect (inverse)
  max qualified cardinality: 1
subclass of: Restriction
  author at start life: Marinus Vonhof
  date of start life: 2015-10-21
  on class: Put
  on property: has as aspect (inverse)
  max qualified cardinality: 1
subclass of: Restriction
  on property: has as value
  all values from: integer

Vlak
author of change: Marinus Vonhof
date of change: 2019-05-15
definition: Tweedimensionaal geometrisch element. Voor geografische beschrijvingen conform coordinatenstelsel EPSG:7415 (x/y conform EPSG:28992, optioneel z conform EPSG:5709).
author at start life: Marinus Vonhof
date of start life: 2016-11-09
units of measurements: gml
comment: [is aspect]
scope note: Cof TOP
type: Class
subclass of: Geometrie
subclass of: Restriction
  on property: has as value
  all values from: gmlLiteral

Putoriëntatie
author of change: Marinus Vonhof
date of change: 2018-12-10
definition: Een topologisch element dat het zwaartepunt (vertex) van de bovenkant putbodem en/of de contouren van de constructie (edge) beschrijft.
author at start life: Marinus Vonhof
date of start life: 2017-12-12
scope note: Cof TOP
type: Class
subclass of: Knooppunt
subclass of: Restriction
  author of change: Marinus Vonhof
  date of change: 2017-12-12
  author at start life: Marinus Vonhof
  date of start life: 2015-11-07
  validity context: 5t 11t
  on class: Maaiveldoriëntatie
  on property: is connected to
  max qualified cardinality: 1
subclass of: Restriction
  author of change: Marinus Vonhof
  date of change: 2020-04-18
  author at start life: Marinus Vonhof
  date of start life: 2012-11-23
  comment: Temporeel kenmerk, met kenmerk Inwinning
  on class: Buitengrens
  on property: has as aspect
  min qualified cardinality: 0
subclass of: Restriction
  author of change: Marinus Vonhof
  date of change: 2020-11-25
  author at start life: Marinus Vonhof
  date of start life: 2014-05-02
  on class: Hydraulisch rioleringsmodel
  on property: has as part (inverse)
  qualified cardinality: 1
subclass of: Restriction
  author at start life: Marinus Vonhof
  date of start life: 2012-04-22
  validity context: *t
  on class: Put
  on property: has as aspect (inverse)
  max qualified cardinality: 1

Gebiedsoriëntatie
author of change: Marinus Vonhof
date of change: 2020-11-24
definition: Een topologisch element dat (de contouren van) het gebied, systeem of stelsel beschrijft
author at start life: Marinus Vonhof
date of start life: 2016-11-09
scope note: Cof MDS
scope note: Cof HYD
scope note: Cof DMO
type: Class
subclass of: Representatie fysiek object
subclass of: Restriction
  author of change: Marinus Vonhof
  date of change: 2016-11-09
  author at start life: Marinus Vonhof
  date of start life: 2015-07-28
  on class: Gebied
  on property: has as aspect (inverse)
  max qualified cardinality: 1
subclass of: Restriction
  author of change: Marinus Vonhof
  date of change: 2020-04-18
  author at start life: Marinus Vonhof
  date of start life: 2016-11-09
  comment: Temporeel kenmerk, met kenmerk Inwinning
  on class: Buitengrens
  on property: has as aspect
  min qualified cardinality: 0
subclass of: Restriction
  author at start life: Marinus Vonhof
  date of start life: 2020-04-20
  on class: Stelsel
  on property: has as aspect (inverse)
  max qualified cardinality: 1
subclass of: Restriction
  author at start life: Marinus Vonhof
  date of start life: 2020-04-20
  on class: Systeem
  on property: has as aspect (inverse)
  max qualified cardinality: 1

Materiaal put
label: Material (manhole) @en
author of change: Marinus Vonhof
date of change: 2014-12-17
definition: [EN13508-2+A1] The material of the fabric of the manhole or inspection chamber in accordance with Table C.4. @en
notation: CCD
notation: ECD
notation: JCD
author at start life: Marinus Vonhof
date of start life: 2012-05-01
comment: Intrinsiek aspect
alternative label: Putmateriaal
comment: [is aspect]
scope note: Cof TOP
type: Class
subclass of: Materiaal
subclass of: Restriction
  author of change: Marinus Vonhof
  date of change: 2015-06-01
  author at start life: Finy Teitsma (Oranjewoud)
  date of start life: 2007-10-24
  validity context: *t
  on class: Put
  on property: has as aspect (inverse)
  max qualified cardinality: 1
subclass of: Restriction
  on property: has as reference (qualification)
  all values from: Materiaal put (coll)

Reinigen
label: Cleaning @en
author of change: Marinus Vonhof
date of change: 2018-05-01
definition: [EN 16323:2014] operation consisting of removing deposited solid matter or obstructions @en
author at start life: Marinus Vonhof
date of start life: 2016-04-24
validity context: 1f 3f 5d 10f 11d 12f 14f
scope note: Cof TOP
type: Class
subclass of: Onderhouden

Capaciteit gemaal
author of change: Johan Post
date of change: 2022-11-25
definition: De in de praktijk maximaal leverbare hoeveelheid per tijdseenheid (de capaciteit kan variëren door wisselende drukhoogte en pompschakeling)
author at start life: Marinus Vonhof
date of start life: 2015-05-29
units of measurements: m3/h
alternative label: Gemaalcapaciteit
alternative label: Geïnstalleerde capaciteit gemaal
comment: [is aspect]
scope note: Cof BAS
scope note: Cof HYD
scope note: Cof RGM
scope note: Cof DMO
type: Class
subclass of: Capaciteit
subclass of: Restriction
  author of change: Marinus Vonhof
  date of change: 2018-12-12
  author at start life: Marinus Vonhof
  date of start life: 2018-12-06
  on class: Gemaal
  on property: has as aspect (inverse)
  qualified cardinality: 1
subclass of: Restriction
  on property: has as value
  all values from: decimal

Centrifugaalpomp
author of change: Finy Teitsma (Oranjewoud)
date of change: 2007-10-25
definition: Een pomp waarbij de vloeistof wordt verpompt met een draaiend rad (rotor of waaier).
author at start life: Finy Teitsma (Oranjewoud)
date of start life: 2007-10-24
scope note: Cof BAS
scope note: Cof HYD
scope note: Cof RGM
scope note: Cof DMO
type: Class
subclass of: Pomp
subclass of: Restriction
  on property: heeft Technologie
  has value: Verplaatsing door middel van een draaiend rad

Lengte compartiment
author at start life: Marinus Vonhof
date of start life: 2011-12-15
units of measurements: mm
comment: [is aspect]
scope note: Cof MDS
scope note: Cof HYD
type: Class
subclass of: Lengte
subclass of: Restriction
  author of change: Marinus Vonhof
  date of change: 2015-07-28
  author at start life: Marinus Vonhof
  date of start life: 2011-12-15
  on class: Compartiment
  on property: has as aspect (inverse)
  max qualified cardinality: 1
subclass of: Restriction
  on property: has as value
  all values from: integer

Stuwput
author of change: Marinus Vonhof
date of change: 2015-02-28
date of change: 2026-07-20
definition: Een rioolput voorzien van een wand met opening of bijvoorbeeld een wervelventiel om de bergingscapaciteit van het bovenstroomse rioolstelsel te benutten.
definition: [NEN 3300:1996] Rioolput voorzien van een afvoerbeperking
author at start life: Finy Teitsma (Oranjewoud)
date of start life: 2006-02-20
comment: 20151014: NEN3300-definitie aangepast
scope note: Cof MDS
scope note: Cof RRB
scope note: Cof LDR
scope note: Cof REV
scope note: Cof HYD
type: Class
subclass of: Rioolput
subclass of: Restriction
  author of change: Marinus Vonhof
  date of change: 2016-04-22
  author at start life: Marinus Vonhof
  date of start life: 2014-04-29
  comment: per definitie
  on class: Compartiment
  on property: has as part
  min qualified cardinality: 2
subclass of: Restriction
  author of change: Marinus Vonhof
  date of change: 2018-12-12
  author at start life: Marinus Vonhof
  date of start life: 2017-12-07
  on class: Opening in wand
  on property: has as part
  max qualified cardinality: 1
subclass of: Restriction
  author of change: Marinus Vonhof
  date of change: 2020-04-17
  author at start life: Marinus Vonhof
  date of start life: 2017-12-07
  on class: Stuwklep
  on property: has as part
  max qualified cardinality: 1
subclass of: Restriction
  author at start life: Marinus Vonhof
  date of start life: 2017-12-07
  on class: Stuwmuur
  on property: has as part
  max qualified cardinality: 1
subclass of: Restriction
  author at start life: Marinus Vonhof
  date of start life: 2018-12-12
  on class: Wervelventiel
  on property: has as part
  max qualified cardinality: 1
subclass of: Restriction
  on property: heeft Functie
  has value: Waterniveau in stelsel regelen

Compartimentoriëntatie
author of change: Marinus Vonhof
date of change: 2018-12-05
definition: Een topologisch element dat het zwaartepunt (vertex) van de bovenkant compartimentbodem beschrijft
author at start life: Marinus Vonhof
date of start life: 2017-12-12
validity context: 1d
scope note: Cof BAS
scope note: Cof HYD
type: Class
subclass of: Knooppunt
subclass of: Restriction
  author of change: Marinus Vonhof
  date of change: 2018-05-03
  author at start life: Marinus Vonhof
  date of start life: 2012-04-22
  validity context: 5t 11t
  on class: Compartiment
  on property: has as aspect (inverse)
  max qualified cardinality: 1
subclass of: Restriction
  author at start life: Marinus Vonhof
  date of start life: 2026-07-24
  on class: Buitengrens
  on property: has as aspect
  max qualified cardinality: 1
subclass of: Restriction
  author at start life: Marinus Vonhof
  date of start life: 2026-07-24
  on class: Infiltratiecompartiment
  on property: has as aspect (inverse)
  max qualified cardinality: 1

Vorm compartiment
author at start life: Marinus Vonhof
date of start life: 2015-11-06
comment: Intrinsiek aspect
comment: [is aspect]
scope note: Cof HYD
scope note: Cof RGM
type: Class
subclass of: Vorm
subclass of: Restriction
  author of change: Marinus Vonhof
  date of change: 2017-08-31
  author at start life: Marinus Vonhof
  date of start life: 2015-11-06
  validity context: 5t 11t
  on class: Compartiment
  on property: has as aspect (inverse)
  max qualified cardinality: 1
subclass of: Restriction
  date of change: 2017-05-17
  author at start life: Marinus Vonhof
  date of start life: 2015-11-06
  on class: Inwinning
  on property: has as aspect
  max qualified cardinality: 1
subclass of: Restriction
  on property: has as reference (qualification)
  all values from: Vorm put (coll)

Lateraal afvoerend oppervlak
definition: HWA aansluiting vanuit ander rioolstelsel. Uitgedrukt in de equivalente hoeveelheid van het oppervlaktype Gesloten Verhard Oppervlak Vlak
author at start life: Marinus Vonhof
date of start life: 2017-08-31
units of measurements: m2
scope note: Cof HYD
type: Class
subclass of: Bovengrond
subclass of: Restriction
  author of change: Marinus Vonhof
  date of change: 2018-05-03
  author at start life: Marinus Vonhof
  date of start life: 2017-08-31
  on class: Rioolput
  on property: has as aspect (inverse)
  max qualified cardinality: 1
subclass of: Restriction
  author at start life: Marinus Vonhof
  date of start life: 2017-08-31
  on class: Compartiment
  on property: has as aspect (inverse)
  max qualified cardinality: 1
subclass of: Restriction
  author at start life: Marinus Vonhof
  date of start life: 2017-08-31
  on class: Gemengd riool
  on property: has as aspect (inverse)
  max qualified cardinality: 1
subclass of: Restriction
  author at start life: Marinus Vonhof
  date of start life: 2017-08-31
  on class: Hemelwaterriool
  on property: has as aspect (inverse)
  max qualified cardinality: 1
subclass of: Restriction
  on property: has as value
  all values from: decimal

Lateraal debiet
author of change: Johan Post
date of change: 2022-11-25
definition: Lozingsdebiet vanuit ander rioolstelsel
author at start life: Marinus Vonhof
date of start life: 2017-08-31
units of measurements: m3/h
comment: [is aspect]
scope note: Cof HYD
type: Class
subclass of: Lozingsdebiet
subclass of: Restriction
  author of change: Marinus Vonhof
  date of change: 2018-05-03
  author at start life: Marinus Vonhof
  date of start life: 2017-08-31
  on class: Rioolput
  on property: has as aspect (inverse)
  max qualified cardinality: 1
subclass of: Restriction
  author at start life: Marinus Vonhof
  date of start life: 2017-08-31
  on class: Compartiment
  on property: has as aspect (inverse)
  max qualified cardinality: 1
subclass of: Restriction
  author at start life: Marinus Vonhof
  date of start life: 2017-08-31
  on class: Gemengd riool
  on property: has as aspect (inverse)
  max qualified cardinality: 1
subclass of: Restriction
  on property: has as value
  all values from: decimal

Hoogte compartiment
definition: De inwendige hoogte van het compartiment
author at start life: Wouter van Riel
date of start life: 2024-04-22
units of measurements: mm
comment: Intrinsiek aspect
comment: [is aspect]
scope note: Cof MDS
scope note: Cof HYD
type: Class
subclass of: Hoogte
subclass of: Restriction
  author at start life: Wouter van Riel
  date of start life: 2024-04-22
  on class: Compartiment
  on property: has as aspect (inverse)
  max qualified cardinality: 1
subclass of: Restriction
  on property: has as value
  all values from: integer

Type verloop (coll)
comment: [is coll]
scope note: Cof HDX
type: Class
subclass of: Verzameling soorten
subclass of: Class
  one of: Constant debiet per uur met variabel dagvolume
  one of: Variabel debiet per uur met vast dagvolume
  one of: Variabel debiet per uur met variabel dagvolume

T-stuk
author of change: Marinus Vonhof
date of change: 2025-01-16
date of change: 2018-10-17
definition: Een verbindingsstuk dat drie leidingen onder een rechte hoek (haaks) verbindt
definition: [IMBOR] Een verbindingsstuk in de vorm van een T-splitsing.
author at start life: Marinus Vonhof
date of start life: 2012-04-24
validity context: 1d
scope note: Cof MDS
scope note: Cof LDR
scope note: Cof REV
scope note: Cof PLI
scope note: Cof HYD
type: Class
subclass of: Verbindingsstuk
subclass of: Restriction
  on property: heeft Functie
  has value: Verbinden van drie leidingen

Continue lozing
author of change: Johan Post
date of change: 2022-11-25
date of change: 2024-10-21
definition: Lozing met een constant debiet zonder verloop. Denk hierbij aan de inloop van rioolvreemdwater of een proceswaterlozing waarbij geen sprake is van een dagvariatie.
author at start life: Marinus Vonhof
date of start life: 2011-12-15
units of measurements: m3/h
comment: [is aspect]
scope note: Cof HYD
type: Class
subclass of: Kenmerk
subclass of: Restriction
  author of change: Marinus Vonhof
  date of change: 2018-05-03
  author at start life: Marinus Vonhof
  date of start life: 2011-12-15
  on class: Rioolput
  on property: has as aspect (inverse)
  max qualified cardinality: 1
subclass of: Restriction
  on property: has as value
  all values from: Continue lozing (datatype)
subclass of: Restriction
  on class: Vrijverval rioolleiding
  on property: has as aspect (inverse)
  max qualified cardinality: 1

Contractiecoëfficiënt doorlaatprofiel
author of change: Marinus Vonhof
date of change: 2025-01-16
date of change: 2015-09-20
definition: [IMBOR] De verhouding in een bepaalde dwarsdoorsnede tussen het stroomvoerende en het geometrische profiel van een opening in een wand.
author at start life: Marinus Vonhof
date of start life: 2011-12-15
comment: [is aspect]
scope note: Cof HYD
type: Class
subclass of: Kenmerk
subclass of: Restriction
  author of change: Marinus Vonhof
  date of change: 2016-04-15
  author at start life: Marinus Vonhof
  date of start life: 2011-12-15
  validity context: 5t 11t
  on class: Doorlaat
  on property: has as aspect (inverse)
  max qualified cardinality: 1
subclass of: Restriction
  on property: has as value
  all values from: Contractiecoëfficiënt doorlaatprofiel (datatype)

DIT-riool
author of change: Marinus Vonhof
author of change: Johan Post
date of change: 2021-08-05
date of change: 2026-05-01
date of change: 2026-05-18
definition: Een rioolleiding met waterdoorlatende wanden bestemd voor de inzameling en transport van grondwater en hemelwater. Het grondwaterpeil wordt afgevlakt door infiltratie van hemelwater of exfiltratie van grondwater (drainage).
author at start life: Marinus Vonhof
date of start life: 2018-12-06
alternative label: Drainage infiltratie transportriool
scope note: Cof MDS
scope note: Cof HYD
type: Class
subclass of: Vrijverval rioolleiding
subclass of: Restriction
  author of change: Marinus Vonhof
  date of change: 2026-07-13
  author at start life: Marinus Vonhof
  date of start life: 2018-12-06
  on class: Omhulling
  on property: has as part
  max qualified cardinality: 1
subclass of: Restriction
  author at start life: Marinus Vonhof
  date of start life: 2020-04-18
  on class: Hemelwaterstelsel
  on property: has as part (inverse)
  max qualified cardinality: 1
subclass of: Restriction
  author at start life: Marinus Vonhof
  date of start life: 2026-07-24
  on class: Infiltratievoorziening
  on property: has as part (inverse)
  max qualified cardinality: 1
subclass of: Restriction
  author at start life: Wouter van Riel
  date of start life: 2021-11-19
  on property: heeft Functie
  has value: Afvoeren hemelwater naar de ondergrond
subclass of: Restriction
  author at start life: Wouter van Riel
  date of start life: 2021-11-19
  on property: heeft Functie
  has value: Inzamelen hemelwater en afgifte aan ondergrond
subclass of: Restriction
  author at start life: Wouter van Riel
  date of start life: 2021-11-19
  on property: heeft Functie
  has value: Inzameling van grondwater
subclass of: Restriction
  author at start life: Wouter van Riel
  date of start life: 2021-11-19
  on property: heeft Functie
  has value: Inzameling van hemelwater
subclass of: Restriction
  author at start life: Wouter van Riel
  date of start life: 2021-11-19
  on property: heeft Functie
  has value: Transport van grondwater
subclass of: Restriction
  author at start life: Wouter van Riel
  date of start life: 2021-11-19
  on property: heeft Functie
  has value: Transport van hemelwater
subclass of: Restriction
  author at start life: Wouter van Riel
  date of start life: 2022-09-26
  on class: Drainage/infiltratie transportstelsel
  on property: has as part (inverse)
  max qualified cardinality: 1

Omhulling
author of change: Marinus Vonhof
date of change: 2026-07-13
definition: Bekleding van de buitenzijde
author at start life: Marinus Vonhof
date of start life: 2026-07-13
comment: Was Leidingomhulling, wordt meer algemeen. URI gewijzigd vanaf versie 1.7.0
alternative label: Bekleding
alternative label: Mantel
scope note: Cof MDS
scope note: Cof HYD
type: Class
subclass of: Constructieonderdeel
subclass of: Restriction
  author at start life: Marinus Vonhof
  date of start life: 2018-12-06
  on class: DT-riool
  on property: has as part (inverse)
  max qualified cardinality: 1
subclass of: Restriction
  author at start life: Marinus Vonhof
  date of start life: 2018-12-06
  on class: Drain
  on property: has as part (inverse)
  max qualified cardinality: 1
subclass of: Restriction
  author at start life: Marinus Vonhof
  date of start life: 2018-12-06
  on class: Infiltratieriool
  on property: has as part (inverse)
  max qualified cardinality: 1
subclass of: Restriction
  author at start life: Marinus Vonhof
  date of start life: 2026-07-13
  on class: DIT-riool
  on property: has as part (inverse)
  max qualified cardinality: 1
subclass of: Restriction
  author at start life: Marinus Vonhof
  date of start life: 2026-07-13
  on class: Infiltratiekoffer
  on property: has as part (inverse)
  max qualified cardinality: 1
subclass of: Restriction
  author at start life: Marinus Vonhof
  date of start life: 2026-07-13
  on class: Infiltratiekrat
  on property: has as part (inverse)
  max qualified cardinality: 1
subclass of: Restriction
  author at start life: Marinus Vonhof
  date of start life: 2026-07-13
  on class: Infiltratieput
  on property: has as part (inverse)
  max qualified cardinality: 1
subclass of: Restriction
  on property: heeft Uitvoering
  has value: Bekleding buitenzijde object

Drainage/infiltratie transportstelsel
author of change: Marinus Vonhof
author of change: Johan Post
date of change: 2025-01-16
date of change: 2026-05-01
date of change: 2026-06-30
definition: Een stelsel van hemelwaterriolen en geperforeerde buizen dat, afhankelijk van de grondwaterstand, een drainerende of infiltrerende werking heeft, en dat tevens dient voor het transport van overtollig water hemel- en grondwater
author at start life: Wouter van Riel
date of start life: 2022-09-26
alternative label: DIT-stelsel
alternative label: Gecombineerd infiltratiestelsel
scope note: Cof BAS
scope note: Cof HYD
type: Class
subclass of: Infiltratiestelsel
subclass of: Restriction
  author of change: Johan Post
  date of change: 2026-06-30
  author at start life: Johan Post
  date of start life: 2026-05-01
  on class: DIT-riool
  on property: has as part
  min qualified cardinality: 1
subclass of: Restriction
  author at start life: Wouter van Riel
  date of start life: 2022-09-26
  on class: DT-riool
  on property: has as part
  min qualified cardinality: 0
subclass of: Restriction
  author at start life: Wouter van Riel
  date of start life: 2022-09-26
  on class: Drain
  on property: has as part
  min qualified cardinality: 0
subclass of: Restriction
  author at start life: Wouter van Riel
  date of start life: 2022-09-26
  on class: Hemelwaterriool
  on property: has as part
  min qualified cardinality: 0
subclass of: Restriction
  on property: heeft Functie
  has value: Drainage en transport van hemel- en grondwater
subclass of: Restriction
  on property: heeft Uitvoering
  has value: Geheel van verbonden DIT riolen, drains en hemelwaterriolen

DT-riool
author of change: Marinus Vonhof
author of change: Johan Post
author of change: Eric van Gorkom
date of change: 2021-08-06
date of change: 2026-05-01
date of change: 2024-05-13
date of change: 2026-05-18
definition: Een rioolleiding met waterdoorlatende wanden bestemd voor de inzameling en transport van grondwater en eventueel ook hemelwater, waarbij grondwater via de wanden kan intreden
author at start life: Marinus Vonhof
date of start life: 2018-12-06
alternative label: Drainage transportriool
alternative label: Exfiltratieriool
scope note: Cof MDS
scope note: Cof HYD
type: Class
subclass of: Vrijverval rioolleiding
subclass of: Restriction
  author of change: Marinus Vonhof
  date of change: 2026-07-13
  author at start life: Marinus Vonhof
  date of start life: 2018-12-06
  on class: Omhulling
  on property: has as part
  max qualified cardinality: 1
subclass of: Restriction
  author at start life: Marinus Vonhof
  date of start life: 2020-04-18
  on class: Hemelwaterstelsel
  on property: has as part (inverse)
  max qualified cardinality: 1
subclass of: Restriction
  author at start life: Marinus Vonhof
  date of start life: 2024-08-01
  on property: heeft Functie
  has value: Inzameling van grondwater
subclass of: Restriction
  author at start life: Marinus Vonhof
  date of start life: 2024-08-01
  on property: heeft Functie
  has value: Inzameling van hemelwater
subclass of: Restriction
  author at start life: Marinus Vonhof
  date of start life: 2024-08-01
  on property: heeft Functie
  has value: Transport van grondwater
subclass of: Restriction
  author at start life: Marinus Vonhof
  date of start life: 2024-08-01
  on property: heeft Functie
  has value: Transport van hemelwater
subclass of: Restriction
  author at start life: Marinus Vonhof
  date of start life: 2026-07-24
  on class: Infiltratievoorziening
  on property: has as part (inverse)
  max qualified cardinality: 1

Dakoppervlak hellend
notation: DAK_HEL
author at start life: Marinus Vonhof
date of start life: 2011-12-15
units of measurements: m2
comment: [is aspect]
scope note: Cof MDS
scope note: Cof HYD
type: Class
subclass of: Afvoerend oppervlak hellend
subclass of: Restriction
  on property: has as value
  all values from: Dakoppervlak hellend (datatype)

Dakoppervlak vlak
notation: DAK_VLA
author at start life: Marinus Vonhof
date of start life: 2011-12-15
units of measurements: m2
comment: [is aspect]
scope note: Cof MDS
scope note: Cof HYD
type: Class
subclass of: Afvoerend oppervlak vlak
subclass of: Restriction
  on property: has as value
  all values from: Dakoppervlak vlak (datatype)

Dakoppervlak vlak uitgestrekt
notation: DAK_VLU
author at start life: Marinus Vonhof
date of start life: 2011-12-15
units of measurements: m2
comment: [is aspect]
scope note: Cof MDS
scope note: Cof HYD
type: Class
subclass of: Afvoerend oppervlak vlak uitgestrekt
subclass of: Restriction
  on property: has as value
  all values from: Dakoppervlak vlak uitgestrekt (datatype)

Datum inwinning
author of change: Johan Post
date of change: 2022-09-29
author at start life: Marinus Vonhof
date of start life: 2015-10-29
units of measurements: yyyy-mm-dd
alternative label: Inwinningsdatum
comment: [is aspect]
scope note: Cof TOP
type: Class
subclass of: Datum
subclass of: Restriction
  date of change: 2019-04-25
  author at start life: Marinus Vonhof
  date of start life: 2015-10-29
  on class: Inwinning
  on property: has as aspect (inverse)
  max qualified cardinality: 1
subclass of: Restriction
  on property: has as value
  all values from: date

Datum maatregel
author of change: Marinus Vonhof
date of change: 2019-03-14
definition: De datum waarop de status van de maatregel (ontwerp, uitgevoerd) is ingegaan. Als de status ontbreekt de datum waarop de uitvoering van de maatregel is afgerond
author at start life: Marinus Vonhof
date of start life: 2013-03-26
units of measurements: yyyy-mm-dd
validity context: 6d 15d
comment: [is aspect]
scope note: Cof TOP
type: Class
subclass of: Datum
subclass of: Restriction
  author of change: Marinus Vonhof
  date of change: 2018-05-01
  author at start life: Marinus Vonhof
  date of start life: 2013-03-26
  validity context: *t
  on class: Maatregel
  on property: has as aspect (inverse)
  max qualified cardinality: 1
subclass of: Restriction
  on property: has as value
  all values from: date

Persleiding
label: Pressure main @en
author of change: Marinus Vonhof
author of change: Wouter van Riel
date of change: 2018-12-13
date of change: 2024-04-23
definition: Een gesloten leiding waarin het afvalwater door middel van overdruk wordt getransporteerd.
definition: [EN 16323:2014] pipeline for conveying wastewater under pressure @en
definition: [NEN 3300:1996] leiding waardoor onder overdruk afvalwater wordt getransporteerd
definition: [NEN-EN 752:2008] leiding waardoor afvalwater wordt gepompt [EN 1085:2007, definitie 2170]
author at start life: Marinus Vonhof
author at start life: Finy Teitsma (Oranjewoud)
date of start life: 2007-10-23
validity context: 1d 12d
scope note: Cof TOP
type: Class
subclass of: Oorzaakobject
subclass of: Mechanische transportleiding
subclass of: Restriction
  author of change: Marinus Vonhof
  date of change: 2016-04-28
  author at start life: Marinus Vonhof
  date of start life: 2014-12-02
  on class: Leidingsegment
  on property: has as part
  min qualified cardinality: 0
subclass of: Restriction
  author of change: Marinus Vonhof
  date of change: 2017-03-06
  author at start life: Nic Roest (Idoro)
  date of start life: 2007-11-29
  on class: Rioolgemaal
  on property: is connected to
  max qualified cardinality: 1
subclass of: Restriction
  on property: heeft Technologie
  has value: Transport onder overdruk

Resultaat
author of change: Marinus Vonhof
date of change: 2024-05-16
date of change: 2020-10-09
definition: Bij activiteit: de output, het rapport
author at start life: Marinus Vonhof
date of start life: 2014-04-29
validity context: 1d 3d 5d 6d 10d 11d 12d 14d
scope note: Cof TOP
type: Class
subclass of: Informatiedrager

Diameter
author of change: Marinus Vonhof
date of change: 2018-12-05
definition: De lengte van de koorde die het middelpunt van de cirkel snijdt
definition: Zowel een lijn (de koorde die het middelpunt van de cirkel snijdt) als de lengte van die lijn
author at start life: Nic Roest (Idoro)
date of start life: 2006-02-21
validity context: 15d
alternative label: Middellijn
comment: [is aspect]
scope note: Cof TOP
type: Class
subclass of: Afstand

Infiltratieput
author of change: Marinus Vonhof
author of change: Johan Post
date of change: 2024-05-01
date of change: 2021-10-01
date of change: 2026-07-13
date of change: 2026-07-24
definition: Een put met waterdoorlatende wanden bestemd voor de inzameling van hemelwater, waarbij het hemelwater door middel van infiltratie door de wanden kan worden afgevoerd
definition: [NEN 3300:1996] put waarin voorbezonken afvalwater via infiltratie in de bodem wordt gebracht
notation: ITP
author at start life: Marinus Vonhof
date of start life: 2014-05-01
comment: Bron afbeelding: Wavin
alternative label: IT-put
alternative label: Zakput
scope note: Cof MDS
scope note: Cof HYD
type: Class
subclass of: Put
subclass of: Restriction
  author at start life: Marinus Vonhof
  date of start life: 2026-07-13
  on class: Omhulling
  on property: has as part
  max qualified cardinality: 1
subclass of: Restriction
  author at start life: Marinus Vonhof
  date of start life: 2026-07-13
  on class: Substraat omstorting
  on property: has as part
  max qualified cardinality: 1
subclass of: Restriction
  author at start life: Marinus Vonhof
  date of start life: 2026-07-13
  on class: Substraat kern
  on property: has as part
  qualified cardinality: 1
subclass of: Restriction
  author at start life: Marinus Vonhof
  date of start life: 2026-07-24
  on class: Infiltratievoorziening
  on property: has as part (inverse)
  max qualified cardinality: 1
subclass of: Restriction
  on property: heeft Functie
  has value: Afvoeren hemelwater naar de ondergrond
subclass of: Restriction
  on property: heeft Functie
  has value: Tijdelijke berging van hemelwater
subclass of: Restriction
  on property: heeft Uitvoering
  has value: Waterdoorlatende wanden

Diameter opening
author at start life: Marinus Vonhof
date of start life: 2017-08-31
units of measurements: mm
comment: Intrinsiek aspect
comment: [is aspect]
scope note: Cof MDS
scope note: Cof HYD
type: Class
subclass of: Diameter
subclass of: Restriction
  author of change: Marinus Vonhof
  date of change: 2017-12-07
  author at start life: Marinus Vonhof
  date of start life: 2017-08-31
  on class: Doorlaat
  on property: has as aspect (inverse)
  max qualified cardinality: 1
subclass of: Restriction
  on property: has as value
  all values from: integer

Diameter put
author of change: Marinus Vonhof
author of change: Johan Post
date of change: 2021-08-06
date of change: 2026-05-01
definition: De inwendige diameter (horizontaal, uit het bovenaanzicht). Indien aanwezig de diameter van de onderbak. - zie afbeelding dc (bron EN13508-2)
author at start life: Marinus Vonhof
date of start life: 2013-10-01
units of measurements: mm
comment: Intrinsiek aspect
comment: In datasets kan voor de afmeting van ronde putten zowel de diameter, lengte of breedte als kenmerk worden gebruikt
comment: [is aspect]
scope note: Cof MDS
scope note: Cof HYD
scope note: Cof RGM
type: Class
subclass of: Diameter
subclass of: Restriction
  author of change: Marinus Vonhof
  date of change: 2015-08-24
  author at start life: Marinus Vonhof
  date of start life: 2013-10-01
  on class: Put
  on property: has as aspect (inverse)
  max qualified cardinality: 1
subclass of: Restriction
  on property: has as value
  all values from: Diameter put (datatype)

Dikte
author of change: Marinus Vonhof
date of change: 2015-05-29
definition: In de richting haaks op het vlak van een plat voorwerp, waarbij de meetpunten op de buitenkant liggen
author at start life: Nic Roest (Idoro)
date of start life: 2006-02-21
validity context: 15d
comment: [is aspect]
scope note: Cof TOP
type: Class
subclass of: Afstand

Doekomhulling
definition: Omhulling van een constructie met doek
author at start life: Marinus Vonhof
date of start life: 2026-07-16
scope note: Cof MDS
scope note: Cof HYD
type: Class
subclass of: Omhulling
subclass of: Restriction
  on property: heeft Uitvoering
  has value: Bekleding met doek

Onderscheidend kenmerk
author of change: Marinus Vonhof
date of change: 2021-01-09
definition: Een dicriminerend (onderscheidend) kenmerk
author at start life: Marinus Vonhof
date of start life: 2015-02-25
comment: [is aspect]
scope note: Cof TOP
type: Class
subclass of: Kenmerk

Maximale capaciteit doorlaat
author of change: Marinus Vonhof
author of change: Johan Post
date of change: 2025-01-16
date of change: 2022-11-25
definition: [IMBOR] Aanduiding van de van de bovengrens van het vermogen tot verwerken van water van opening.
author at start life: Marinus Vonhof
date of start life: 2011-12-15
units of measurements: m3/h
comment: [is aspect]
scope note: Cof MDS
scope note: Cof HYD
type: Class
subclass of: Capaciteit
subclass of: Restriction
  author of change: Marinus Vonhof
  date of change: 2017-09-06
  author at start life: Marinus Vonhof
  date of start life: 2011-12-15
  validity context: 5t 11t
  on class: Doorlaat
  on property: has as aspect (inverse)
  max qualified cardinality: 1
subclass of: Restriction
  on property: has as value
  all values from: Maximale capaciteit doorlaat (datatype)

Hoogte opening
author of change: Marinus Vonhof
date of change: 2015-02-28
author at start life: Marinus Vonhof
date of start life: 2011-12-15
units of measurements: mm
comment: Intrinsiek aspect
comment: [is aspect]
scope note: Cof MDS
scope note: Cof REV
scope note: Cof HYD
type: Class
subclass of: Hoogte
subclass of: Restriction
  author of change: Marinus Vonhof
  date of change: 2017-12-07
  author at start life: Marinus Vonhof
  date of start life: 2011-12-15
  on class: Doorlaat
  on property: has as aspect (inverse)
  max qualified cardinality: 1
subclass of: Restriction
  on property: has as value
  all values from: integer

Vorm opening
author of change: Eric van Gorkom
date of change: 2024-05-13
definition: A 2 48-49 Vst rond
author at start life: Marinus Vonhof
date of start life: 2011-12-15
comment: Intrinsiek aspect
comment: [is aspect]
scope note: Cof MDS
scope note: Cof REV
scope note: Cof HYD
type: Class
subclass of: Vorm
subclass of: Restriction
  author of change: Marinus Vonhof
  date of change: 2017-12-07
  author at start life: Marinus Vonhof
  date of start life: 2011-12-15
  validity context: 5t 11t
  on class: Doorlaat
  on property: has as aspect (inverse)
  max qualified cardinality: 1
subclass of: Restriction
  on property: has as reference (qualification)
  all values from: Vorm opening (coll)

Stromingsrichting
definition: De richting waarin de vloeistof zich verplaatst, wordt bepaald door de verhanglijn
author at start life: Marinus Vonhof
date of start life: 2011-12-15
see also: [HYD] Aanduiding mogelijke stromingsrichting
alternative label: Stroomrichting
comment: [is aspect]
scope note: Cof HYD
type: Class
subclass of: Kenmerk
subclass of: Restriction
  author of change: Marinus Vonhof
  date of change: 2017-12-07
  author at start life: Marinus Vonhof
  date of start life: 2011-12-15
  validity context: 5t 11t
  on class: Overstortdrempel
  on property: has as aspect (inverse)
  max qualified cardinality: 1
subclass of: Restriction
  author at start life: Marinus Vonhof
  date of start life: 2017-09-06
  validity context: 5t 11t
  on class: Doorlaat
  on property: has as aspect (inverse)
  max qualified cardinality: 1
subclass of: Restriction
  author at start life: Marinus Vonhof
  date of start life: 2019-03-20
  validity context: 5t 11t
  on class: Stuwmuur
  on property: has as aspect (inverse)
  max qualified cardinality: 1
subclass of: Restriction
  on property: has as reference (qualification)
  all values from: Stromingsrichting (coll)

Doorlaatniveau
author of change: Marinus Vonhof
date of change: 2019-08-12
definition: Niveau binnenonderkant doorlaatopening
author at start life: Marinus Vonhof
date of start life: 2017-12-07
units of measurements: m
comment: [is aspect]
scope note: Cof MDS
scope note: Cof REV
scope note: Cof HYD
type: Class
subclass of: Hoogte t.o.v. NAP
subclass of: Restriction
  author at start life: Marinus Vonhof
  date of start life: 2017-12-07
  validity context: 5t 11t
  on class: Doorlaat
  on property: has as aspect (inverse)
  max qualified cardinality: 1
subclass of: Restriction
  on property: has as value
  all values from: decimal

Infiltratieriool
author of change: Marinus Vonhof
author of change: Johan Post
date of change: 2024-05-01
date of change: 2026-07-13
definition: Een rioolleiding met waterdoorlatende wanden bestemd voor de inzameling en transport van hemelwater, waarbij het hemelwater door middel van infiltratie door de wanden kan worden afgevoerd. Kan ook beschouwd worden als een soort infiltratievoorziening.
notation: ITR
author at start life: Marinus Vonhof
date of start life: 2017-05-20
alternative label: IT-riool
alternative label: Infiltratieleiding
scope note: Cof MDS
scope note: Cof REV
scope note: Cof HYD
type: Class
subclass of: Vrijverval rioolleiding
subclass of: Restriction
  author of change: Marinus Vonhof
  date of change: 2019-05-15
  author at start life: Marinus Vonhof
  date of start life: 2018-12-06
  on class: Infiltratiestelsel
  on property: has as part (inverse)
  qualified cardinality: 1
subclass of: Restriction
  author of change: Marinus Vonhof
  date of change: 2026-07-13
  author at start life: Marinus Vonhof
  date of start life: 2018-12-06
  on class: Omhulling
  on property: has as part
  max qualified cardinality: 1
subclass of: Restriction
  author at start life: Marinus Vonhof
  date of start life: 2020-05-26
  on class: Hemelwaterstelsel
  on property: has as part (inverse)
  max qualified cardinality: 1
subclass of: Restriction
  author at start life: Marinus Vonhof
  date of start life: 2026-08-20
  on class: Infiltratievoorziening
  on property: has as part (inverse)
  max qualified cardinality: 1
subclass of: Restriction
  on property: heeft Functie
  has value: Afvoeren hemelwater naar de ondergrond
subclass of: Restriction
  on property: heeft Uitvoering
  has value: Waterdoorlatende wanden

Drain
author of change: Marinus Vonhof
author of change: Johan Post
author of change: Eric van Gorkom
date of change: 2024-05-01
date of change: 2016-04-20
date of change: 2024-05-13
date of change: 2023-01-12
definition: Een leiding met doorlatende wanden bestemd voor het op peil houden van het grondwater, kan onderdeel zijn van een drainagestelsel.
author at start life: Nic Roest (Idoro)
date of start life: 2006-03-23
validity context: 1d
alternative label: Drainagebuis
alternative label: Draineerbuis
scope note: Cof MDS
scope note: Cof HYD
type: Class
subclass of: Leiding
subclass of: Restriction
  author of change: Marinus Vonhof
  date of change: 2026-07-13
  author at start life: Marinus Vonhof
  date of start life: 2018-12-06
  on class: Omhulling
  on property: has as part
  max qualified cardinality: 1
subclass of: Restriction
  author at start life: Marinus Vonhof
  date of start life: 2016-04-20
  on class: Porositeit
  on property: has as aspect
  max qualified cardinality: 1
subclass of: Restriction
  author at start life: Marinus Vonhof
  date of start life: 2026-07-24
  on class: Infiltratievoorziening
  on property: has as part (inverse)
  max qualified cardinality: 1
subclass of: Restriction
  author at start life: Wouter van Riel
  date of start life: 2022-09-26
  on class: Drainage/infiltratie transportstelsel
  on property: has as part (inverse)
  max qualified cardinality: 1
subclass of: Restriction
  on property: heeft Functie
  has value: Inzameling van grondwater
subclass of: Restriction
  on property: heeft Functie
  has value: Transport van grondwater
subclass of: Restriction
  on property: heeft Uitvoering
  has value: Waterdoorlatende wanden

Doorspoelput
author of change: Johan Post
author of change: Wouter van Riel
date of change: 2021-10-01
date of change: 2022-12-19
date of change: 2024-04-22
definition: Een rioolput met voorziening voor het inlaten van oppervlaktewater voor de reiniging van een vrijverval rioolstelsel.
author at start life: Finy Teitsma (Oranjewoud)
date of start life: 2006-02-20
alternative label: Spoelput
scope note: Cof MDS
scope note: Cof RRB
scope note: Cof LDR
scope note: Cof HYD
type: Class
subclass of: Rioolput
subclass of: Restriction
  on property: heeft Functie
  has value: Toegang geven voor doorspoelen

Porositeit
label: Porosity @en
author of change: Marinus Vonhof
author of change: Johan Post
date of change: 2024-05-01
date of change: 2019-05-01
definition: De verhouding tussen de (grond)deeltjes en de open ruimten (de poriën)
author at start life: Finy Teitsma (Oranjewoud)
date of start life: 2007-10-25
validity context: 15d
comment: [is aspect]
scope note: Cof MDS
scope note: Cof RRB
scope note: Cof LDR
scope note: Cof HYD
type: Class
subclass of: Kenmerk
subclass of: Restriction
  author of change: Marinus Vonhof
  date of change: 2017-05-20
  author at start life: Nic Roest (Idoro)
  date of start life: 2007-11-29
  on class: Infiltratieput
  on property: has as aspect (inverse)
  max qualified cardinality: 1
subclass of: Restriction
  author at start life: Marinus Vonhof
  date of start life: 2016-04-20
  on class: Drain
  on property: has as aspect (inverse)
  max qualified cardinality: 1
subclass of: Restriction
  author at start life: Marinus Vonhof
  date of start life: 2026-07-26
  on class: Inwinning
  on property: has as aspect
  max qualified cardinality: 1
subclass of: Restriction
  author at start life: Nic Roest (Idoro)
  date of start life: 2007-11-29
  on class: Infiltratiekoffer
  on property: has as aspect (inverse)
  max qualified cardinality: 1
subclass of: Restriction
  on property: has as value
  all values from: Porositeit (datatype)

Infiltratiestelsel
author of change: Marinus Vonhof
author of change: Eric van Gorkom
date of change: 2025-01-16
date of change: 2019-05-15
date of change: 2022-12-24
definition: Stelsel of systeem bestaande uit infiltratievoorzieningen
author at start life: Marinus Vonhof
date of start life: 2018-12-06
alternative label: Infiltratiesysteem
scope note: Cof BAS
scope note: Cof HYD
type: Class
subclass of: Rioolstelsel
subclass of: Restriction
  author of change: Marinus Vonhof
  date of change: 2019-05-15
  author at start life: Marinus Vonhof
  date of start life: 2018-12-06
  on class: Infiltratieriool
  on property: has as part
  min qualified cardinality: 1
subclass of: Restriction
  author at start life: Marinus Vonhof
  date of start life: 2026-07-16
  on class: Hemelwaterriool
  on property: has as part
  min qualified cardinality: 0
subclass of: Restriction
  author at start life: Marinus Vonhof
  date of start life: 2026-08-04
  on class: Infiltratievoorziening
  on property: has as part
  min qualified cardinality: 0
subclass of: Restriction
  on property: heeft Uitvoering
  has value: Geheel van verbonden infiltratievoorzieningen
subclass of: Restriction
  on property: heeft Functie
  has value: Infiltratie en transport van hemelwater
subclass of: Restriction
  on class: Goot
  on property: has as part
  min qualified cardinality: 0

Substraat kern
definition: De inwendige vulling van de constructie
author at start life: Marinus Vonhof
date of start life: 2026-08-05
scope note: Cof MDS
scope note: Cof HYD
type: Class
subclass of: Substraat
subclass of: Restriction
  on property: heeft Toepassing
  has value: Vulling van de constructie
subclass of: Restriction
  on class: Infiltratiekoffer
  on property: has as part (inverse)
  max qualified cardinality: 1
subclass of: Restriction
  on class: Infiltratieput
  on property: has as part (inverse)
  max qualified cardinality: 1

Inspectieput
label: Manhole @en
author of change: Wouter van Riel
date of change: 2024-04-22
definition: Een rioolput die voor mens of apparatuur vanaf het maaiveld toegang biedt tot de aangesloten rioolleidingen.
definition: [EN 16323:2014] structure with a removable cover, constructed on a drain or sewer to permit entry by personnel @en
definition: [NEN-EN 752:2008] (Ongeldig) put met een afneembaar deksel, gekoppeld aan een aansluitleiding of riool waarmee reinigings- en inspectieapparatuur vanaf de oppervlakte kan worden ingebracht, maar die geen toegang biedt voor personeel
notation: INS
author at start life: Finy Teitsma (Oranjewoud)
date of start life: 2006-05-23
see also: [IMGeo:1.0/2007] Put die toegang geeft tot een (riool)leiding.
see also: [IRIS-RIOKEN:2012] Constructie toeganggevend tot het rioolstelsel.
alternative label: Controleput
scope note: Cof MDS
scope note: Cof RRB
scope note: Cof LDR
scope note: Cof REV
scope note: Cof HYD
type: Class
subclass of: Rioolput
subclass of: Restriction
  author of change: Marinus Vonhof
  date of change: 2015-04-21
  author at start life: Marinus Vonhof
  date of start life: 2014-12-02
  on class: Vrijverval transportstelsel
  on property: has as part (inverse)
  qualified cardinality: 1
subclass of: Restriction
  author at start life: Marinus Vonhof
  date of start life: 2026-07-24
  on class: Infiltratievoorziening
  on property: has as part (inverse)
  max qualified cardinality: 1
subclass of: Restriction
  on property: heeft Functie
  has value: Beluchten of ventileren
subclass of: Restriction
  on property: heeft Functie
  has value: Inzameling van afvalwater
subclass of: Restriction
  on property: heeft Functie
  has value: Toegang geven tot het rioolstelsel
subclass of: Restriction
  on property: heeft Functie
  has value: Toegang verschaffen
subclass of: Restriction
  on property: heeft Uitvoering
  has value: Toegankelijk voor inspectie- en reinigingsapparatuur
subclass of: Restriction
  on property: heeft Uitvoering
  has value: Verwijderbaar deksel

Lozingsput
author of change: Marinus Vonhof
date of change: 2016-04-15
definition: Een put waarop een rioolleiding is aangesloten waarmee het afvalwater het rioolstelsel verlaat naar, of ontvangt uit, een ander rioolstelsel
author at start life: Nic Roest (Idoro)
date of start life: 2006-03-23
alternative label: Ontvangstput
scope note: Cof MDS
scope note: Cof REV
scope note: Cof HYD
type: Class
subclass of: Rioolput
subclass of: Restriction
  on property: heeft Uitvoering
  has value: Naar ander rioolstelsel
subclass of: Restriction
  on property: heeft Functie
  has value: Overtollig afvalwater laten wegstromen

Verzameldrain
definition: Een leiding met ondoorlatende wand die het door drains aangevoerde water verzamelt en transporteert, zonder zelf water uit de omliggende bodem op te nemen.
author at start life: Johan Post
date of start life: 2026-05-19
type: Class
subclass of: Vrijverval rioolleiding
subclass of: Restriction
  on property: heeft Functie
  has value: Transport van grondwater

Drempelbreedte
definition: De ontwikkelde lengte van de overlaat, waarover het afvalwater overstort, gemeten haaks op de stroomrichting
definition: [NEN 3300:1996] Overstortbreedte is synoniem van drempelbreedte
definition: [NEN 3300:1996] de ontwikkelde lengte van de overlaat waarover het water overstort, gemeten haaks op de stroomrichting
author at start life: Marinus Vonhof
date of start life: 2017-05-17
units of measurements: mm
alternative label: Overstortbreedte
comment: [is aspect]
scope note: Cof MDS
scope note: Cof REV
scope note: Cof HYD
type: Class
subclass of: Breedte
subclass of: Restriction
  author at start life: Finy Teitsma (Oranjewoud)
  date of start life: 2006-02-25
  validity context: 5t 11t
  on class: Overstortdrempel
  on property: has as aspect (inverse)
  max qualified cardinality: 1
subclass of: Restriction
  author at start life: Marinus Vonhof
  date of start life: 2019-03-20
  validity context: 5t 11t
  on class: Stuwmuur
  on property: has as aspect (inverse)
  max qualified cardinality: 1
subclass of: Restriction
  author at start life: Marinus Vonhof
  date of start life: 2024-05-16
  on class: Inwinning
  on property: has as aspect
  max qualified cardinality: 1
subclass of: Restriction
  on property: has as value
  all values from: integer

Drempelniveau
definition: De hoogte van de drempel
definition: [NEN 3300:1996] Drempelhoogte is synoniem van drempelniveau
definition: [NEN 3300:1996] de hoogte van de bovenkant van de drempel ten opzichte van een referentiepeil
author at start life: Marinus Vonhof
date of start life: 2016-04-24
units of measurements: m
alternative label: Drempelhoogte
alternative label: Drempelpeil
comment: [is aspect]
scope note: Cof MDS
scope note: Cof REV
scope note: Cof HYD
type: Class
subclass of: Hoogte t.o.v. NAP
subclass of: Restriction
  author of change: Marinus Vonhof
  date of change: 2019-09-02
  author at start life: Finy Teitsma (Oranjewoud)
  date of start life: 2006-02-25
  on class: Overstortdrempel
  on property: has as aspect (inverse)
  qualified cardinality: 1
subclass of: Restriction
  author at start life: Marinus Vonhof
  date of start life: 2015-10-30
  on class: Inwinning
  on property: has as aspect
  max qualified cardinality: 1
subclass of: Restriction
  author at start life: Marinus Vonhof
  date of start life: 2019-03-20
  on class: Stuwmuur
  on property: has as aspect (inverse)
  qualified cardinality: 1
subclass of: Restriction
  on property: has as value
  all values from: decimal

Mechanische rioolleiding
author of change: Marinus Vonhof
author of change: Johan Post
author of change: Wouter van Riel
date of change: 2016-08-26
date of change: 2024-04-23
date of change: 2024-05-04
date of change: 2026-05-19
definition: Een gesloten rioolleiding waarin het afvalwater door middel van onder-/overdruk wordt getransporteerd.
author at start life: Marinus Vonhof
author at start life: Finy Teitsma (Oranjewoud)
date of start life: 2006-02-20
validity context: *f 11d 12d 13d
see also: [IMKL:1.1/2008] Riolering waarbij het transport plaatsvindt door overdruk (uit NEN 3300, Buitenriolering).
scope note: Cof TOP
type: Class
subclass of: Rioolleiding
subclass of: Oorzaakobject
subclass of: Restriction
  on property: heeft Structuur
  has value: Gesloten
subclass of: Restriction
  on property: heeft Technologie
  has value: Transport onder overdruk of onderdruk

Drukrioleringspomp
author of change: Marinus Vonhof
date of change: 2025-01-16
date of change: 2015-07-28
definition: Een pomp die toegepast wordt in een pompunit
author at start life: Marinus Vonhof
date of start life: 2014-05-03
scope note: Cof BAS
scope note: Cof HYD
scope note: Cof RGM
scope note: Cof DMO
type: Class
subclass of: Pomp
subclass of: Restriction
  on property: heeft Toepassing
  has value: Deel van pompunit

Dubbelkerende spindelschuif
author of change: Marinus Vonhof
date of change: 2025-01-16
definition: [IMBOR] Een mechanische afsluiter die bestaat uit een naar beneden schuifbare plaat op basis van een afstelbare metalen staaf met draad (spindel) die de doorstroomopening in beide richtingen af kan sluiten.
author at start life: Marinus Vonhof
date of start life: 2019-05-15
scope note: Cof BAS
scope note: Cof PLI
scope note: Cof HYD
scope note: Cof DMO
type: Class
subclass of: Schuif
subclass of: Restriction
  on property: heeft Functie
  has value: Afsluiten in twee stroomrichtingen

Schuif
author of change: Marinus Vonhof
date of change: 2025-01-16
definition: [IMBOR] Een ijzeren staaf waarmee een bewegend onderdeel van een object afgesloten kan worden.
author at start life: Wouter van Riel
date of start life: 2024-04-20
scope note: Cof BAS
scope note: Cof PLI
scope note: Cof HYD
scope note: Cof DMO
type: Class
subclass of: Mechanische afsluiter
subclass of: Restriction
  author of change: Marinus Vonhof
  date of change: 2024-05-17
  author at start life: Wouter van Riel
  date of start life: 2024-04-20
  on class: Bergbezinkbassin
  on property: has as part (inverse)
  max qualified cardinality: 1
subclass of: Restriction
  author of change: Marinus Vonhof
  date of change: 2024-05-17
  author at start life: Wouter van Riel
  date of start life: 2024-04-20
  on class: Ledigingsvoorziening
  on property: has as part (inverse)
  max qualified cardinality: 1
subclass of: Restriction
  on property: heeft Uitvoering
  has value: Schuifbare plaat

Profiel leiding
author of change: Marinus Vonhof
date of change: 2019-07-11
definition: Een vlak dat de doorsnede dwars op de richting beginpunt naar eindpunt van een gesloten leiding beschrijft. Het bestaat uit minimaal 4 x/y waarden in [m], decimaalteken (punt) toegestaan. De eerste coördinaat is gelijk aan de laatste coördinaat
author at start life: Marinus Vonhof
date of start life: 2019-05-15
units of measurements: gml
comment: [is aspect]
scope note: Cof BAS
scope note: Cof HYD
type: Class
subclass of: Vlak
subclass of: Restriction
  author at start life: Marinus Vonhof
  date of start life: 2019-05-15
  on class: Vrijverval rioolleiding
  on property: has as aspect (inverse)
  max qualified cardinality: 1
subclass of: Restriction
  author at start life: Marinus Vonhof
  date of start life: 2019-05-15
  on class: Vrijverval transportleiding
  on property: has as aspect (inverse)
  max qualified cardinality: 1
subclass of: Restriction
  on property: has as value
  all values from: gmlLiteral

Verbeterde overstortput
definition: [NEN 3300:1996] een overstortput waarbij duikschotten en een langere drempel zijn toegepast en de inhoud van de put voor de drempel is vergroot met het doel de vuiluitworp te beperken
author at start life: Marinus Vonhof
date of start life: 2012-04-29
scope note: Cof MDS
scope note: Cof HYD
scope note: Cof DMO
type: Class
subclass of: Externe overstortput
subclass of: Restriction
  on property: heeft Uitvoering
  has value: Langere drempel
subclass of: Restriction
  on property: heeft Uitvoering
  has value: Vergrote inhoud voor de drempel
subclass of: Restriction
  on property: heeft Doel
  has value: Verminderen vuilbelasting van oppervlaktewater

Edge
author of change: Marinus Vonhof
date of change: 2020-11-24
definition: Wiskundige term (engels) voor zijde, kant, boog, tak
author at start life: Marinus Vonhof
date of start life: 2011-12-15
alternative label: Zijde
scope note: Cof TOP
type: Class
subclass of: Topologisch element

Topologisch element
author of change: Marinus Vonhof
date of change: 2025-01-16
date of change: 2016-11-09
definition: [Gellish] Is a configuration that indicates how items are connected or positioned relative to each other. The topology in terms of connections usually doesn't change when the positions of the items change. @en
definition: [IMBOR] Een configuratie waarin vastgelegd wordt hoe objecten verbonden zijn of hoe ze relatief tot elkaar gepositioneerd zijn.
author at start life: Marinus Vonhof
date of start life: 2013-10-04
validity context: *f 15d
scope note: Cof TOP
type: Class

Einddatum
author of change: Marinus Vonhof
author of change: Johan Post
date of change: 2015-05-29
date of change: 2023-01-10
date of change: 2026-05-13
definition: Datum waarop een object functioneel geen onderdeel meer vormt van het systeem, doordat het niet langer een rol vervult in het functioneren, beheren of gebruiken van dat systeem. Dit is niet per definitie de datum van fysieke verwijdering of sloop
author at start life: Marinus Vonhof
date of start life: 2011-12-15
units of measurements: yyyy-mm-dd
validity context: 6d 15d 16d
comment: [is aspect]
scope note: Cof TOP
type: Class
subclass of: Datum
subclass of: Restriction
  author at start life: Marinus Vonhof
  date of start life: 2013-09-28
  on class: Fysiek object
  on property: has as aspect (inverse)
  max qualified cardinality: 1
subclass of: Restriction
  on property: has as value
  all values from: date

Eindknooppunt
definition: [EN13508-2+A1] The node reference of the second node as specified by the employing authority. @en
definition: Het knooppunt dat koppelt aan het (topologische) eindpunt van een leiding.
author at start life: Marinus Vonhof
date of start life: 2026-07-17
alternative label: Eindknoop
scope note: Cof TOP
type: Class
subclass of: Extra objecttype (rol)

Vorm profiel (coll)
comment: [is coll]
scope note: Cof HDX
type: Class
subclass of: Verzameling soorten
subclass of: Class
  one of: Rond
  one of: Eivormig
  one of: Eivormig omgekeerd
  one of: Rechthoekig
  one of: Muil
  one of: U-vorm
  one of: Heul
  one of: Trapezium
  one of: Ovaal
  one of: Tabulated
  one of: YZ profiel

Enkelkerende spindelschuif
author of change: Marinus Vonhof
date of change: 2025-01-16
definition: [IMBOR] Een doorlaat met een voorziening om de stroming te regelen.
author at start life: Marinus Vonhof
date of start life: 2019-05-15
scope note: Cof BAS
scope note: Cof PLI
scope note: Cof HYD
scope note: Cof DMO
type: Class
subclass of: Schuif
subclass of: Restriction
  on property: heeft Functie
  has value: Afsluiten in één stroomrichting

Externe overstortconstructie
author of change: Marinus Vonhof
date of change: 2015-09-01
definition: Een overstortconstructie waarbij het overtollig afvalwater uit een rioolstelsel kan stromen.
author at start life: Marinus Vonhof
date of start life: 2015-05-29
scope note: Cof MDS
scope note: Cof HYD
type: Class
subclass of: Overstortconstructie
subclass of: Restriction
  author of change: Marinus Vonhof
  date of change: 2018-12-12
  author at start life: Marinus Vonhof
  date of start life: 2015-05-29
  validity context: 11t 14t
  comment: Temporeel kenmerk, met kenmerk Inwinning
  on class: Niveau buitenwater
  on property: has as aspect
  min qualified cardinality: 0
subclass of: Restriction
  on property: heeft Functie
  has value: Lozen buiten het stelsel

Niveau buitenwater
author of change: Marinus Vonhof
date of change: 2017-07-25
definition: Niveau van het ontvangend oppervlaktewater.
author at start life: Finy Teitsma (Oranjewoud)
date of start life: 2007-10-25
units of measurements: m
validity context: 15d
comment: [is aspect]
scope note: Cof BAS
scope note: Cof HYD
type: Class
subclass of: Waterpeil
subclass of: Restriction
  author of change: Marinus Vonhof
  date of change: 2015-05-29
  author at start life: Finy Teitsma (Oranjewoud)
  date of start life: 2007-10-24
  on class: Externe overstortput
  on property: has as aspect (inverse)
  max qualified cardinality: 1
subclass of: Restriction
  author of change: Marinus Vonhof
  date of change: 2018-12-12
  author at start life: Marinus Vonhof
  date of start life: 2015-05-29
  on class: Externe overstortconstructie
  on property: has as aspect (inverse)
  max qualified cardinality: 1
subclass of: Restriction
  author at start life: Marinus Vonhof
  date of start life: 2015-11-03
  on class: Inwinning
  on property: has as aspect
  max qualified cardinality: 1
subclass of: Restriction
  on property: has as value
  all values from: decimal

Externe overstortput
author of change: Finy Teitsma (Oranjewoud)
date of change: 2007-11-12
definition: Een overstortput waarbij overtollig afvalwater uit een rioolstelsel kan stromen.
definition: [NEN 3300:1996] rioolput voorzien van een overstortdrempel die loost buiten het in beschouwing genomen rioolstelsel, meestal op oppervlaktewater
definition: [NEN-EN 752:2008] voorziening in een gemengd systeem waarmee overtollig afvalwater wordt afgevoerd [EN 1085:2007, definitie 2130]
author at start life: Finy Teitsma (Oranjewoud)
date of start life: 2006-05-23
alternative label: Externe overstort
scope note: Cof MDS
scope note: Cof REV
scope note: Cof HYD
scope note: Cof DMO
type: Class
subclass of: Overstortput
subclass of: Restriction
  author of change: Marinus Vonhof
  date of change: 2015-05-29
  author at start life: Finy Teitsma (Oranjewoud)
  date of start life: 2007-10-24
  validity context: 11t 14t
  on class: Niveau buitenwater
  on property: has as aspect
  max qualified cardinality: 1
subclass of: Restriction
  on property: heeft Functie
  has value: Lozen buiten het stelsel

Rioolafsluiter
author of change: Marinus Vonhof
date of change: 2020-04-17
date of change: 2026-07-14
definition: Een statische constructie waarmee de doorstroomopening van een rioolleiding geheel of gedeeltelijk wordt afgesloten. Bij gedeeltelijke afsluiting (bijvoorbeeld als vloeistof via een uitsparing kan doorstromen) als deel een Opening In Wand toevoegen.
author at start life: Finy Teitsma (Oranjewoud)
date of start life: 2007-10-23
scope note: Cof MDS
scope note: Cof HYD
type: Class
subclass of: Wand
subclass of: Restriction
  author of change: Marinus Vonhof
  date of change: 2024-05-16
  date of change: 2020-04-17
  author at start life: Finy Teitsma (Oranjewoud)
  date of start life: 2006-05-23
  on class: Rioolleiding
  on property: has as part (inverse)
  max qualified cardinality: 1
subclass of: Restriction
  author of change: Marinus Vonhof
  date of change: 2020-04-17
  author at start life: Marinus Vonhof
  date of start life: 2013-02-05
  on class: Rioolput
  on property: has as part (inverse)
  max qualified cardinality: 1
subclass of: Restriction
  author at start life: Marinus Vonhof
  date of start life: 2024-05-16
  on class: Transportleiding
  on property: has as part (inverse)
  max qualified cardinality: 1
subclass of: Restriction
  on property: heeft Functie
  has value: Afsluiten van leidingen

Hulpstukoriëntatie
author of change: Marinus Vonhof
author of change: Johan Post
date of change: 2018-12-05
date of change: 2024-07-30
definition: Een topologisch element dat het zwaartepunt (vertex) van de bovenkant hulpstukbodem beschrijft
author at start life: Marinus Vonhof
date of start life: 2017-12-12
scope note: Cof MDS
scope note: Cof PLI
scope note: Cof HYD
type: Class
subclass of: Knooppunt
subclass of: Restriction
  author of change: Marinus Vonhof
  date of change: 2017-12-13
  author at start life: Marinus Vonhof
  date of start life: 2013-03-29
  validity context: 5t 11t
  on class: Hulpstuk
  on property: has as aspect (inverse)
  max qualified cardinality: 1
subclass of: Restriction
  author at start life: Marinus Vonhof
  date of start life: 2017-05-30
  comment: Koppeling geometrie - topologie
  on class: Maaiveldoriëntatie
  on property: is connected to
  max qualified cardinality: 1
subclass of: Restriction
  on class: Lijn
  on property: has as aspect
  max qualified cardinality: 1

Gegevenswoordenboek Stedelijk Water
author of change: Marinus Vonhof
date of change: 2024-05-16
date of change: 2024-07-31
date of change: 2021-12-29
date of change: 2021-09-20
date of change: 2021-10-02
date of change: 2025-11-18
date of change: 2026-08-25
definition: Een datamodel (ontologie, kennismodel) voor het vakgebied Stedelijk Water, het bevat modellen voor systemen en processen binnen het vakgebied. Belangrijke onderdelen ervan zijn modellen van constructies (systemen, stelsels, bouwwerken, leidingen, putten) en modellen van activiteiten (plannen, projecten, maatregelen). Het datamodel is onderdeel van het Semantisch Web, de datastructuur is gebaseerd op de linked-data-taal RDF/RDFS/OWL.
author at start life: Marinus Vonhof
date of start life: 2011-11-11
validity context: 6d
comment: URI gewijzigd (was GWSW_Datamodel) (20251118)
comment: Vigerend: GWSW versie 1.7.0 (25-08-2026)
alternative label: GWSW
scope note: Cof TOP
type: Class
subclass of: Informatiedrager
subclass of: Restriction
  author at start life: Marinus Vonhof
  date of start life: 2026-07-24
  on class: GWSW-HydX
  on property: has as part
  qualified cardinality: 1
subclass of: Restriction
  author at start life: Marinus Vonhof
  date of start life: 2026-07-24
  on class: GWSW.orox
  on property: has as part
  qualified cardinality: 1

GWSW-HydX
author of change: Marinus Vonhof
date of change: 2026-08-20
date of change: 2021-09-17
definition: Uitwisselformaat GWSW-HydX, verzameling CSV-bestanden
author at start life: Marinus Vonhof
date of start life: 2014-02-07
scope note: Cof HDX
type: Class
subclass of: Informatiedrager
subclass of: Restriction
  author of change: Marinus Vonhof
  date of change: 2017-07-25
  author at start life: Marinus Vonhof
  date of start life: 2014-02-07
  on class: Hydx ItObject bestand
  on property: has as part
  min qualified cardinality: 1
subclass of: Restriction
  author at start life: Marinus Vonhof
  date of start life: 2014-02-07
  on class: Hydx Debiet bestand
  on property: has as part
  min qualified cardinality: 1
subclass of: Restriction
  author at start life: Marinus Vonhof
  date of start life: 2014-02-07
  on class: Hydx Knooppunt bestand
  on property: has as part
  min qualified cardinality: 1
subclass of: Restriction
  author at start life: Marinus Vonhof
  date of start life: 2014-02-07
  on class: Hydx Kunstwerk bestand
  on property: has as part
  min qualified cardinality: 1
subclass of: Restriction
  author at start life: Marinus Vonhof
  date of start life: 2014-02-07
  on class: Hydx Meta bestand
  on property: has as part
  min qualified cardinality: 1
subclass of: Restriction
  author at start life: Marinus Vonhof
  date of start life: 2014-02-07
  on class: Hydx Nwrw bestand
  on property: has as part
  min qualified cardinality: 1
subclass of: Restriction
  author at start life: Marinus Vonhof
  date of start life: 2014-02-07
  on class: Hydx Oppervlak bestand
  on property: has as part
  min qualified cardinality: 1
subclass of: Restriction
  author at start life: Marinus Vonhof
  date of start life: 2014-02-07
  on class: Hydx Profiel bestand
  on property: has as part
  min qualified cardinality: 1
subclass of: Restriction
  author at start life: Marinus Vonhof
  date of start life: 2014-02-07
  on class: Hydx Verbinding bestand
  on property: has as part
  min qualified cardinality: 1
subclass of: Restriction
  author at start life: Marinus Vonhof
  date of start life: 2014-02-07
  on class: Hydx Verloop bestand
  on property: has as part
  min qualified cardinality: 1

GWSW.orox
definition: Het uitwisselprotocol voor toepassingen van het GWSW. Het protocol beschrijft met de linked-data-taal RDF/RDFS/OWL de inhoud van het GWSW Datamodel en de GWSW Datasets (de gemeentelijke gegevens). In alle gevallen wordt het zogenaamde Turtle-formaat voor de uitwisselbestanden gebruikt, maar in principe is elk RDF-formaat bruikbaar. De door gemeenten gebruikte beheersystemen kunnen in de meeste gevallen gegevens exporteren conform GWSW OroX.
author at start life: Marinus Vonhof
date of start life: 2026-07-24
alternative label: GWSW OroX
scope note: Cof TOP
type: Class
subclass of: Informatiedrager
subclass of: Restriction
  author at start life: Marinus Vonhof
  date of start life: 2026-07-24
  on class: Gegevenswoordenboek Stedelijk Water
  on property: has as part (inverse)
  qualified cardinality: 1

Hydx ItObject bestand
author of change: Marinus Vonhof
date of change: 2017-07-25
definition: Bestand met karakteristieken infiltratieputten en -riolen (csv-formaat)
author at start life: Marinus Vonhof
date of start life: 2014-02-07
alternative label: ItObject.csv
scope note: Cof HDX
type: Class
subclass of: Hydx Bestand
subclass of: Restriction
  author of change: Marinus Vonhof
  date of change: 2017-07-25
  author at start life: Marinus Vonhof
  date of start life: 2014-02-07
  on class: Hydx ItObject regel
  on property: has as part
  min qualified cardinality: 1
subclass of: Restriction
  author of change: Marinus Vonhof
  date of change: 2017-07-25
  author at start life: Marinus Vonhof
  date of start life: 2014-02-07
  on class: GWSW-HydX
  on property: has as part (inverse)
  qualified cardinality: 1

Hydx Debiet bestand
author of change: Marinus Vonhof
date of change: 2017-08-30
definition: Bestand met debiet vanuit DWA, HWA en lozing (csv-formaat)
author at start life: Marinus Vonhof
date of start life: 2014-02-07
alternative label: Debiet.csv
scope note: Cof HDX
type: Class
subclass of: Hydx Bestand
subclass of: Restriction
  author at start life: Marinus Vonhof
  date of start life: 2014-02-07
  on class: Hydx Debiet regel
  on property: has as part
  min qualified cardinality: 1
subclass of: Restriction
  author at start life: Marinus Vonhof
  date of start life: 2014-02-07
  on class: GWSW-HydX
  on property: has as part (inverse)
  qualified cardinality: 1

Hydx Knooppunt bestand
author of change: Marinus Vonhof
date of change: 2017-05-11
definition: Bestand met gegevens knooppunt (csv-formaat)
author at start life: Marinus Vonhof
date of start life: 2014-02-07
alternative label: Knooppunt.csv
scope note: Cof HDX
type: Class
subclass of: Hydx Bestand
subclass of: Restriction
  author at start life: Marinus Vonhof
  date of start life: 2014-02-07
  on class: Hydx Knooppunt regel
  on property: has as part
  min qualified cardinality: 1
subclass of: Restriction
  author at start life: Marinus Vonhof
  date of start life: 2014-02-07
  on class: GWSW-HydX
  on property: has as part (inverse)
  qualified cardinality: 1

Hydx Kunstwerk bestand
author of change: Marinus Vonhof
date of change: 2017-08-30
definition: Bestand met gegevens van hydraulische componenten, gepresenteerd door een knooppunt of een verbinding, die voorkomen in kunstwerken zoals overstortputten, rioolgemalen (csv-formaat)
author at start life: Marinus Vonhof
date of start life: 2014-02-07
alternative label: Kunstwerk.csv
scope note: Cof HDX
type: Class
subclass of: Hydx Bestand
subclass of: Restriction
  author at start life: Marinus Vonhof
  date of start life: 2014-02-07
  on class: Hydx Kunstwerk regel
  on property: has as part
  min qualified cardinality: 1
subclass of: Restriction
  author at start life: Marinus Vonhof
  date of start life: 2014-02-07
  on class: GWSW-HydX
  on property: has as part (inverse)
  qualified cardinality: 1

Hydx Meta bestand
author of change: Marinus Vonhof
date of change: 2017-05-11
definition: Bestand met meta-gegevens van de HydX-bestanden (csv-formaat)
author at start life: Marinus Vonhof
date of start life: 2014-02-07
alternative label: Meta.csv
scope note: Cof HDX
type: Class
subclass of: Hydx Bestand
subclass of: Restriction
  author at start life: Marinus Vonhof
  date of start life: 2014-02-07
  on class: Hydx Meta regel
  on property: has as part
  min qualified cardinality: 1
subclass of: Restriction
  author at start life: Marinus Vonhof
  date of start life: 2014-02-07
  on class: GWSW-HydX
  on property: has as part (inverse)
  qualified cardinality: 1

Hydx Nwrw bestand
author of change: Marinus Vonhof
date of change: 2017-05-11
definition: Bestand met neerslag-afvoer concept (csv-formaat)
author at start life: Marinus Vonhof
date of start life: 2014-02-07
alternative label: Nwrw.csv
scope note: Cof HDX
type: Class
subclass of: Hydx Bestand
subclass of: Restriction
  author at start life: Marinus Vonhof
  date of start life: 2014-02-07
  on class: Hydx Nwrw regel
  on property: has as part
  min qualified cardinality: 1
subclass of: Restriction
  author at start life: Marinus Vonhof
  date of start life: 2014-02-07
  on class: GWSW-HydX
  on property: has as part (inverse)
  qualified cardinality: 1

Hydx Oppervlak bestand
author of change: Marinus Vonhof
date of change: 2017-05-11
definition: Bestand met gegevens afvoerend oppervlak (csv-formaat)
author at start life: Marinus Vonhof
date of start life: 2014-02-07
alternative label: Oppervlak.csv
scope note: Cof HDX
type: Class
subclass of: Hydx Bestand
subclass of: Restriction
  author at start life: Marinus Vonhof
  date of start life: 2014-02-07
  on class: Hydx Oppervlak regel
  on property: has as part
  min qualified cardinality: 1
subclass of: Restriction
  author at start life: Marinus Vonhof
  date of start life: 2014-02-07
  on class: GWSW-HydX
  on property: has as part (inverse)
  qualified cardinality: 1

Hydx Profiel bestand
author of change: Marinus Vonhof
date of change: 2017-05-11
definition: Bestand met definitie profielen (csv-formaat)
author at start life: Marinus Vonhof
date of start life: 2014-02-07
alternative label: Profiel.csv
scope note: Cof HDX
type: Class
subclass of: Hydx Bestand
subclass of: Restriction
  author at start life: Marinus Vonhof
  date of start life: 2014-02-07
  on class: Hydx Profiel regel
  on property: has as part
  min qualified cardinality: 1
subclass of: Restriction
  author at start life: Marinus Vonhof
  date of start life: 2014-02-07
  on class: GWSW-HydX
  on property: has as part (inverse)
  qualified cardinality: 1

Hydx Verbinding bestand
author of change: Marinus Vonhof
date of change: 2017-05-11
definition: Bestand met gegevens verbindingen (csv-formaat)
author at start life: Marinus Vonhof
date of start life: 2014-02-07
alternative label: Verbinding.csv
scope note: Cof HDX
type: Class
subclass of: Hydx Bestand
subclass of: Restriction
  author at start life: Marinus Vonhof
  date of start life: 2014-02-07
  on class: Hydx Verbinding regel
  on property: has as part
  min qualified cardinality: 1
subclass of: Restriction
  author at start life: Marinus Vonhof
  date of start life: 2014-02-07
  on class: GWSW-HydX
  on property: has as part (inverse)
  qualified cardinality: 1

Hydx Verloop bestand
author of change: Marinus Vonhof
date of change: 2017-08-30
definition: Bestand met definitie debiet-verloop (csv-formaat)
author at start life: Marinus Vonhof
date of start life: 2014-02-07
alternative label: Verloop.csv
scope note: Cof HDX
type: Class
subclass of: Hydx Bestand
subclass of: Restriction
  author at start life: Marinus Vonhof
  date of start life: 2014-02-07
  on class: Hydx Verloop regel
  on property: has as part
  min qualified cardinality: 1
subclass of: Restriction
  author at start life: Marinus Vonhof
  date of start life: 2014-02-07
  on class: GWSW-HydX
  on property: has as part (inverse)
  qualified cardinality: 1

Type inzameling (coll)
comment: [is coll]
scope note: Cof HDX
type: Class
subclass of: Verzameling soorten
subclass of: Class

Stromingsrichting (coll)
comment: [is coll]
scope note: Cof HYD
type: Class
subclass of: Verzameling soorten
subclass of: Class
  one of: Stroming van beginpunt naar eindpunt
  one of: Stroming van eindpunt naar beginpunt
  one of: Stroming in beide richtingen
  one of: Geen stroming, gesloten

Maaiveldschematisering (coll)
comment: [is coll]
scope note: Cof HYD
type: Class
subclass of: Verzameling soorten
subclass of: Class
  one of: Reservoir (maaiveldschematisering)
  one of: Gekneveld
  one of: Verlies

Pompschakeling
author of change: Marinus Vonhof
date of change: 2015-02-28
definition: Wijze waarop de pompen worden in- en uitgeschakeld
author at start life: Nic Roest (Idoro)
date of start life: 2006-02-21
validity context: 15d
see also: [HYD] Aanduiding of pompen in samenloop of enkelloop functioneren
alternative label: Pompregime
comment: [is aspect]
scope note: Cof BAS
scope note: Cof HYD
scope note: Cof RGM
scope note: Cof DMO
type: Class
subclass of: Kenmerk
subclass of: Restriction
  author of change: Marinus Vonhof
  date of change: 2019-07-11
  author at start life: Finy Teitsma (Oranjewoud)
  date of start life: 2006-02-25
  on class: Gemaal
  on property: has as aspect (inverse)
  max qualified cardinality: 1
subclass of: Restriction
  author at start life: Marinus Vonhof
  date of start life: 2019-07-11
  on class: Pompput
  on property: has as aspect (inverse)
  max qualified cardinality: 1

Ontwerpcapaciteit gemaal
author of change: Johan Post
date of change: 2022-11-25
definition: De capaciteit op basis van het ontwerp
author at start life: Marinus Vonhof
date of start life: 2020-04-18
units of measurements: m3/h
comment: [is aspect]
scope note: Cof BAS
scope note: Cof HYD
scope note: Cof RGM
scope note: Cof DMO
type: Class
subclass of: Capaciteit
subclass of: Restriction
  author at start life: Marinus Vonhof
  date of start life: 2020-04-18
  on class: Gemaal
  on property: has as aspect (inverse)
  max qualified cardinality: 1
subclass of: Restriction
  on property: has as value
  all values from: decimal

Gemaal droge opstelling
author of change: Marinus Vonhof
date of change: 2017-05-31
definition: Een gemaal waarbij de pompen zich buiten de ontvangput/kelder bevinden.
definition: [NEN 3300:1996] Gemaal ten minste bestaande uit een ontvangkelder en een pompenkelder. De pompen zijn buiten de ontvangkelder opgesteld
author at start life: Finy Teitsma (Oranjewoud)
date of start life: 2006-05-23
comment: 20151014: NEN3300-definitie aangepast
alternative label: Gemaal met droge pompopstelling
scope note: Cof MDS
scope note: Cof HYD
scope note: Cof RGM
scope note: Cof DMO
type: Class
subclass of: Rioolgemaal
subclass of: Restriction
  on property: heeft Uitvoering
  has value: Opstelling pomp(en) buiten de ontvangput/kelder

Gemaal natte opstelling
author of change: Marinus Vonhof
date of change: 2019-05-15
definition: Een gemaal waarbij de pompen zich in de ontvangput/kelder bevinden.
definition: [NEN 3300:1996] gemaal waarbij de pomp in de ontvangkelder van het gemaal is opgesteld
author at start life: Finy Teitsma (Oranjewoud)
date of start life: 2006-05-23
alternative label: Gemaal met natte pompopstelling
scope note: Cof MDS
scope note: Cof HYD
scope note: Cof RGM
scope note: Cof DMO
type: Class
subclass of: Rioolgemaal
subclass of: Restriction
  on property: heeft Uitvoering
  has value: Opstelling pomp(en) in de ontvangput/kelder

Vuilwaterstelsel
author of change: Johan Post
author of change: Eric van Gorkom
date of change: 2021-10-01
date of change: 2024-05-13
definition: Een vrijverval rioolstelsel bestemd voor de inzameling, het transport en de tijdelijke berging van vuilwater.
definition: [NEN 3300:1996] Dwa-rioolstelsel is synoniem van vuilwaterstelsel
definition: [NEN 3300:1996] rioolstelsel voor de inzameling en het transport van huishoudelijk- en bedrijfsafvalwater, niet zijnde neerslag
author at start life: Finy Teitsma (Oranjewoud)
date of start life: 2007-10-23
alternative label: DWA stelsel
alternative label: Dwa-rioolstelsel
alternative label: Vuilwaterrioolstelsel
scope note: Cof TOP
type: Class
subclass of: Vrijverval rioolstelsel
subclass of: Restriction
  author at start life: Marinus Vonhof
  date of start life: 2015-03-01
  validity context: 5t 11t
  on class: Lozingspunt
  on property: has as part
  min qualified cardinality: 1
subclass of: Restriction
  author at start life: Marinus Vonhof
  date of start life: 2020-05-26
  on class: Rioolgemaal
  on property: has as part
  min qualified cardinality: 0
subclass of: Restriction
  author at start life: Marinus Vonhof
  date of start life: 2020-05-26
  on class: Vuilwaterriool
  on property: has as part
  min qualified cardinality: 1
subclass of: Restriction
  on class: Vrijverval rioolleiding
  on property: has as part
  min qualified cardinality: 0
subclass of: Restriction
  on property: heeft Functie
  has value: Inzameling van vuilwater
subclass of: Restriction
  on property: heeft Functie
  has value: Tijdelijke berging van vuilwater
subclass of: Restriction
  on property: heeft Functie
  has value: Transport van vuilwater

Geometrie
author of change: Marinus Vonhof
date of change: 2025-01-16
date of change: 2017-11-16
definition: [Gellish] Is a scale that is a measurement of spatial aspects. (This may otherwise be called geometry)
definition: [IMBOR] Een kenmerk waarmee de locatie van een object wordt vastgelegd.
author at start life: Marinus Vonhof
date of start life: 2016-10-14
units of measurements: gml
validity context: 15d
comment: [is aspect]
scope note: Cof TOP
type: Class
subclass of: Kenmerk
subclass of: Restriction
  author at start life: Marinus Vonhof
  date of start life: 2016-11-09
  on class: Inwinning
  on property: has as aspect
  max qualified cardinality: 1
subclass of: Restriction
  on property: has as value
  all values from: gmlLiteral

Type verbinding (coll)
comment: [is coll]
scope note: Cof HDX
type: Class
subclass of: Verzameling soorten
subclass of: Class
  one of: Gesloten leiding
  one of: Open leiding
  one of: Pomp
  one of: Overstortdrempel
  one of: Doorlaat
  one of: Infiltratieriool

Gesloten verhard oppervlak hellend
author of change: Marinus Vonhof
date of change: 2018-12-05
definition: [Omgevingswet] (bij concept VerhardOppervlak) De verharding als gevolg waarvan neerslag niet of zeer beperkt in de bodem kan infiltreren
notation: GVH_HEL
author at start life: Marinus Vonhof
date of start life: 2011-12-15
units of measurements: m2
comment: [is aspect]
scope note: Cof MDS
scope note: Cof HYD
type: Class
subclass of: Afvoerend oppervlak hellend
subclass of: Restriction
  on property: has as value
  all values from: Gesloten verhard oppervlak hellend (datatype)

Gesloten verhard oppervlak vlak
definition: [Omgevingswet] (bij concept VerhardOppervlak) De verharding als gevolg waarvan neerslag niet of zeer beperkt in de bodem kan infiltreren
notation: GVH_VLA
author at start life: Marinus Vonhof
date of start life: 2011-12-15
units of measurements: m2
comment: [is aspect]
scope note: Cof MDS
scope note: Cof HYD
type: Class
subclass of: Afvoerend oppervlak vlak
subclass of: Restriction
  on property: has as value
  all values from: Gesloten verhard oppervlak vlak (datatype)

Gesloten verhard oppervlak vlak uitgestrekt
definition: [Omgevingswet] (bij concept VerhardOppervlak) De verharding als gevolg waarvan neerslag niet of zeer beperkt in de bodem kan infiltreren
notation: GVH_VLU
author at start life: Marinus Vonhof
date of start life: 2011-12-15
units of measurements: m2
comment: [is aspect]
scope note: Cof MDS
scope note: Cof HYD
type: Class
subclass of: Afvoerend oppervlak vlak uitgestrekt
subclass of: Restriction
  on property: has as value
  all values from: Gesloten verhard oppervlak vlak uitgestrekt (datatype)

Grondwaterniveau
author of change: Marinus Vonhof
date of change: 2018-12-05
definition: [Omgevingswet] De hoogte van een punt waar het grondwater een drukhoogte gelijk nul heeft (de absolute waterdruk is dan gelijk aan de druk van de atmosfeer) ten opzichte van een referentieniveau
author at start life: Marinus Vonhof
date of start life: 2013-03-26
units of measurements: m
validity context: *d
alternative label: Grondwaterpeil
alternative label: Grondwaterstand
comment: [is aspect]
scope note: Cof BAS
scope note: Cof HYD
type: Class
subclass of: Hoogte t.o.v. NAP
subclass of: Restriction
  on property: has as value
  all values from: decimal

Vacuümpompstation
author of change: Marinus Vonhof
author of change: Johan Post
date of change: 2021-10-01
date of change: 2026-05-21
date of change: 2026-07-20
definition: Een technische installatie waarmee onderdruk wordt gecreëerd om het afvalwater te transporteren
definition: [NEN 3300:1996] Onderdrukpompstation is synoniem van vacuümpompstation
definition: [NEN 3300:1996] pompstation voor het in stand houden van de onderdruk in vacuümafvoerleidingen en voor het vervolgens onder overdruk verder transporten van het afvalwater
author at start life: Marinus Vonhof
date of start life: 2012-04-29
validity context: 1d
alternative label: Onderdrukpompstation
alternative label: Vacuümgemaal
scope note: Cof MDS
scope note: Cof HYD
scope note: Cof RGM
scope note: Cof DMO
type: Class
subclass of: Rioolgemaal
subclass of: Restriction
  on property: heeft Functie
  has value: In stand houden onderdruk

Lateraal debiet HWA
author of change: Johan Post
date of change: 2022-11-25
definition: HWA lozingsdebiet vanuit ander rioolstelsel
author at start life: Marinus Vonhof
date of start life: 2017-08-31
units of measurements: m3/h
comment: [is aspect]
scope note: Cof HYD
type: Class
subclass of: Lateraal debiet
subclass of: Restriction
  author at start life: Marinus Vonhof
  date of start life: 2017-08-31
  on class: Hemelwaterriool
  on property: has as aspect (inverse)
  max qualified cardinality: 1
subclass of: Restriction
  on property: has as value
  all values from: decimal

Uitlaat (punt)
author of change: Marinus Vonhof
author of change: Johan Post
date of change: 2026-05-21
date of change: 2020-04-18
definition: Het punt waar uitstroming van water uit een uiteinde-opening van een leiding naar het oppervlaktewater mogelijk is, zonder dat sprake is van een civieltechnisch bouwwerk of vormgegeven uitstroomconstructie.
author at start life: Nic Roest (Idoro)
date of start life: 2006-03-23
alternative label: Modelrand
alternative label: Uitmonding
scope note: Cof MDS
scope note: Cof HYD
type: Class
subclass of: Aansluitpunt
subclass of: Restriction
  author at start life: Marinus Vonhof
  date of start life: 2016-04-24
  validity context: 5t 11t
  on class: Uitlaatconstructie
  on property: has as aspect (inverse)
  max qualified cardinality: 1

Hondenhokput
author of change: Johan Post
date of change: 2026-05-01
definition: Een put die over een bestaande leiding heen is gebouwd, waarna de buis binnenin de put is verbroken
author at start life: Marinus Vonhof
date of start life: 2018-12-05
alternative label: Hondenhok
scope note: Cof MDS
scope note: Cof HYD
type: Class
subclass of: Inspectieput
subclass of: Restriction
  on property: heeft Technologie
  has value: Over bestaande leiding gebouwd

Hoogte
author of change: Marinus Vonhof
date of change: 2015-05-29
definition: In de richting haaks op het horizontale vlak
author at start life: Nic Roest (Idoro)
date of start life: 2006-02-21
units of measurements: mm
validity context: 15d
comment: [is aspect]
scope note: Cof TOP
type: Class
subclass of: Afstand
subclass of: Restriction
  on property: has as value
  all values from: integer

Hoogte put
author of change: Marinus Vonhof
author of change: Eric van Gorkom
date of change: 2021-08-06
date of change: 2024-05-13
definition: De inwendige hoogte (verticaal, vanuit het zijaanzicht). De afstand van binnenonderkant tot binnenbovenkant putconstructie (inclusief onderbak) - zie afbeelding C+F (bron EN13508-2)
author at start life: Marinus Vonhof
date of start life: 2014-08-01
units of measurements: mm
comment: Intrinsiek aspect
comment: [is aspect]
scope note: Cof TOP
type: Class
subclass of: Hoogte
subclass of: Restriction
  author of change: Marinus Vonhof
  date of change: 2014-08-01
  author at start life: Finy Teitsma (Oranjewoud)
  date of start life: 2006-02-25
  validity context: 5t 11t
  on class: Put
  on property: has as aspect (inverse)
  max qualified cardinality: 1
subclass of: Restriction
  on property: has as value
  all values from: Hoogte put (datatype)

Hydraulisch rioleringsmodel
author of change: Marinus Vonhof
date of change: 2020-04-18
definition: Een als netwerk gemodelleerd rioolstelsel
author at start life: Marinus Vonhof
date of start life: 2014-05-02
see also: [SUF-HYD 1.10] Een beschrijving van de geometrie en de samenhang van de onderdelen van een rioolstelsel.
alternative label: Netwerkmodel
scope note: Cof HYD
type: Class
subclass of: Representatie fysiek object
subclass of: Restriction
  author of change: Marinus Vonhof
  date of change: 2020-11-25
  author at start life: Marinus Vonhof
  date of start life: 2014-05-02
  on class: Leidingoriëntatie
  on property: has as part
  min qualified cardinality: 1
subclass of: Restriction
  author of change: Marinus Vonhof
  date of change: 2020-11-25
  author at start life: Marinus Vonhof
  date of start life: 2014-05-02
  on class: Putoriëntatie
  on property: has as part
  min qualified cardinality: 2
subclass of: Restriction
  author at start life: Marinus Vonhof
  date of start life: 2017-12-12
  on class: Rioolstelsel
  on property: is represented by (inverse)
  max qualified cardinality: 1

Hydx Aanname aanslagniveau pomp
author of change: Marinus Vonhof
date of change: 2017-05-11
definition: Aanname waarde PMP_ANS
notation: AAN_ANS
author at start life: Marinus Vonhof
date of start life: 2014-09-13
comment: [Len=3]
scope note: Cof HDX
type: Class
subclass of: Hydx Kolom
subclass of: Restriction
  author at start life: Marinus Vonhof
  date of start life: 2014-09-13
  on class: Hydx Kunstwerk regel
  on property: has as aspect (inverse)
  max qualified cardinality: 1
subclass of: Restriction
  on property: has as reference (qualification)
  all values from: Aanname HydX

Hydx Kolom
author of change: Marinus Vonhof
date of change: 2021-09-17
definition: Kolom in CSV bestand
author at start life: Marinus Vonhof
date of start life: 2014-02-07
comment: Per kolom is in de opmerking de lengte en de gewenste nauwkeurigheid beschreven: [Len=8.2] geeft aan dat de kolom maximaal 8 karakters bevat waarvan 2 karakters achter het decimaalteken
scope note: Cof HDX
type: Class
subclass of: Informatiedrager

Hydx Kunstwerk regel
author at start life: Marinus Vonhof
date of start life: 2014-02-07
scope note: Cof HDX
type: Class
subclass of: Hydx Regel
subclass of: Restriction
  author of change: Marinus Vonhof
  date of change: 2014-02-08
  author at start life: Marinus Vonhof
  date of start life: 2014-02-07
  on class: Hydx Identificatie knooppunt of verbinding
  on property: has as aspect
  qualified cardinality: 1
subclass of: Restriction
  author of change: Marinus Vonhof
  date of change: 2014-12-17
  author at start life: Marinus Vonhof
  date of start life: 2014-09-13
  on class: Hydx Aanname afslagniveau pomp
  on property: has as aspect
  max qualified cardinality: 1
subclass of: Restriction
  author of change: Marinus Vonhof
  date of change: 2014-12-17
  author at start life: Marinus Vonhof
  date of start life: 2014-09-13
  on class: Hydx Pompcapaciteit
  on property: has as aspect
  max qualified cardinality: 1
subclass of: Restriction
  author of change: Marinus Vonhof
  date of change: 2014-12-17
  author at start life: Marinus Vonhof
  date of start life: 2014-09-13
  on class: Hydx Toelichting regel
  on property: has as aspect
  max qualified cardinality: 1
subclass of: Restriction
  author of change: Marinus Vonhof
  date of change: 2014-12-19
  author at start life: Marinus Vonhof
  date of start life: 2014-09-13
  on class: Hydx Aanname breedte overstortdrempel
  on property: has as aspect
  max qualified cardinality: 1
subclass of: Restriction
  author of change: Marinus Vonhof
  date of change: 2017-07-25
  author at start life: Marinus Vonhof
  date of start life: 2014-09-13
  on class: Hydx Aanslagniveau benedenstrooms
  on property: has as aspect
  max qualified cardinality: 1
subclass of: Restriction
  author of change: Marinus Vonhof
  date of change: 2017-07-25
  author at start life: Marinus Vonhof
  date of start life: 2014-09-13
  on class: Hydx Afslagniveau benedenstrooms
  on property: has as aspect
  max qualified cardinality: 1
subclass of: Restriction
  author of change: Marinus Vonhof
  date of change: 2017-07-25
  author at start life: Marinus Vonhof
  date of start life: 2014-09-13
  on class: Hydx Buitenwaterstand
  on property: has as aspect
  max qualified cardinality: 1
subclass of: Restriction
  author at start life: Marinus Vonhof
  date of start life: 2014-02-07
  on class: Hydx Kunstwerk bestand
  on property: has as part (inverse)
  qualified cardinality: 1
subclass of: Restriction
  author at start life: Marinus Vonhof
  date of start life: 2014-09-13
  on class: Hydx Aanname aanslagniveau pomp
  on property: has as aspect
  max qualified cardinality: 1
subclass of: Restriction
  author at start life: Marinus Vonhof
  date of start life: 2014-09-13
  on class: Hydx Aanname niveau overstortdrempel
  on property: has as aspect
  max qualified cardinality: 1
subclass of: Restriction
  author at start life: Marinus Vonhof
  date of start life: 2014-09-13
  on class: Hydx Aanname pompcapaciteit pomp
  on property: has as aspect
  max qualified cardinality: 1
subclass of: Restriction
  author at start life: Marinus Vonhof
  date of start life: 2014-09-13
  on class: Hydx Afvoercoëfficiënt overstortdrempel
  on property: has as aspect
  max qualified cardinality: 1
subclass of: Restriction
  author at start life: Marinus Vonhof
  date of start life: 2014-09-13
  on class: Hydx Breedte overstortdrempel
  on property: has as aspect
  max qualified cardinality: 1
subclass of: Restriction
  author at start life: Marinus Vonhof
  date of start life: 2014-09-13
  on class: Hydx Contractiecoëfficiënt doorlaatprofiel
  on property: has as aspect
  max qualified cardinality: 1
subclass of: Restriction
  author at start life: Marinus Vonhof
  date of start life: 2014-09-13
  on class: Hydx Debietverschil debiet-verhangrelatie
  on property: has as aspect
  max qualified cardinality: 1
subclass of: Restriction
  author at start life: Marinus Vonhof
  date of start life: 2014-09-13
  on class: Hydx Maximale capaciteit doorlaat
  on property: has as aspect
  max qualified cardinality: 1
subclass of: Restriction
  author at start life: Marinus Vonhof
  date of start life: 2014-09-13
  on class: Hydx Niveau binnenonderkant profiel
  on property: has as aspect
  max qualified cardinality: 1
subclass of: Restriction
  author at start life: Marinus Vonhof
  date of start life: 2014-09-13
  on class: Hydx Niveau overstortdrempel
  on property: has as aspect
  max qualified cardinality: 1
subclass of: Restriction
  author at start life: Marinus Vonhof
  date of start life: 2014-09-13
  on class: Hydx Niveauverschil debiet-verhangrelatie
  on property: has as aspect
  max qualified cardinality: 1
subclass of: Restriction
  author at start life: Marinus Vonhof
  date of start life: 2014-09-13
  on class: Hydx Type kunstwerk
  on property: has as aspect
  qualified cardinality: 1
subclass of: Restriction
  author at start life: Marinus Vonhof
  date of start life: 2017-07-25
  on class: Hydx Aanslagniveau bovenstrooms
  on property: has as aspect
  max qualified cardinality: 1
subclass of: Restriction
  author at start life: Marinus Vonhof
  date of start life: 2017-07-25
  on class: Hydx Afslagniveau bovenstrooms
  on property: has as aspect
  max qualified cardinality: 1
subclass of: Restriction
  author at start life: Marinus Vonhof
  date of start life: 2017-12-07
  on class: Hydx Vrije overstorthoogte
  on property: has as aspect
  max qualified cardinality: 1

Hydx Aanname afslagniveau pomp
author of change: Marinus Vonhof
date of change: 2017-05-11
definition: Aanname waarde PMP_AFS
notation: AAN_AFS
author at start life: Marinus Vonhof
date of start life: 2014-09-13
comment: [Len=3]
scope note: Cof HDX
type: Class
subclass of: Hydx Kolom
subclass of: Restriction
  author of change: Marinus Vonhof
  date of change: 2014-12-17
  author at start life: Marinus Vonhof
  date of start life: 2014-09-13
  on class: Hydx Kunstwerk regel
  on property: has as aspect (inverse)
  max qualified cardinality: 1
subclass of: Restriction
  on property: has as reference (qualification)
  all values from: Aanname HydX

Hydx Aanname b.o.b. knooppunt 1
author of change: Marinus Vonhof
date of change: 2017-05-27
definition: Aanname waarde BOB_KN1
notation: AAN_BB1
author at start life: Marinus Vonhof
date of start life: 2014-09-13
comment: [Len=3]
scope note: Cof HDX
type: Class
subclass of: Hydx Kolom
subclass of: Restriction
  author of change: Marinus Vonhof
  date of change: 2014-12-19
  author at start life: Marinus Vonhof
  date of start life: 2014-09-13
  on class: Hydx Verbinding regel
  on property: has as aspect (inverse)
  max qualified cardinality: 1
subclass of: Restriction
  on property: has as reference (qualification)
  all values from: Aanname HydX

Hydx Verbinding regel
author at start life: Marinus Vonhof
date of start life: 2014-02-07
scope note: Cof HDX
type: Class
subclass of: Hydx Regel
subclass of: Restriction
  author of change: Marinus Vonhof
  date of change: 2014-02-08
  author at start life: Marinus Vonhof
  date of start life: 2014-02-07
  on class: Hydx Identificatie knooppunt of verbinding
  on property: has as aspect
  qualified cardinality: 1
subclass of: Restriction
  author of change: Marinus Vonhof
  date of change: 2014-12-17
  author at start life: Marinus Vonhof
  date of start life: 2014-09-13
  on class: Hydx Toelichting regel
  on property: has as aspect
  max qualified cardinality: 1
subclass of: Restriction
  author of change: Marinus Vonhof
  date of change: 2014-12-19
  author at start life: Marinus Vonhof
  date of start life: 2014-09-13
  on class: Hydx Aanname b.o.b. knooppunt 1
  on property: has as aspect
  max qualified cardinality: 1
subclass of: Restriction
  author of change: Marinus Vonhof
  date of change: 2017-05-27
  author at start life: Marinus Vonhof
  date of start life: 2014-09-13
  on class: Hydx Identificatie profieldefinitie
  on property: has as aspect
  max qualified cardinality: 1
subclass of: Restriction
  author of change: Marinus Vonhof
  date of change: 2017-07-25
  author at start life: Marinus Vonhof
  date of start life: 2014-09-13
  on class: Hydx Identificatie definitie IT-object
  on property: has as aspect
  max qualified cardinality: 1
subclass of: Restriction
  author of change: Marinus Vonhof
  date of change: 2017-08-30
  author at start life: Marinus Vonhof
  date of start life: 2014-09-13
  on class: Hydx B.o.b. knooppunt 1
  on property: has as aspect
  max qualified cardinality: 1
subclass of: Restriction
  author of change: Marinus Vonhof
  date of change: 2017-08-30
  author at start life: Marinus Vonhof
  date of start life: 2014-09-13
  on class: Hydx B.o.b. knooppunt 2
  on property: has as aspect
  max qualified cardinality: 1
subclass of: Restriction
  author of change: Marinus Vonhof
  date of change: 2017-09-08
  author at start life: Marinus Vonhof
  date of start life: 2014-09-13
  on class: Hydx Identificatie knooppunt 2
  on property: has as aspect
  qualified cardinality: 1
subclass of: Restriction
  author of change: Marinus Vonhof
  date of change: 2017-09-09
  author at start life: Marinus Vonhof
  date of start life: 2014-09-13
  on class: Hydx Identificatie knooppunt 1
  on property: has as aspect
  qualified cardinality: 1
subclass of: Restriction
  author of change: Marinus Vonhof
  date of change: 2017-09-15
  author at start life: Marinus Vonhof
  date of start life: 2014-09-13
  on class: Hydx Lengte verbinding
  on property: has as aspect
  max qualified cardinality: 1
subclass of: Restriction
  author of change: Marinus Vonhof
  date of change: 2019-05-13
  author at start life: Marinus Vonhof
  date of start life: 2014-09-13
  on class: Hydx Aanname profiel
  on property: has as aspect
  max qualified cardinality: 1
subclass of: Restriction
  author at start life: Marinus Vonhof
  date of start life: 2014-02-07
  on class: Hydx Verbinding bestand
  on property: has as part (inverse)
  qualified cardinality: 1
subclass of: Restriction
  author at start life: Marinus Vonhof
  date of start life: 2014-09-13
  on class: Hydx Aanname b.o.b. knooppunt 2
  on property: has as aspect
  max qualified cardinality: 1
subclass of: Restriction
  author at start life: Marinus Vonhof
  date of start life: 2014-09-13
  on class: Hydx Status object
  on property: has as aspect
  max qualified cardinality: 1
subclass of: Restriction
  author at start life: Marinus Vonhof
  date of start life: 2014-09-13
  on class: Hydx Stromingsrichting
  on property: has as aspect
  max qualified cardinality: 1
subclass of: Restriction
  author at start life: Marinus Vonhof
  date of start life: 2014-09-13
  on class: Hydx Type inzameling
  on property: has as aspect
  max qualified cardinality: 1
subclass of: Restriction
  author at start life: Marinus Vonhof
  date of start life: 2014-09-13
  on class: Hydx Type verbinding
  on property: has as aspect
  qualified cardinality: 1
subclass of: Restriction
  author at start life: Marinus Vonhof
  date of start life: 2014-10-19
  on class: Hydx Initiële waterstand
  on property: has as aspect
  max qualified cardinality: 1
subclass of: Restriction
  author at start life: Marinus Vonhof
  date of start life: 2017-09-08
  on class: Hydx Identificatie leiding
  on property: has as aspect
  max qualified cardinality: 1

Hydx Aanname b.o.b. knooppunt 2
author of change: Marinus Vonhof
date of change: 2017-05-27
definition: Aanname waarde BOB_KN2
notation: AAN_BB2
author at start life: Marinus Vonhof
date of start life: 2014-09-13
comment: [Len=3]
scope note: Cof HDX
type: Class
subclass of: Hydx Kolom
subclass of: Restriction
  author at start life: Marinus Vonhof
  date of start life: 2014-09-13
  on class: Hydx Verbinding regel
  on property: has as aspect (inverse)
  max qualified cardinality: 1
subclass of: Restriction
  on property: has as reference (qualification)
  all values from: Aanname HydX

Hydx Aanname breedte overstortdrempel
author of change: Marinus Vonhof
date of change: 2017-08-30
definition: Aanname waarde OVS_BRE
notation: AAN_OVB
author at start life: Marinus Vonhof
date of start life: 2014-09-13
comment: [Len=3]
scope note: Cof HDX
type: Class
subclass of: Hydx Kolom
subclass of: Restriction
  author of change: Marinus Vonhof
  date of change: 2014-12-19
  author at start life: Marinus Vonhof
  date of start life: 2014-09-13
  on class: Hydx Kunstwerk regel
  on property: has as aspect (inverse)
  max qualified cardinality: 1
subclass of: Restriction
  on property: has as reference (qualification)
  all values from: Aanname HydX

Hydx Aanname maaiveldhoogte
definition: Aanname maaiveldhoogte
notation: AAN_MVD
author at start life: Marinus Vonhof
date of start life: 2014-09-13
comment: [Len=3]
scope note: Cof HDX
type: Class
subclass of: Hydx Kolom
subclass of: Restriction
  author of change: Marinus Vonhof
  date of change: 2017-07-25
  author at start life: Marinus Vonhof
  date of start life: 2014-09-13
  on class: Hydx Knooppunt regel
  on property: has as aspect (inverse)
  max qualified cardinality: 1
subclass of: Restriction
  on property: has as reference (qualification)
  all values from: Aanname HydX

Hydx Knooppunt regel
author at start life: Marinus Vonhof
date of start life: 2014-02-07
scope note: Cof HDX
type: Class
subclass of: Hydx Regel
subclass of: Restriction
  author of change: Marinus Vonhof
  date of change: 2014-12-17
  author at start life: Marinus Vonhof
  date of start life: 2014-09-13
  on class: Hydx Toelichting regel
  on property: has as aspect
  max qualified cardinality: 1
subclass of: Restriction
  author of change: Marinus Vonhof
  date of change: 2017-05-18
  author at start life: Marinus Vonhof
  date of start life: 2014-09-13
  on class: Hydx Status object
  on property: has as aspect
  max qualified cardinality: 1
subclass of: Restriction
  author of change: Marinus Vonhof
  date of change: 2017-05-27
  author at start life: Marinus Vonhof
  date of start life: 2014-02-07
  on class: Hydx Identificatie knooppunt of verbinding
  on property: has as aspect
  qualified cardinality: 1
subclass of: Restriction
  author of change: Marinus Vonhof
  date of change: 2017-07-25
  author at start life: Marinus Vonhof
  date of start life: 2014-09-13
  on class: Hydx Aanname maaiveldhoogte
  on property: has as aspect
  max qualified cardinality: 1
subclass of: Restriction
  author of change: Marinus Vonhof
  date of change: 2017-07-26
  author at start life: Marinus Vonhof
  date of start life: 2014-09-13
  on class: Hydx Identificatie compartiment
  on property: has as aspect
  max qualified cardinality: 1
subclass of: Restriction
  author of change: Marinus Vonhof
  date of change: 2017-08-30
  author at start life: Marinus Vonhof
  date of start life: 2014-09-13
  on class: Hydx Identificatie definitie IT-object
  on property: has as aspect
  max qualified cardinality: 1
subclass of: Restriction
  author of change: Marinus Vonhof
  date of change: 2017-08-30
  author at start life: Marinus Vonhof
  date of start life: 2014-09-13
  on class: Hydx Identificatie rioolstelsel
  on property: has as aspect
  max qualified cardinality: 1
subclass of: Restriction
  author of change: Marinus Vonhof
  date of change: 2017-09-08
  author at start life: Marinus Vonhof
  date of start life: 2014-09-13
  on class: Hydx Identificatie rioolput
  on property: has as aspect
  qualified cardinality: 1
subclass of: Restriction
  author of change: Marinus Vonhof
  date of change: 2018-04-30
  author at start life: Marinus Vonhof
  date of start life: 2014-09-13
  on class: Hydx Materiaal put
  on property: has as aspect
  max qualified cardinality: 1
subclass of: Restriction
  author at start life: Marinus Vonhof
  date of start life: 2014-02-07
  on class: Hydx Knooppunt bestand
  on property: has as part (inverse)
  qualified cardinality: 1
subclass of: Restriction
  author at start life: Marinus Vonhof
  date of start life: 2014-09-13
  on class: Hydx Initiële waterstand
  on property: has as aspect
  max qualified cardinality: 1
subclass of: Restriction
  author at start life: Marinus Vonhof
  date of start life: 2014-09-13
  on class: Hydx Lengte putbodem
  on property: has as aspect
  max qualified cardinality: 1
subclass of: Restriction
  author at start life: Marinus Vonhof
  date of start life: 2014-09-13
  on class: Hydx Oppervlak water op straat
  on property: has as aspect
  max qualified cardinality: 1
subclass of: Restriction
  author at start life: Marinus Vonhof
  date of start life: 2014-09-13
  on class: Hydx Breedte/diameter putbodem
  on property: has as aspect
  qualified cardinality: 1
subclass of: Restriction
  author at start life: Marinus Vonhof
  date of start life: 2014-09-13
  on class: Hydx Maaiveldschematisering
  on property: has as aspect
  qualified cardinality: 1
subclass of: Restriction
  author at start life: Marinus Vonhof
  date of start life: 2014-09-13
  on class: Hydx Niveau binnenonderkant put
  on property: has as aspect
  qualified cardinality: 1
subclass of: Restriction
  author at start life: Marinus Vonhof
  date of start life: 2014-09-13
  on class: Hydx Niveau maaiveld
  on property: has as aspect
  qualified cardinality: 1
subclass of: Restriction
  author at start life: Marinus Vonhof
  date of start life: 2014-09-13
  on class: Hydx Vorm put
  on property: has as aspect
  qualified cardinality: 1
subclass of: Restriction
  author at start life: Marinus Vonhof
  date of start life: 2014-09-13
  on class: Hydx X-coördinaat
  on property: has as aspect
  qualified cardinality: 1
subclass of: Restriction
  author at start life: Marinus Vonhof
  date of start life: 2014-09-13
  on class: Hydx Y-coördinaat
  on property: has as aspect
  qualified cardinality: 1
subclass of: Restriction
  author at start life: Marinus Vonhof
  date of start life: 2014-12-17
  on class: Hydx Type knooppunt
  on property: has as aspect
  qualified cardinality: 1

Hydx Aanname niveau overstortdrempel
author of change: Marinus Vonhof
date of change: 2017-08-30
definition: Aanname waarde OVS_NIV
notation: AAN_OVN
author at start life: Marinus Vonhof
date of start life: 2014-09-13
comment: [Len=3]
scope note: Cof HDX
type: Class
subclass of: Hydx Kolom
subclass of: Restriction
  author at start life: Marinus Vonhof
  date of start life: 2014-09-13
  on class: Hydx Kunstwerk regel
  on property: has as aspect (inverse)
  max qualified cardinality: 1
subclass of: Restriction
  on property: has as reference (qualification)
  all values from: Aanname HydX

Hydx Aanname pompcapaciteit pomp
author of change: Marinus Vonhof
date of change: 2017-05-11
definition: Aanname waarde PMP_CAP
notation: AAN_CAP
author at start life: Marinus Vonhof
date of start life: 2014-09-13
comment: [Len=3]
scope note: Cof HDX
type: Class
subclass of: Hydx Kolom
subclass of: Restriction
  author at start life: Marinus Vonhof
  date of start life: 2014-09-13
  on class: Hydx Kunstwerk regel
  on property: has as aspect (inverse)
  max qualified cardinality: 1
subclass of: Restriction
  on property: has as reference (qualification)
  all values from: Aanname HydX

Hydx Aanname profiel
author of change: Marinus Vonhof
date of change: 2019-05-13
definition: Aanname profieldefinitie PRO_IDE
notation: AAN_PRO
author at start life: Marinus Vonhof
date of start life: 2014-09-13
comment: [Len=3]
scope note: Cof HDX
type: Class
subclass of: Hydx Kolom
subclass of: Restriction
  author of change: Marinus Vonhof
  date of change: 2019-05-13
  author at start life: Marinus Vonhof
  date of start life: 2014-09-13
  on class: Hydx Verbinding regel
  on property: has as aspect (inverse)
  max qualified cardinality: 1
subclass of: Restriction
  on property: has as reference (qualification)
  all values from: Aanname HydX

Hydx Aanslagniveau benedenstrooms
author of change: Marinus Vonhof
date of change: 2019-02-19
definition: Aanslagniveau benedenstrooms pomp t.o.v. NAP
notation: PMP_AN1
author at start life: Marinus Vonhof
date of start life: 2014-09-13
units of measurements: m
comment: [Len=8.2] [Verplicht als Kunstwerk/KWK_TYP=PMP en Kunstwerk/PMP_AN2 niet gevuld is]
scope note: Cof HDX
type: Class
subclass of: Hydx Kolom
subclass of: Restriction
  author of change: Marinus Vonhof
  date of change: 2017-07-25
  author at start life: Marinus Vonhof
  date of start life: 2014-09-13
  on class: Hydx Kunstwerk regel
  on property: has as aspect (inverse)
  max qualified cardinality: 1
subclass of: Restriction
  on property: has as reference (qualification)
  all values from: Aanslagniveau benedenstrooms
subclass of: Restriction
  on property: has as value
  all values from: decimal

Hydx Aanslagniveau bovenstrooms
author of change: Marinus Vonhof
date of change: 2019-02-19
definition: Aanslagniveau bovenstrooms pomp t.o.v. NAP
notation: PMP_AN2
author at start life: Marinus Vonhof
date of start life: 2017-07-25
units of measurements: m
comment: [Len=8.2] [Verplicht als Kunstwerk/KWK_TYP=PMP en Kunstwerk/PMP_AN1 niet gevuld is]
scope note: Cof HDX
type: Class
subclass of: Hydx Kolom
subclass of: Restriction
  author at start life: Marinus Vonhof
  date of start life: 2017-07-25
  on class: Hydx Kunstwerk regel
  on property: has as aspect (inverse)
  max qualified cardinality: 1
subclass of: Restriction
  on property: has as reference (qualification)
  all values from: Aanslagniveau bovenstrooms
subclass of: Restriction
  on property: has as value
  all values from: decimal

Hydx Aantal csv-bestanden
definition: Aantal .csv bestanden behorend bij dit HYD
notation: ALG_ATL
author at start life: Marinus Vonhof
date of start life: 2014-09-13
units of measurements: pcs
comment: [Len=3]
scope note: Cof HDX
type: Class
subclass of: Hydx Kolom
subclass of: Restriction
  author at start life: Marinus Vonhof
  date of start life: 2014-09-13
  on class: Hydx Meta regel
  on property: has as aspect (inverse)
  qualified cardinality: 1
subclass of: Restriction
  on property: has as value
  all values from: integer

Hydx Meta regel
author at start life: Marinus Vonhof
date of start life: 2014-02-07
scope note: Cof HDX
type: Class
subclass of: Hydx Regel
subclass of: Restriction
  author of change: Marinus Vonhof
  date of change: 2014-09-14
  author at start life: Marinus Vonhof
  date of start life: 2014-09-13
  on class: HydX-versie
  on property: has as aspect
  max qualified cardinality: 1
subclass of: Restriction
  author of change: Marinus Vonhof
  date of change: 2017-09-08
  author at start life: Marinus Vonhof
  date of start life: 2014-09-13
  on class: Hydx Datum samenstelling HydX-bestand
  on property: has as aspect
  max qualified cardinality: 1
subclass of: Restriction
  author of change: Marinus Vonhof
  date of change: 2017-09-08
  author at start life: Marinus Vonhof
  date of start life: 2014-09-13
  on class: Hydx Toelichting regel
  on property: has as aspect
  max qualified cardinality: 1
subclass of: Restriction
  author at start life: Marinus Vonhof
  date of start life: 2014-02-07
  on class: Hydx Meta bestand
  on property: has as part (inverse)
  qualified cardinality: 1
subclass of: Restriction
  author at start life: Marinus Vonhof
  date of start life: 2014-09-13
  on class: Hydx Omschrijving rioolstelsel
  on property: has as aspect
  max qualified cardinality: 1
subclass of: Restriction
  author at start life: Marinus Vonhof
  date of start life: 2014-09-13
  on class: Hydx Oorsprong export
  on property: has as aspect
  max qualified cardinality: 1
subclass of: Restriction
  author at start life: Marinus Vonhof
  date of start life: 2014-09-13
  on class: Hydx Opdrachtgevende instantie
  on property: has as aspect
  max qualified cardinality: 1
subclass of: Restriction
  author at start life: Marinus Vonhof
  date of start life: 2014-09-13
  on class: Hydx Uitvoerende instantie
  on property: has as aspect
  max qualified cardinality: 1
subclass of: Restriction
  author at start life: Marinus Vonhof
  date of start life: 2014-09-13
  on class: Hydx Aantal csv-bestanden
  on property: has as aspect
  qualified cardinality: 1

Hydx Aantal vervuilingseenheden verloop-definitie
author of change: Marinus Vonhof
date of change: 2017-08-30
definition: Aantal vervuilingseenheden behorend bij de verloop-definitie
notation: AVV_ENH
author at start life: Marinus Vonhof
date of start life: 2014-09-13
units of measurements: pcs
comment: [Len=10] [Verplicht als Debiet/DEB_TYP=VWD] (optioneel bij Debiet/DEB_TYP=LAT)
scope note: Cof HDX
type: Class
subclass of: Hydx Kolom
subclass of: Restriction
  author of change: Marinus Vonhof
  date of change: 2017-07-25
  author at start life: Marinus Vonhof
  date of start life: 2014-09-13
  on class: Hydx Debiet regel
  on property: has as aspect (inverse)
  max qualified cardinality: 1
subclass of: Restriction
  on property: has as value
  all values from: integer

Hydx Debiet regel
author at start life: Marinus Vonhof
date of start life: 2014-02-07
scope note: Cof HDX
type: Class
subclass of: Hydx Regel
subclass of: Restriction
  author of change: Marinus Vonhof
  date of change: 2014-02-08
  author at start life: Marinus Vonhof
  date of start life: 2014-02-07
  on class: Hydx Identificatie knooppunt of verbinding
  on property: has as aspect
  qualified cardinality: 1
subclass of: Restriction
  author of change: Marinus Vonhof
  date of change: 2014-12-19
  author at start life: Marinus Vonhof
  date of start life: 2014-09-13
  on class: Hydx Toelichting regel
  on property: has as aspect
  max qualified cardinality: 1
subclass of: Restriction
  author of change: Marinus Vonhof
  date of change: 2017-07-25
  author at start life: Marinus Vonhof
  date of start life: 2014-09-13
  on class: Hydx Aantal vervuilingseenheden verloop-definitie
  on property: has as aspect
  max qualified cardinality: 1
subclass of: Restriction
  author of change: Marinus Vonhof
  date of change: 2017-08-30
  author at start life: Marinus Vonhof
  date of start life: 2014-09-13
  on class: Hydx Identificatie verloop-definitie
  on property: has as aspect
  max qualified cardinality: 1
subclass of: Restriction
  author of change: Marinus Vonhof
  date of change: 2017-08-30
  author at start life: Marinus Vonhof
  date of start life: 2017-07-25
  on class: Hydx Afvoerend oppervlak
  on property: has as aspect
  max qualified cardinality: 1
subclass of: Restriction
  author at start life: Marinus Vonhof
  date of start life: 2014-02-07
  on class: Hydx Debiet bestand
  on property: has as part (inverse)
  qualified cardinality: 1
subclass of: Restriction
  author at start life: Marinus Vonhof
  date of start life: 2014-09-13
  on class: Hydx Type debiet
  on property: has as aspect
  qualified cardinality: 1

Hydx Afslagniveau benedenstrooms
author of change: Marinus Vonhof
date of change: 2019-02-19
definition: Afslagniveau benedenstrooms pomp t.o.v. NAP
notation: PMP_AF1
author at start life: Marinus Vonhof
date of start life: 2014-09-13
units of measurements: m
comment: [Len=8.2] [Verplicht als Kunstwerk/KWK_TYP=PMP en Kunstwerk/PMP_AF2 niet gevuld is]
scope note: Cof HDX
type: Class
subclass of: Hydx Kolom
subclass of: Restriction
  author of change: Marinus Vonhof
  date of change: 2017-07-25
  author at start life: Marinus Vonhof
  date of start life: 2014-09-13
  on class: Hydx Kunstwerk regel
  on property: has as aspect (inverse)
  max qualified cardinality: 1
subclass of: Restriction
  on property: has as reference (qualification)
  all values from: Afslagniveau benedenstrooms
subclass of: Restriction
  on property: has as value
  all values from: decimal

Hydx Afslagniveau bovenstrooms
author of change: Marinus Vonhof
date of change: 2019-02-19
definition: Afslagniveau bovenstrooms pomp t.o.v. NAP
notation: PMP_AF2
author at start life: Marinus Vonhof
date of start life: 2017-07-25
units of measurements: m
comment: [Len=8.2] [Verplicht als Kunstwerk/KWK_TYP=PMP en Kunstwerk/PMP_AF1 niet gevuld is]
scope note: Cof HDX
type: Class
subclass of: Hydx Kolom
subclass of: Restriction
  author at start life: Marinus Vonhof
  date of start life: 2017-07-25
  on class: Hydx Kunstwerk regel
  on property: has as aspect (inverse)
  max qualified cardinality: 1
subclass of: Restriction
  on property: has as reference (qualification)
  all values from: Afslagniveau bovenstrooms
subclass of: Restriction
  on property: has as value
  all values from: decimal

Hydx Afvoercoëfficiënt overstortdrempel
author of change: Marinus Vonhof
date of change: 2019-03-20
definition: Afvoercoefficient overstortdrempel of stuwmuur
notation: OVS_COE
author at start life: Marinus Vonhof
date of start life: 2014-09-13
units of measurements: -
comment: [Len=4.2] [Verplicht als Kunstwerk/KWK_TYP=OVS]
scope note: Cof HDX
type: Class
subclass of: Hydx Kolom
subclass of: Restriction
  author at start life: Marinus Vonhof
  date of start life: 2014-09-13
  on class: Hydx Kunstwerk regel
  on property: has as aspect (inverse)
  max qualified cardinality: 1
subclass of: Restriction
  on property: has as reference (qualification)
  all values from: Afvoercoëfficiënt
subclass of: Restriction
  on property: has as value
  all values from: decimal

Hydx Afvoerdefinitie
author of change: Marinus Vonhof
date of change: 2019-02-18
definition: Naam van bestand waarin het neerslag-afvoerconcept staat beschreven. Bijvoorbeeld nwrw.csv
notation: AFV_DEF
author at start life: Marinus Vonhof
date of start life: 2014-09-13
comment: [Len=30]
scope note: Cof HDX
type: Class
subclass of: Hydx Kolom
subclass of: Restriction
  author of change: Marinus Vonhof
  date of change: 2017-07-25
  author at start life: Marinus Vonhof
  date of start life: 2014-09-13
  on class: Hydx Oppervlak regel
  on property: has as aspect (inverse)
  qualified cardinality: 1

Hydx Oppervlak regel
author at start life: Marinus Vonhof
date of start life: 2014-02-07
scope note: Cof HDX
type: Class
subclass of: Hydx Regel
subclass of: Restriction
  author of change: Marinus Vonhof
  date of change: 2014-02-08
  author at start life: Marinus Vonhof
  date of start life: 2014-02-07
  on class: Hydx Identificatie knooppunt of verbinding
  on property: has as aspect
  qualified cardinality: 1
subclass of: Restriction
  author of change: Marinus Vonhof
  date of change: 2014-12-17
  author at start life: Marinus Vonhof
  date of start life: 2014-09-13
  on class: Hydx Toelichting regel
  on property: has as aspect
  max qualified cardinality: 1
subclass of: Restriction
  author of change: Marinus Vonhof
  date of change: 2017-07-25
  author at start life: Marinus Vonhof
  date of start life: 2014-09-13
  on class: Hydx Naam neerslagstation
  on property: has as aspect
  max qualified cardinality: 1
subclass of: Restriction
  author of change: Marinus Vonhof
  date of change: 2017-07-25
  author at start life: Marinus Vonhof
  date of start life: 2014-09-13
  on class: Hydx Afvoerdefinitie
  on property: has as aspect
  qualified cardinality: 1
subclass of: Restriction
  author of change: Marinus Vonhof
  date of change: 2017-09-15
  author at start life: Marinus Vonhof
  date of start life: 2017-07-25
  on class: Hydx Afvoerend oppervlak
  on property: has as aspect
  qualified cardinality: 1
subclass of: Restriction
  author at start life: Marinus Vonhof
  date of start life: 2014-02-07
  on class: Hydx Oppervlak bestand
  on property: has as part (inverse)
  qualified cardinality: 1
subclass of: Restriction
  author at start life: Marinus Vonhof
  date of start life: 2017-05-08
  on class: Hydx Identificatie regel afvoerend oppervlak
  on property: has as aspect
  qualified cardinality: 1

Hydx Afvoerend oppervlak
author of change: Marinus Vonhof
date of change: 2017-09-15
definition: Omvang afvoerend oppervlak
notation: AFV_OPP
author at start life: Marinus Vonhof
date of start life: 2017-07-25
units of measurements: m2
comment: [Len=10]
scope note: Cof HDX
type: Class
subclass of: Hydx Kolom
subclass of: Restriction
  author of change: Marinus Vonhof
  date of change: 2017-08-30
  author at start life: Marinus Vonhof
  date of start life: 2017-07-25
  on class: Hydx Debiet regel
  on property: has as aspect (inverse)
  max qualified cardinality: 1
subclass of: Restriction
  author of change: Marinus Vonhof
  date of change: 2017-09-15
  author at start life: Marinus Vonhof
  date of start life: 2017-07-25
  on class: Hydx Oppervlak regel
  on property: has as aspect (inverse)
  qualified cardinality: 1
subclass of: Restriction
  on property: has as reference (qualification)
  all values from: Afvoerend oppervlak
subclass of: Restriction
  on property: has as value
  all values from: decimal

Hydx Bestand
author of change: Marinus Vonhof
date of change: 2021-09-17
definition: CSV bestand binnen GWSW-HydX
author at start life: Marinus Vonhof
date of start life: 2014-02-07
scope note: Cof HDX
type: Class
subclass of: Informatiedrager

Hydx B.o.b. knooppunt 1
author of change: Marinus Vonhof
date of change: 2017-05-11
definition: Binnenonderkant buis knooppunt 1 t.o.v. NAP
notation: BOB_KN1
author at start life: Marinus Vonhof
date of start life: 2014-09-13
units of measurements: m
comment: [Len=8.2] [Verplicht als Verbinding/VRB_TYP=GSL,OPL,ITR]
scope note: Cof HDX
type: Class
subclass of: Hydx Kolom
subclass of: Restriction
  author of change: Marinus Vonhof
  date of change: 2017-08-30
  author at start life: Marinus Vonhof
  date of start life: 2014-09-13
  on class: Hydx Verbinding regel
  on property: has as aspect (inverse)
  max qualified cardinality: 1
subclass of: Restriction
  on property: has as reference (qualification)
  all values from: B.o.b. beginpunt leiding
subclass of: Restriction
  on property: has as value
  all values from: decimal

Hydx B.o.b. knooppunt 2
author of change: Marinus Vonhof
date of change: 2017-05-11
definition: Binnenonderkant buis knooppunt 2 t.o.v. NAP
notation: BOB_KN2
author at start life: Marinus Vonhof
date of start life: 2014-09-13
units of measurements: m
comment: [Len=8.2] [Verplicht als Verbinding/VRB_TYP=GSL,OPL,ITR]
scope note: Cof HDX
type: Class
subclass of: Hydx Kolom
subclass of: Restriction
  author of change: Marinus Vonhof
  date of change: 2017-08-30
  author at start life: Marinus Vonhof
  date of start life: 2014-09-13
  on class: Hydx Verbinding regel
  on property: has as aspect (inverse)
  max qualified cardinality: 1
subclass of: Restriction
  on property: has as reference (qualification)
  all values from: B.o.b. eindpunt leiding
subclass of: Restriction
  on property: has as value
  all values from: decimal

Hydx Breedte overstortdrempel
author of change: Marinus Vonhof
date of change: 2019-03-20
definition: Breedte overstortdrempel of stuwmuur.
notation: OVS_BRE
author at start life: Marinus Vonhof
date of start life: 2014-09-13
units of measurements: m
comment: [Len=8.2] [Verplicht als Kunstwerk/KWK_TYP=OVS] [Omrekenen van mm naar m]
scope note: Cof HDX
type: Class
subclass of: Hydx Kolom
subclass of: Restriction
  author at start life: Marinus Vonhof
  date of start life: 2014-09-13
  on class: Hydx Kunstwerk regel
  on property: has as aspect (inverse)
  max qualified cardinality: 1
subclass of: Restriction
  on property: has as reference (qualification)
  all values from: Drempelbreedte
subclass of: Restriction
  on property: has as value
  all values from: decimal

Hydx Breedte/diameter profiel
author of change: Marinus Vonhof
date of change: 2019-09-03
definition: Inwendige breedte/diameter profiel. Voor kunststof leidingen (materiaalcode PVC of HPE) wordt het kenmerk Breedte Leiding of Diameter Leiding omgerekend naar een inwendige maat. Daarvoor wordt het kenmerk Wanddikte of SDR-waarde gebruikt.
notation: PRO_BRE
author at start life: Marinus Vonhof
date of start life: 2014-09-13
units of measurements: mm
comment: [Len=8] [Verplicht als Profiel/PRO_VRM=RND,EIV,EIG,RHK] Alleen informatief voor overige profielen
scope note: Cof HDX
type: Class
subclass of: Hydx Kolom
subclass of: Restriction
  author at start life: Marinus Vonhof
  date of start life: 2014-09-13
  on class: Hydx Profiel regel
  on property: has as aspect (inverse)
  max qualified cardinality: 1
subclass of: Restriction
  on property: has as reference (qualification)
  all values from: Breedte leiding
subclass of: Restriction
  on property: has as value
  all values from: integer

Hydx Profiel regel
author at start life: Marinus Vonhof
date of start life: 2014-02-07
scope note: Cof HDX
type: Class
subclass of: Hydx Regel
subclass of: Restriction
  author of change: Marinus Vonhof
  date of change: 2014-12-17
  author at start life: Marinus Vonhof
  date of start life: 2014-09-13
  on class: Hydx Toelichting regel
  on property: has as aspect
  max qualified cardinality: 1
subclass of: Restriction
  author of change: Marinus Vonhof
  date of change: 2017-05-27
  author at start life: Marinus Vonhof
  date of start life: 2014-09-13
  on class: Hydx Identificatie profieldefinitie
  on property: has as aspect
  qualified cardinality: 1
subclass of: Restriction
  author at start life: Marinus Vonhof
  date of start life: 2014-02-07
  on class: Hydx Profiel bestand
  on property: has as part (inverse)
  qualified cardinality: 1
subclass of: Restriction
  author at start life: Marinus Vonhof
  date of start life: 2014-09-13
  on class: Hydx Breedte/diameter profiel
  on property: has as aspect
  max qualified cardinality: 1
subclass of: Restriction
  author at start life: Marinus Vonhof
  date of start life: 2014-09-13
  on class: Hydx Hoogte profiel
  on property: has as aspect
  max qualified cardinality: 1
subclass of: Restriction
  author at start life: Marinus Vonhof
  date of start life: 2014-09-13
  on class: Hydx Materiaal
  on property: has as aspect
  max qualified cardinality: 1
subclass of: Restriction
  author at start life: Marinus Vonhof
  date of start life: 2014-09-13
  on class: Hydx Vorm profiel
  on property: has as aspect
  max qualified cardinality: 1
subclass of: Restriction
  author at start life: Marinus Vonhof
  date of start life: 2019-02-18
  on class: Hydx Breedtewaarden profiel
  on property: has as aspect
  max qualified cardinality: 1
subclass of: Restriction
  author at start life: Marinus Vonhof
  date of start life: 2019-02-18
  on class: Hydx Hoogtewaarden profiel
  on property: has as aspect
  max qualified cardinality: 1

Hydx Breedte/diameter putbodem
definition: Breedte/diameter putbodem
notation: KNP_BRE
author at start life: Marinus Vonhof
date of start life: 2014-09-13
units of measurements: mm
comment: [Len=8]
scope note: Cof HDX
type: Class
subclass of: Hydx Kolom
subclass of: Restriction
  author at start life: Marinus Vonhof
  date of start life: 2014-09-13
  on class: Hydx Knooppunt regel
  on property: has as aspect (inverse)
  qualified cardinality: 1
subclass of: Restriction
  on property: has as reference (qualification)
  all values from: Breedte put
subclass of: Restriction
  on property: has as value
  all values from: integer

Hydx Breedtewaarden profiel
author of change: Marinus Vonhof
date of change: 2019-07-11
definition: Kolom bevat breedtewaarden bij elke hoogtewaarde in kolom TAB_HGT. Geldt alleen voor speciale profieldefinities. Formaat is tekststring met tabulated of XY waarden [m], decimaalteken toegestaan, gescheiden door spaties. Bij de profielvormen TAB, HEU, MVR, UVR, OVA gelden tabulated waarden, bij de profielvorm YZP gelden YZ waarden. Bij de profielvorm TPZ gelden bij open leidingen YZ waarden en bij gesloten leidingen tabulated waarden.
notation: TAB_BRE
author at start life: Marinus Vonhof
date of start life: 2019-02-18
comment: [Len=1000] [Verplicht als Profiel/PRO_VRM=TAB,YZP,HEU,MVR,UVR,TPZ,OVA]
scope note: Cof HDX
type: Class
subclass of: Hydx Kolom
subclass of: Restriction
  author at start life: Marinus Vonhof
  date of start life: 2019-02-18
  on class: Hydx Profiel regel
  on property: has as aspect (inverse)
  max qualified cardinality: 1

Hydx Buitenwaterstand
author of change: Marinus Vonhof
date of change: 2017-09-05
definition: Buitenwaterstand t.o.v. NAP
notation: BWS_NIV
author at start life: Marinus Vonhof
date of start life: 2014-09-13
units of measurements: m
comment: [Len=8.2] [Verplicht als Kunstwerk/KWK_TYP=UIT]
scope note: Cof HDX
type: Class
subclass of: Hydx Kolom
subclass of: Restriction
  author of change: Marinus Vonhof
  date of change: 2017-07-25
  author at start life: Marinus Vonhof
  date of start life: 2014-09-13
  on class: Hydx Kunstwerk regel
  on property: has as aspect (inverse)
  max qualified cardinality: 1
subclass of: Restriction
  on property: has as reference (qualification)
  all values from: Z-coördinaat
subclass of: Restriction
  on property: has as value
  all values from: decimal

Z-coördinaat
author of change: Marinus Vonhof
date of change: 2017-05-11
definition: Conform coordinatenstelsel EPSG:7415 (x/y conform EPSG:28992 (=RD), z conform EPSG:5709 (=NAP).
author at start life: Marinus Vonhof
date of start life: 2013-09-03
units of measurements: m
comment: [is aspect]
scope note: Cof HDX
type: Class
subclass of: Kenmerk
subclass of: Restriction
  on property: has as value
  all values from: Z-coördinaat (datatype)

Hydx Contractiecoëfficiënt doorlaatprofiel
definition: Contractiecoefficient doorlaatprofiel
notation: DRL_COE
author at start life: Marinus Vonhof
date of start life: 2014-09-13
units of measurements: -
comment: [Len=4.2] [Verplicht als Kunstwerk/KWK_TYP=DRL]
scope note: Cof HDX
type: Class
subclass of: Hydx Kolom
subclass of: Restriction
  author at start life: Marinus Vonhof
  date of start life: 2014-09-13
  on class: Hydx Kunstwerk regel
  on property: has as aspect (inverse)
  max qualified cardinality: 1
subclass of: Restriction
  on property: has as reference (qualification)
  all values from: Contractiecoëfficiënt doorlaatprofiel
subclass of: Restriction
  on property: has as value
  all values from: decimal

Hydx Dagnummer
author of change: Marinus Vonhof
date of change: 2017-05-11
definition: Dagnummer (1 t/m 7) Maandag is dag 1, dinsdag is dag 2 etc.
notation: VER_DAG
author at start life: Marinus Vonhof
date of start life: 2014-09-13
units of measurements: pcs
comment: [Len=1] [Verplicht als Verloop/VER_TYP=CST, VAR]
scope note: Cof HDX
type: Class
subclass of: Hydx Kolom
subclass of: Restriction
  author at start life: Marinus Vonhof
  date of start life: 2014-09-13
  on class: Hydx Verloop regel
  on property: has as aspect (inverse)
  max qualified cardinality: 1
subclass of: Restriction
  on property: has as value
  all values from: integer

Hydx Verloop regel
author at start life: Marinus Vonhof
date of start life: 2014-02-07
scope note: Cof HDX
type: Class
subclass of: Hydx Regel
subclass of: Restriction
  author of change: Marinus Vonhof
  date of change: 2014-12-17
  author at start life: Marinus Vonhof
  date of start life: 2014-09-13
  on class: Hydx Percentage volume dag VER_DAG uur 00
  on property: has as aspect
  max qualified cardinality: 1
subclass of: Restriction
  author of change: Marinus Vonhof
  date of change: 2014-12-17
  author at start life: Marinus Vonhof
  date of start life: 2014-09-13
  on class: Hydx Toelichting regel
  on property: has as aspect
  max qualified cardinality: 1
subclass of: Restriction
  author at start life: Marinus Vonhof
  date of start life: 2014-02-07
  on class: Hydx Verloop bestand
  on property: has as part (inverse)
  qualified cardinality: 1
subclass of: Restriction
  author at start life: Marinus Vonhof
  date of start life: 2014-09-13
  on class: Hydx Dagnummer
  on property: has as aspect
  max qualified cardinality: 1
subclass of: Restriction
  author at start life: Marinus Vonhof
  date of start life: 2014-09-13
  on class: Hydx Percentage volume dag VER_DAG uur 01
  on property: has as aspect
  max qualified cardinality: 1
subclass of: Restriction
  author at start life: Marinus Vonhof
  date of start life: 2014-09-13
  on class: Hydx Percentage volume dag VER_DAG uur 02
  on property: has as aspect
  max qualified cardinality: 1
subclass of: Restriction
  author at start life: Marinus Vonhof
  date of start life: 2014-09-13
  on class: Hydx Percentage volume dag VER_DAG uur 03
  on property: has as aspect
  max qualified cardinality: 1
subclass of: Restriction
  author at start life: Marinus Vonhof
  date of start life: 2014-09-13
  on class: Hydx Percentage volume dag VER_DAG uur 04
  on property: has as aspect
  max qualified cardinality: 1
subclass of: Restriction
  author at start life: Marinus Vonhof
  date of start life: 2014-09-13
  on class: Hydx Percentage volume dag VER_DAG uur 05
  on property: has as aspect
  max qualified cardinality: 1
subclass of: Restriction
  author at start life: Marinus Vonhof
  date of start life: 2014-09-13
  on class: Hydx Percentage volume dag VER_DAG uur 06
  on property: has as aspect
  max qualified cardinality: 1
subclass of: Restriction
  author at start life: Marinus Vonhof
  date of start life: 2014-09-13
  on class: Hydx Percentage volume dag VER_DAG uur 07
  on property: has as aspect
  max qualified cardinality: 1
subclass of: Restriction
  author at start life: Marinus Vonhof
  date of start life: 2014-09-13
  on class: Hydx Percentage volume dag VER_DAG uur 08
  on property: has as aspect
  max qualified cardinality: 1
subclass of: Restriction
  author at start life: Marinus Vonhof
  date of start life: 2014-09-13
  on class: Hydx Percentage volume dag VER_DAG uur 09
  on property: has as aspect
  max qualified cardinality: 1
subclass of: Restriction
  author at start life: Marinus Vonhof
  date of start life: 2014-09-13
  on class: Hydx Percentage volume dag VER_DAG uur 10
  on property: has as aspect
  max qualified cardinality: 1
subclass of: Restriction
  author at start life: Marinus Vonhof
  date of start life: 2014-09-13
  on class: Hydx Percentage volume dag VER_DAG uur 11
  on property: has as aspect
  max qualified cardinality: 1
subclass of: Restriction
  author at start life: Marinus Vonhof
  date of start life: 2014-09-13
  on class: Hydx Dagvolume
  on property: has as aspect
  qualified cardinality: 1
subclass of: Restriction
  author at start life: Marinus Vonhof
  date of start life: 2014-09-13
  on class: Hydx Identificatie verloop-definitie
  on property: has as aspect
  qualified cardinality: 1
subclass of: Restriction
  author at start life: Marinus Vonhof
  date of start life: 2014-09-13
  on class: Hydx Type verloop
  on property: has as aspect
  qualified cardinality: 1
subclass of: Restriction
  author at start life: Marinus Vonhof
  date of start life: 2014-12-17
  on class: Hydx Percentage volume dag VER_DAG uur 12
  on property: has as aspect
  max qualified cardinality: 1
subclass of: Restriction
  author at start life: Marinus Vonhof
  date of start life: 2014-12-17
  on class: Hydx Percentage volume dag VER_DAG uur 13
  on property: has as aspect
  max qualified cardinality: 1
subclass of: Restriction
  author at start life: Marinus Vonhof
  date of start life: 2014-12-17
  on class: Hydx Percentage volume dag VER_DAG uur 14
  on property: has as aspect
  max qualified cardinality: 1
subclass of: Restriction
  author at start life: Marinus Vonhof
  date of start life: 2014-12-17
  on class: Hydx Percentage volume dag VER_DAG uur 15
  on property: has as aspect
  max qualified cardinality: 1
subclass of: Restriction
  author at start life: Marinus Vonhof
  date of start life: 2014-12-17
  on class: Hydx Percentage volume dag VER_DAG uur 16
  on property: has as aspect
  max qualified cardinality: 1
subclass of: Restriction
  author at start life: Marinus Vonhof
  date of start life: 2014-12-17
  on class: Hydx Percentage volume dag VER_DAG uur 17
  on property: has as aspect
  max qualified cardinality: 1
subclass of: Restriction
  author at start life: Marinus Vonhof
  date of start life: 2014-12-17
  on class: Hydx Percentage volume dag VER_DAG uur 18
  on property: has as aspect
  max qualified cardinality: 1
subclass of: Restriction
  author at start life: Marinus Vonhof
  date of start life: 2014-12-17
  on class: Hydx Percentage volume dag VER_DAG uur 19
  on property: has as aspect
  max qualified cardinality: 1
subclass of: Restriction
  author at start life: Marinus Vonhof
  date of start life: 2014-12-17
  on class: Hydx Percentage volume dag VER_DAG uur 20
  on property: has as aspect
  max qualified cardinality: 1
subclass of: Restriction
  author at start life: Marinus Vonhof
  date of start life: 2014-12-17
  on class: Hydx Percentage volume dag VER_DAG uur 21
  on property: has as aspect
  max qualified cardinality: 1
subclass of: Restriction
  author at start life: Marinus Vonhof
  date of start life: 2014-12-17
  on class: Hydx Percentage volume dag VER_DAG uur 22
  on property: has as aspect
  max qualified cardinality: 1
subclass of: Restriction
  author at start life: Marinus Vonhof
  date of start life: 2014-12-17
  on class: Hydx Percentage volume dag VER_DAG uur 23
  on property: has as aspect
  max qualified cardinality: 1

Hydx Dagvolume
author of change: Marinus Vonhof
date of change: 2017-07-25
definition: Dagvolume
notation: VER_VOL
author at start life: Marinus Vonhof
date of start life: 2014-09-13
units of measurements: m3
comment: [Len=10.3]
scope note: Cof HDX
type: Class
subclass of: Hydx Kolom
subclass of: Restriction
  author at start life: Marinus Vonhof
  date of start life: 2014-09-13
  on class: Hydx Verloop regel
  on property: has as aspect (inverse)
  qualified cardinality: 1
subclass of: Restriction
  on property: has as value
  all values from: decimal

Hydx Datum samenstelling HydX-bestand
author of change: Marinus Vonhof
date of change: 2017-09-08
definition: Datum samenstelling HydX-bestand
notation: ALG_DAT
author at start life: Marinus Vonhof
date of start life: 2014-09-13
units of measurements: yyyy-mm-dd
comment: [Len=8]
scope note: Cof HDX
type: Class
subclass of: Hydx Kolom
subclass of: Restriction
  author of change: Marinus Vonhof
  date of change: 2017-09-08
  author at start life: Marinus Vonhof
  date of start life: 2014-09-13
  on class: Hydx Meta regel
  on property: has as aspect (inverse)
  max qualified cardinality: 1
subclass of: Restriction
  on property: has as value
  all values from: date

Hydx Regel
author of change: Marinus Vonhof
date of change: 2021-09-17
definition: Regel in CSV bestand
author at start life: Marinus Vonhof
date of start life: 2014-02-07
scope note: Cof HDX
type: Class
subclass of: Informatiedrager

Hydx Identificatie knooppunt of verbinding
author of change: Marinus Vonhof
date of change: 2019-03-20
definition: Interne identificatie van de bestandsregel in knooppunt.csv of verbinding.csv. Deze waarde mag slechts 1 keer voorkomen in zowel Knooppunt.csv als Verbinding.csv. De identificatie verzorgt de koppeling tussen Knooppunt.csv of Verbinding.csv met Kunstwerk.csv, BOP.csv, Oppervlak.csv, Debiet.csv.
notation: UNI_IDE
author at start life: Marinus Vonhof
date of start life: 2014-02-07
comment: [Len=10]
scope note: Cof HDX
type: Class
subclass of: Hydx Kolom
subclass of: Restriction
  author of change: Marinus Vonhof
  date of change: 2014-02-08
  author at start life: Marinus Vonhof
  date of start life: 2014-02-07
  on class: Hydx Debiet regel
  on property: has as aspect (inverse)
  qualified cardinality: 1
subclass of: Restriction
  author of change: Marinus Vonhof
  date of change: 2014-02-08
  author at start life: Marinus Vonhof
  date of start life: 2014-02-07
  on class: Hydx Kunstwerk regel
  on property: has as aspect (inverse)
  qualified cardinality: 1
subclass of: Restriction
  author of change: Marinus Vonhof
  date of change: 2014-02-08
  author at start life: Marinus Vonhof
  date of start life: 2014-02-07
  on class: Hydx Oppervlak regel
  on property: has as aspect (inverse)
  qualified cardinality: 1
subclass of: Restriction
  author of change: Marinus Vonhof
  date of change: 2014-02-08
  author at start life: Marinus Vonhof
  date of start life: 2014-02-07
  on class: Hydx Verbinding regel
  on property: has as aspect (inverse)
  qualified cardinality: 1
subclass of: Restriction
  author of change: Marinus Vonhof
  date of change: 2017-05-27
  author at start life: Marinus Vonhof
  date of start life: 2014-02-07
  on class: Hydx Knooppunt regel
  on property: has as aspect (inverse)
  qualified cardinality: 1
subclass of: Restriction
  on property: has as reference (qualification)
  all values from: Identificatie regel

Hydx Toelichting regel
author of change: Marinus Vonhof
date of change: 2017-09-08
definition: Toelichting bij deze regel
notation: ALG_TOE
author at start life: Marinus Vonhof
date of start life: 2014-12-17
comment: [Len=100]
scope note: Cof HDX
type: Class
subclass of: Hydx Kolom
subclass of: Restriction
  author of change: Marinus Vonhof
  date of change: 2014-12-17
  author at start life: Marinus Vonhof
  date of start life: 2014-09-13
  on class: Hydx ItObject regel
  on property: has as aspect (inverse)
  max qualified cardinality: 1
subclass of: Restriction
  author of change: Marinus Vonhof
  date of change: 2014-12-17
  author at start life: Marinus Vonhof
  date of start life: 2014-09-13
  on class: Hydx Knooppunt regel
  on property: has as aspect (inverse)
  max qualified cardinality: 1
subclass of: Restriction
  author of change: Marinus Vonhof
  date of change: 2014-12-17
  author at start life: Marinus Vonhof
  date of start life: 2014-09-13
  on class: Hydx Kunstwerk regel
  on property: has as aspect (inverse)
  max qualified cardinality: 1
subclass of: Restriction
  author of change: Marinus Vonhof
  date of change: 2014-12-17
  author at start life: Marinus Vonhof
  date of start life: 2014-09-13
  on class: Hydx Nwrw regel
  on property: has as aspect (inverse)
  max qualified cardinality: 1
subclass of: Restriction
  author of change: Marinus Vonhof
  date of change: 2014-12-17
  author at start life: Marinus Vonhof
  date of start life: 2014-09-13
  on class: Hydx Oppervlak regel
  on property: has as aspect (inverse)
  max qualified cardinality: 1
subclass of: Restriction
  author of change: Marinus Vonhof
  date of change: 2014-12-17
  author at start life: Marinus Vonhof
  date of start life: 2014-09-13
  on class: Hydx Profiel regel
  on property: has as aspect (inverse)
  max qualified cardinality: 1
subclass of: Restriction
  author of change: Marinus Vonhof
  date of change: 2014-12-17
  author at start life: Marinus Vonhof
  date of start life: 2014-09-13
  on class: Hydx Verbinding regel
  on property: has as aspect (inverse)
  max qualified cardinality: 1
subclass of: Restriction
  author of change: Marinus Vonhof
  date of change: 2014-12-17
  author at start life: Marinus Vonhof
  date of start life: 2014-09-13
  on class: Hydx Verloop regel
  on property: has as aspect (inverse)
  max qualified cardinality: 1
subclass of: Restriction
  author of change: Marinus Vonhof
  date of change: 2014-12-19
  author at start life: Marinus Vonhof
  date of start life: 2014-09-13
  on class: Hydx Debiet regel
  on property: has as aspect (inverse)
  max qualified cardinality: 1
subclass of: Restriction
  author of change: Marinus Vonhof
  date of change: 2017-09-08
  author at start life: Marinus Vonhof
  date of start life: 2014-09-13
  on class: Hydx Meta regel
  on property: has as aspect (inverse)
  max qualified cardinality: 1

Hydx Identificatie verloop-definitie
author of change: Marinus Vonhof
date of change: 2017-08-30
definition: Verloop van debiet. Koppeling tussen Debiet.csv en Verloop.csv.
notation: VER_IDE
author at start life: Marinus Vonhof
date of start life: 2014-09-13
comment: [Len=10] [Verplicht als Debiet/DEB_TYP=VWD]
scope note: Cof HDX
type: Class
subclass of: Hydx Kolom
subclass of: Restriction
  author of change: Marinus Vonhof
  date of change: 2017-08-30
  author at start life: Marinus Vonhof
  date of start life: 2014-09-13
  on class: Hydx Debiet regel
  on property: has as aspect (inverse)
  max qualified cardinality: 1
subclass of: Restriction
  author at start life: Marinus Vonhof
  date of start life: 2014-09-13
  on class: Hydx Verloop regel
  on property: has as aspect (inverse)
  qualified cardinality: 1

Hydx Type debiet
author of change: Marinus Vonhof
date of change: 2017-08-30
definition: Debiet vanuit DWA, HWA en Lozing
notation: DEB_TYP
author at start life: Marinus Vonhof
date of start life: 2014-09-13
comment: [Len=3]
scope note: Cof HDX
type: Class
subclass of: Hydx Kolom
subclass of: Restriction
  author at start life: Marinus Vonhof
  date of start life: 2014-09-13
  on class: Hydx Debiet regel
  on property: has as aspect (inverse)
  qualified cardinality: 1
subclass of: Restriction
  on property: has as reference (qualification)
  all values from: Type debiet

Hydx Debietverschil debiet-verhangrelatie
author of change: Marinus Vonhof
date of change: 2019-02-19
definition: Debiet-verhangrelatie. Kolom bevat debietverschillen bij elk niveauverschil in kolom QDH_NIV. Formaat is tekststring met tabulated waarden [m3/h], decimaalteken toegestaan, gescheiden door spaties
notation: QDH_DEB
author at start life: Marinus Vonhof
date of start life: 2014-09-13
comment: [Len=1000]
scope note: Cof HDX
type: Class
subclass of: Hydx Kolom
subclass of: Restriction
  author at start life: Marinus Vonhof
  date of start life: 2014-09-13
  on class: Hydx Kunstwerk regel
  on property: has as aspect (inverse)
  max qualified cardinality: 1

Hydx Factor afname infiltratiecapaciteit
definition: Factor afname infiltratiecapaciteit
notation: AFV_IFA
author at start life: Marinus Vonhof
date of start life: 2014-09-13
units of measurements: 1/h
comment: [Len=4.2]
scope note: Cof HDX
type: Class
subclass of: Hydx Kolom
subclass of: Restriction
  author at start life: Marinus Vonhof
  date of start life: 2014-09-13
  on class: Hydx Nwrw regel
  on property: has as aspect (inverse)
  qualified cardinality: 1
subclass of: Restriction
  on property: has as value
  all values from: decimal

Hydx Nwrw regel
author at start life: Marinus Vonhof
date of start life: 2014-02-07
scope note: Cof HDX
type: Class
subclass of: Hydx Regel
subclass of: Restriction
  author of change: Marinus Vonhof
  date of change: 2014-12-17
  author at start life: Marinus Vonhof
  date of start life: 2014-09-13
  on class: Hydx Toelichting regel
  on property: has as aspect
  max qualified cardinality: 1
subclass of: Restriction
  author of change: Marinus Vonhof
  date of change: 2017-05-27
  author at start life: Marinus Vonhof
  date of start life: 2017-05-08
  on class: Hydx Identificatie regel afvoerend oppervlak
  on property: has as aspect
  qualified cardinality: 1
subclass of: Restriction
  author of change: Marinus Vonhof
  date of change: 2019-02-19
  author at start life: Marinus Vonhof
  date of start life: 2014-09-13
  on class: Hydx Factor afstromingsvertraging
  on property: has as aspect
  max qualified cardinality: 1
subclass of: Restriction
  author at start life: Marinus Vonhof
  date of start life: 2014-02-07
  on class: Hydx Nwrw bestand
  on property: has as part (inverse)
  qualified cardinality: 1
subclass of: Restriction
  author at start life: Marinus Vonhof
  date of start life: 2014-09-13
  on class: Hydx Factor afname infiltratiecapaciteit
  on property: has as aspect
  qualified cardinality: 1
subclass of: Restriction
  author at start life: Marinus Vonhof
  date of start life: 2014-09-13
  on class: Hydx Factor herstel infiltratiecapaciteit
  on property: has as aspect
  qualified cardinality: 1
subclass of: Restriction
  author at start life: Marinus Vonhof
  date of start life: 2014-09-13
  on class: Hydx Maximum infiltratiecapaciteit
  on property: has as aspect
  qualified cardinality: 1
subclass of: Restriction
  author at start life: Marinus Vonhof
  date of start life: 2014-09-13
  on class: Hydx Minimum infiltratiecapaciteit
  on property: has as aspect
  qualified cardinality: 1
subclass of: Restriction
  author at start life: Marinus Vonhof
  date of start life: 2014-09-13
  on class: Hydx Oppervlakteberging
  on property: has as aspect
  qualified cardinality: 1

Hydx Factor afstromingsvertraging
author of change: Marinus Vonhof
date of change: 2019-02-19
definition: Factor afstromingsvertraging
notation: AFV_AFS
author at start life: Marinus Vonhof
date of start life: 2014-09-13
units of measurements: 1/min
comment: [Len=4.2]
scope note: Cof HDX
type: Class
subclass of: Hydx Kolom
subclass of: Restriction
  author of change: Marinus Vonhof
  date of change: 2019-02-19
  author at start life: Marinus Vonhof
  date of start life: 2014-09-13
  on class: Hydx Nwrw regel
  on property: has as aspect (inverse)
  max qualified cardinality: 1
subclass of: Restriction
  on property: has as value
  all values from: decimal

Hydx Factor herstel infiltratiecapaciteit
author of change: Marinus Vonhof
date of change: 2017-05-08
definition: Factor herstel infiltratiecapaciteit
notation: AFV_IFH
author at start life: Marinus Vonhof
date of start life: 2014-09-13
units of measurements: 1/h
comment: [Len=4.2]
scope note: Cof HDX
type: Class
subclass of: Hydx Kolom
subclass of: Restriction
  author at start life: Marinus Vonhof
  date of start life: 2014-09-13
  on class: Hydx Nwrw regel
  on property: has as aspect (inverse)
  qualified cardinality: 1
subclass of: Restriction
  on property: has as value
  all values from: decimal

Hydx Grondwaterstand
author of change: Marinus Vonhof
date of change: 2017-05-11
definition: Grondwaterstand t.o.v. NAP
notation: STD_GRW
author at start life: Marinus Vonhof
date of start life: 2014-09-13
units of measurements: m
comment: [Len=8.2]
scope note: Cof HDX
type: Class
subclass of: Hydx Kolom
subclass of: Restriction
  author at start life: Marinus Vonhof
  date of start life: 2014-09-13
  on class: Hydx ItObject regel
  on property: has as aspect (inverse)
  qualified cardinality: 1
subclass of: Restriction
  on property: has as reference (qualification)
  all values from: Grondwaterniveau
subclass of: Restriction
  on property: has as value
  all values from: decimal

Hydx ItObject regel
author of change: Marinus Vonhof
date of change: 2017-07-25
author at start life: Marinus Vonhof
date of start life: 2014-02-07
scope note: Cof HDX
type: Class
subclass of: Hydx Regel
subclass of: Restriction
  author of change: Marinus Vonhof
  date of change: 2014-12-17
  author at start life: Marinus Vonhof
  date of start life: 2014-09-13
  on class: Hydx Toelichting regel
  on property: has as aspect
  max qualified cardinality: 1
subclass of: Restriction
  author of change: Marinus Vonhof
  date of change: 2017-07-25
  author at start life: Marinus Vonhof
  date of start life: 2014-02-07
  on class: Hydx ItObject bestand
  on property: has as part (inverse)
  qualified cardinality: 1
subclass of: Restriction
  author of change: Marinus Vonhof
  date of change: 2019-02-19
  author at start life: Marinus Vonhof
  date of start life: 2014-09-13
  on class: Hydx K-waarde cunet
  on property: has as aspect
  qualified cardinality: 1
subclass of: Restriction
  author at start life: Marinus Vonhof
  date of start life: 2014-09-13
  on class: Hydx Grondwaterstand
  on property: has as aspect
  qualified cardinality: 1
subclass of: Restriction
  author at start life: Marinus Vonhof
  date of start life: 2014-09-13
  on class: Hydx Identificatie definitie IT-object
  on property: has as aspect
  qualified cardinality: 1
subclass of: Restriction
  author at start life: Marinus Vonhof
  date of start life: 2014-09-13
  on class: Hydx K-waarde cunet - grondwater
  on property: has as aspect
  qualified cardinality: 1
subclass of: Restriction
  author at start life: Marinus Vonhof
  date of start life: 2014-09-13
  on class: Hydx K-waarde riolering - cunet
  on property: has as aspect
  qualified cardinality: 1

Hydx Hoogte profiel
author of change: Marinus Vonhof
date of change: 2019-09-03
definition: Inwendige hoogte profiel. Voor kunsstof leidingen is omrekening op basis van Wanddikte of SDR-waarde niet aan de orde. Dat geldt alleen voor ronde buizen.
notation: PRO_HGT
author at start life: Marinus Vonhof
date of start life: 2014-09-13
units of measurements: mm
comment: [Len=8] [Verplicht als Profiel/PRO_VRM=EIV,EIG,RHK] Alleen informatief voor overige profielen
scope note: Cof HDX
type: Class
subclass of: Hydx Kolom
subclass of: Restriction
  author at start life: Marinus Vonhof
  date of start life: 2014-09-13
  on class: Hydx Profiel regel
  on property: has as aspect (inverse)
  max qualified cardinality: 1
subclass of: Restriction
  on property: has as reference (qualification)
  all values from: Hoogte leiding
subclass of: Restriction
  on property: has as value
  all values from: integer

Hydx Hoogtewaarden profiel
author of change: Marinus Vonhof
date of change: 2019-07-11
definition: Kolom bevat hoogtewaarden bij elke breedtewaarde in kolom TAB_BRE. Geldt alleen voor speciale profieldefinities. Formaat is tekststring met tabulated of XY waarden [m], decimaalteken toegestaan, gescheiden door spaties. Bij de profielvormen TAB, HEU, MVR, UVR, OVA gelden tabulated waarden, bij de profielvorm YZP gelden YZ waarden. Bij de profielvorm TPZ gelden bij open leidingen YZ waarden en bij gesloten leidingen tabulated waarden.
notation: TAB_HGT
author at start life: Marinus Vonhof
date of start life: 2019-02-18
comment: [Len=1000] [Verplicht als Profiel/PRO_VRM=TAB,YZP,HEU,MVR,UVR,TPZ,OVA]
scope note: Cof HDX
type: Class
subclass of: Hydx Kolom
subclass of: Restriction
  author at start life: Marinus Vonhof
  date of start life: 2019-02-18
  on class: Hydx Profiel regel
  on property: has as aspect (inverse)
  max qualified cardinality: 1

Hydx Identificatie compartiment
author of change: Marinus Vonhof
date of change: 2017-08-30
definition: Identificatie (naam, nummer, code) van het compartiment
notation: CMP_IDE
author at start life: Marinus Vonhof
date of start life: 2014-09-13
comment: [Len=10] [Verplicht als Knooppunt/KNP_TYP=CMP]
scope note: Cof HDX
type: Class
subclass of: Hydx Kolom
subclass of: Restriction
  author of change: Marinus Vonhof
  date of change: 2017-07-26
  author at start life: Marinus Vonhof
  date of start life: 2014-09-13
  on class: Hydx Knooppunt regel
  on property: has as aspect (inverse)
  max qualified cardinality: 1
subclass of: Restriction
  on property: has as reference (qualification)
  all values from: Compartiment

Hydx Identificatie definitie IT-object
author of change: Marinus Vonhof
date of change: 2017-07-25
definition: Definitie infiltratiekarakteristieken. Koppeling tussen ItObject.csv en Verbinding.csv of Knooppunt.csv
notation: ITO_IDE
author at start life: Marinus Vonhof
date of start life: 2014-09-13
comment: [Len=10] [Verplicht als Verbinding/VRB_TYP=ITR, Knooppunt/KNP_TYP=ITP]
scope note: Cof HDX
type: Class
subclass of: Hydx Kolom
subclass of: Restriction
  author of change: Marinus Vonhof
  date of change: 2017-07-25
  author at start life: Marinus Vonhof
  date of start life: 2014-09-13
  on class: Hydx Verbinding regel
  on property: has as aspect (inverse)
  max qualified cardinality: 1
subclass of: Restriction
  author of change: Marinus Vonhof
  date of change: 2017-08-30
  author at start life: Marinus Vonhof
  date of start life: 2014-09-13
  on class: Hydx Knooppunt regel
  on property: has as aspect (inverse)
  max qualified cardinality: 1
subclass of: Restriction
  author at start life: Marinus Vonhof
  date of start life: 2014-09-13
  on class: Hydx ItObject regel
  on property: has as aspect (inverse)
  qualified cardinality: 1

Hydx Identificatie knooppunt 1
author of change: Marinus Vonhof
date of change: 2017-12-07
definition: Identificatie knooppunt 1. Verwijzing naar UNI_IDE in Knooppunt.csv
notation: KN1_IDE
author at start life: Marinus Vonhof
date of start life: 2014-09-13
comment: [Len=10]
scope note: Cof HDX
type: Class
subclass of: Hydx Kolom
subclass of: Restriction
  author of change: Marinus Vonhof
  date of change: 2017-09-09
  author at start life: Marinus Vonhof
  date of start life: 2014-09-13
  on class: Hydx Verbinding regel
  on property: has as aspect (inverse)
  qualified cardinality: 1
subclass of: Restriction
  on property: has as reference (qualification)
  all values from: Hydx Identificatie knooppunt of verbinding

Hydx Identificatie knooppunt 2
author of change: Marinus Vonhof
date of change: 2017-12-07
definition: Identificatie knooppunt 2. Verwijzing naar UNI_IDE in Knooppunt.csv
notation: KN2_IDE
author at start life: Marinus Vonhof
date of start life: 2014-09-13
comment: [Len=10]
scope note: Cof HDX
type: Class
subclass of: Hydx Kolom
subclass of: Restriction
  author of change: Marinus Vonhof
  date of change: 2017-09-08
  author at start life: Marinus Vonhof
  date of start life: 2014-09-13
  on class: Hydx Verbinding regel
  on property: has as aspect (inverse)
  qualified cardinality: 1
subclass of: Restriction
  on property: has as reference (qualification)
  all values from: Hydx Identificatie knooppunt of verbinding

Identificatie regel
author of change: Marinus Vonhof
date of change: 2017-08-30
definition: Unieke identificatie van de bestandsregel
author at start life: Marinus Vonhof
date of start life: 2017-05-27
comment: [is aspect]
scope note: Cof HDX
type: Class
subclass of: Unieke identificatie

Hydx Identificatie leiding
author of change: Marinus Vonhof
date of change: 2019-03-20
definition: Identificatie (naam, nummer, code) van de verbinding
notation: LEI_IDE
author at start life: Marinus Vonhof
date of start life: 2017-09-08
comment: [Len=10]
scope note: Cof HDX
type: Class
subclass of: Hydx Kolom
subclass of: Restriction
  author at start life: Marinus Vonhof
  date of start life: 2017-09-08
  on class: Hydx Verbinding regel
  on property: has as aspect (inverse)
  max qualified cardinality: 1
subclass of: Restriction
  on property: has as reference (qualification)
  all values from: Leiding

Hydx Identificatie profieldefinitie
author of change: Marinus Vonhof
date of change: 2017-07-25
definition: Profieldefinitie. Koppeling tussen Profiel.csv en Verbinding.csv
notation: PRO_IDE
author at start life: Marinus Vonhof
date of start life: 2014-09-13
comment: [Len=10] [Verplicht als Verbinding/VRB_TYP=GSL,OPL,ITR,DRL]
scope note: Cof HDX
type: Class
subclass of: Hydx Kolom
subclass of: Restriction
  author of change: Marinus Vonhof
  date of change: 2017-05-27
  author at start life: Marinus Vonhof
  date of start life: 2014-09-13
  on class: Hydx Verbinding regel
  on property: has as aspect (inverse)
  max qualified cardinality: 1
subclass of: Restriction
  author of change: Marinus Vonhof
  date of change: 2017-05-27
  author at start life: Marinus Vonhof
  date of start life: 2014-09-13
  on class: Hydx Profiel regel
  on property: has as aspect (inverse)
  qualified cardinality: 1

Hydx Identificatie regel afvoerend oppervlak
author of change: Marinus Vonhof
date of change: 2017-09-08
definition: Gedetailleerde neerslag-afvoer per type afvoerend oppervlak. Koppeling tussen Oppervlak.csv en het genoemde bestand bij Oppervlak/AFV_DEF
notation: AFV_IDE
author at start life: Marinus Vonhof
date of start life: 2017-05-08
comment: [Len=10]
scope note: Cof HDX
type: Class
subclass of: Hydx Kolom
subclass of: Restriction
  author of change: Marinus Vonhof
  date of change: 2017-05-27
  author at start life: Marinus Vonhof
  date of start life: 2017-05-08
  on class: Hydx Nwrw regel
  on property: has as aspect (inverse)
  qualified cardinality: 1
subclass of: Restriction
  author at start life: Marinus Vonhof
  date of start life: 2017-05-08
  on class: Hydx Oppervlak regel
  on property: has as aspect (inverse)
  qualified cardinality: 1
subclass of: Restriction
  on property: has as reference (qualification)
  all values from: Type afvoerend oppervlak

Type afvoerend oppervlak
author of change: Marinus Vonhof
date of change: 2019-02-18
definition: Identificatie type neerslag-afvoer. Identificeert de regel in definitiebestand neerslag-afvoer (bijvoorbeeld nwrw.csv)
author at start life: Marinus Vonhof
date of start life: 2017-07-26
comment: [is aspect]
scope note: Cof HDX
type: Class
subclass of: Unieke identificatie
subclass of: Restriction
  on property: has as reference (qualification)
  all values from: Type afvoerend oppervlak (coll)

Hydx Identificatie rioolput
author of change: Marinus Vonhof
date of change: 2017-09-08
definition: Identificatie (naam, nummer, code) van de put of het bouwwerk
notation: PUT_IDE
author at start life: Marinus Vonhof
date of start life: 2014-09-13
comment: [Len=30]
scope note: Cof HDX
type: Class
subclass of: Hydx Kolom
subclass of: Restriction
  author of change: Marinus Vonhof
  date of change: 2017-09-08
  author at start life: Marinus Vonhof
  date of start life: 2014-09-13
  on class: Hydx Knooppunt regel
  on property: has as aspect (inverse)
  qualified cardinality: 1
subclass of: Restriction
  on property: has as reference (qualification)
  all values from: Rioolput

Hydx Identificatie rioolstelsel
author of change: Marinus Vonhof
date of change: 2017-08-30
definition: Identificatie (naam, nummer, code) van het rioolstelsel
notation: RST_IDE
author at start life: Marinus Vonhof
date of start life: 2014-09-13
comment: [Len=30]
scope note: Cof HDX
type: Class
subclass of: Hydx Kolom
subclass of: Restriction
  author of change: Marinus Vonhof
  date of change: 2017-08-30
  author at start life: Marinus Vonhof
  date of start life: 2014-09-13
  on class: Hydx Knooppunt regel
  on property: has as aspect (inverse)
  max qualified cardinality: 1
subclass of: Restriction
  on property: has as reference (qualification)
  all values from: Stelsel

Hydx Initiële waterstand
author of change: Marinus Vonhof
date of change: 2019-03-20
definition: Initiele waterstand t.o.v. NAP
notation: INI_NIV
author at start life: Marinus Vonhof
date of start life: 2014-09-13
units of measurements: m
comment: [Len=8.2]
scope note: Cof HDX
type: Class
subclass of: Hydx Kolom
subclass of: Restriction
  author at start life: Marinus Vonhof
  date of start life: 2014-09-13
  on class: Hydx Knooppunt regel
  on property: has as aspect (inverse)
  max qualified cardinality: 1
subclass of: Restriction
  author at start life: Marinus Vonhof
  date of start life: 2014-10-19
  on class: Hydx Verbinding regel
  on property: has as aspect (inverse)
  max qualified cardinality: 1
subclass of: Restriction
  on property: has as value
  all values from: decimal

Hydx K-waarde cunet
author of change: Marinus Vonhof
date of change: 2019-02-19
definition: K-waarde cunet (porositeit)
notation: KWA_CUN
author at start life: Marinus Vonhof
date of start life: 2014-09-13
units of measurements: m/dag
comment: [Len=8.2] Eenheid m/dag = m/etmaal
scope note: Cof HDX
type: Class
subclass of: Hydx Kolom
subclass of: Restriction
  author of change: Marinus Vonhof
  date of change: 2019-02-19
  author at start life: Marinus Vonhof
  date of start life: 2014-09-13
  on class: Hydx ItObject regel
  on property: has as aspect (inverse)
  qualified cardinality: 1
subclass of: Restriction
  on property: has as value
  all values from: decimal

Hydx K-waarde cunet - grondwater
definition: K-waarde cunet - grondwater
notation: KWA_GRW
author at start life: Marinus Vonhof
date of start life: 2014-09-13
units of measurements: m/dag
comment: [Len=8.2] Eenheid m/dag = m/etmaal
scope note: Cof HDX
type: Class
subclass of: Hydx Kolom
subclass of: Restriction
  author at start life: Marinus Vonhof
  date of start life: 2014-09-13
  on class: Hydx ItObject regel
  on property: has as aspect (inverse)
  qualified cardinality: 1
subclass of: Restriction
  on property: has as value
  all values from: decimal

Hydx K-waarde riolering - cunet
definition: K-waarde riolering - cunet
notation: KWA_RIO
author at start life: Marinus Vonhof
date of start life: 2014-09-13
units of measurements: m/dag
comment: [Len=8.2] Eenheid m/dag = m/etmaal
scope note: Cof HDX
type: Class
subclass of: Hydx Kolom
subclass of: Restriction
  author at start life: Marinus Vonhof
  date of start life: 2014-09-13
  on class: Hydx ItObject regel
  on property: has as aspect (inverse)
  qualified cardinality: 1
subclass of: Restriction
  on property: has as value
  all values from: decimal

Hydx Status object
definition: Status van het object
notation: STA_OBJ
author at start life: Marinus Vonhof
date of start life: 2014-12-17
comment: [Len=3]
scope note: Cof HDX
type: Class
subclass of: Hydx Kolom
subclass of: Restriction
  author of change: Marinus Vonhof
  date of change: 2017-05-18
  author at start life: Marinus Vonhof
  date of start life: 2014-09-13
  on class: Hydx Knooppunt regel
  on property: has as aspect (inverse)
  max qualified cardinality: 1
subclass of: Restriction
  author at start life: Marinus Vonhof
  date of start life: 2014-09-13
  on class: Hydx Verbinding regel
  on property: has as aspect (inverse)
  max qualified cardinality: 1
subclass of: Restriction
  on property: has as reference (qualification)
  all values from: Status object

Hydx Materiaal put
author of change: Marinus Vonhof
date of change: 2017-05-11
definition: Materiaal put
notation: KNP_MAT
author at start life: Marinus Vonhof
date of start life: 2014-09-13
comment: [Len=3]
scope note: Cof HDX
type: Class
subclass of: Hydx Kolom
subclass of: Restriction
  author of change: Marinus Vonhof
  date of change: 2018-04-30
  author at start life: Marinus Vonhof
  date of start life: 2014-09-13
  on class: Hydx Knooppunt regel
  on property: has as aspect (inverse)
  max qualified cardinality: 1
subclass of: Restriction
  on property: has as reference (qualification)
  all values from: Materiaal (hydx)

Hydx Lengte putbodem
definition: Lengte putbodem
notation: KNP_LEN
author at start life: Marinus Vonhof
date of start life: 2014-09-13
units of measurements: mm
comment: [Len=8] [Verplicht als Knooppunt/KNP_VRM=RHK]
scope note: Cof HDX
type: Class
subclass of: Hydx Kolom
subclass of: Restriction
  author at start life: Marinus Vonhof
  date of start life: 2014-09-13
  on class: Hydx Knooppunt regel
  on property: has as aspect (inverse)
  max qualified cardinality: 1
subclass of: Restriction
  on property: has as reference (qualification)
  all values from: Lengte put
subclass of: Restriction
  on property: has as value
  all values from: integer

Hydx Oppervlak water op straat
definition: Oppervlak water op straat
notation: WOS_OPP
author at start life: Marinus Vonhof
date of start life: 2014-09-13
units of measurements: m2
comment: [Len=8.2] [Verplicht als Knooppunt/MVD_SCH=RES]
scope note: Cof HDX
type: Class
subclass of: Hydx Kolom
subclass of: Restriction
  author at start life: Marinus Vonhof
  date of start life: 2014-09-13
  on class: Hydx Knooppunt regel
  on property: has as aspect (inverse)
  max qualified cardinality: 1
subclass of: Restriction
  on property: has as reference (qualification)
  all values from: Bergend oppervlak
subclass of: Restriction
  on property: has as value
  all values from: decimal

Hydx Maaiveldschematisering
definition: Type maaiveldschematisering
notation: MVD_SCH
author at start life: Marinus Vonhof
date of start life: 2014-09-13
comment: [Len=3]
scope note: Cof HDX
type: Class
subclass of: Hydx Kolom
subclass of: Restriction
  author at start life: Marinus Vonhof
  date of start life: 2014-09-13
  on class: Hydx Knooppunt regel
  on property: has as aspect (inverse)
  qualified cardinality: 1
subclass of: Restriction
  on property: has as reference (qualification)
  all values from: Maaiveldschematisering

Hydx Niveau binnenonderkant put
author of change: Marinus Vonhof
date of change: 2017-05-11
definition: Niveau binnenonderkant put t.o.v. NAP
notation: KNP_BOK
author at start life: Marinus Vonhof
date of start life: 2014-09-13
units of measurements: m
comment: [Len=8.2]
scope note: Cof HDX
type: Class
subclass of: Hydx Kolom
subclass of: Restriction
  author at start life: Marinus Vonhof
  date of start life: 2014-09-13
  on class: Hydx Knooppunt regel
  on property: has as aspect (inverse)
  qualified cardinality: 1
subclass of: Restriction
  on property: has as reference (qualification)
  all values from: Z-coördinaat
subclass of: Restriction
  on property: has as value
  all values from: decimal

Hydx Niveau maaiveld
author of change: Marinus Vonhof
date of change: 2017-05-11
definition: Niveau maaiveld t.o.v. NAP
notation: MVD_NIV
author at start life: Marinus Vonhof
date of start life: 2014-09-13
units of measurements: m
comment: [Len=8.2]
scope note: Cof HDX
type: Class
subclass of: Hydx Kolom
subclass of: Restriction
  author at start life: Marinus Vonhof
  date of start life: 2014-09-13
  on class: Hydx Knooppunt regel
  on property: has as aspect (inverse)
  qualified cardinality: 1
subclass of: Restriction
  on property: has as reference (qualification)
  all values from: Maaiveldhoogte
subclass of: Restriction
  on property: has as value
  all values from: decimal

Hydx Vorm put
author of change: Marinus Vonhof
date of change: 2017-05-11
definition: Vorm put
notation: KNP_VRM
author at start life: Marinus Vonhof
date of start life: 2014-09-13
comment: [Len=3]
scope note: Cof HDX
type: Class
subclass of: Hydx Kolom
subclass of: Restriction
  author at start life: Marinus Vonhof
  date of start life: 2014-09-13
  on class: Hydx Knooppunt regel
  on property: has as aspect (inverse)
  qualified cardinality: 1
subclass of: Restriction
  on property: has as reference (qualification)
  all values from: Vorm put

Hydx X-coördinaat
author of change: Marinus Vonhof
date of change: 2017-09-08
definition: X-coordinaat knooppunt. Conform coordinatenstelsel EPSG:7415 (x/y conform EPSG:28992 (=RD), z conform EPSG:5709 (=NAP).
notation: KNP_XCO
author at start life: Marinus Vonhof
date of start life: 2014-09-13
units of measurements: m
comment: [Len=12.2]
scope note: Cof HDX
type: Class
subclass of: Hydx Kolom
subclass of: Restriction
  author at start life: Marinus Vonhof
  date of start life: 2014-09-13
  on class: Hydx Knooppunt regel
  on property: has as aspect (inverse)
  qualified cardinality: 1
subclass of: Restriction
  on property: has as reference (qualification)
  all values from: X-coördinaat
subclass of: Restriction
  on property: has as value
  all values from: decimal

Hydx Y-coördinaat
author of change: Marinus Vonhof
date of change: 2017-09-08
definition: Y-coordinaat knooppunt. Conform coordinatenstelsel EPSG:7415 (x/y conform EPSG:28992 (=RD), z conform EPSG:5709 (=NAP).
notation: KNP_YCO
author at start life: Marinus Vonhof
date of start life: 2014-09-13
units of measurements: m
comment: [Len=12.2]
scope note: Cof HDX
type: Class
subclass of: Hydx Kolom
subclass of: Restriction
  author at start life: Marinus Vonhof
  date of start life: 2014-09-13
  on class: Hydx Knooppunt regel
  on property: has as aspect (inverse)
  qualified cardinality: 1
subclass of: Restriction
  on property: has as reference (qualification)
  all values from: Y-coördinaat
subclass of: Restriction
  on property: has as value
  all values from: decimal

Hydx Type knooppunt
definition: Type knooppunt
notation: KNP_TYP
author at start life: Marinus Vonhof
date of start life: 2014-12-17
comment: [Len=3]
scope note: Cof HDX
type: Class
subclass of: Hydx Kolom
subclass of: Restriction
  author at start life: Marinus Vonhof
  date of start life: 2014-12-17
  on class: Hydx Knooppunt regel
  on property: has as aspect (inverse)
  qualified cardinality: 1
subclass of: Restriction
  on property: has as reference (qualification)
  all values from: Type knooppunt

Hydx Pompcapaciteit
author of change: Marinus Vonhof
date of change: 2017-07-25
definition: Capaciteit van de individuele pomp
notation: PMP_CAP
author at start life: Marinus Vonhof
date of start life: 2014-09-13
units of measurements: m3/h
comment: [Len=8.2] [Verplicht als Kunstwerk/KWK_TYP=PMP] [T/m versie 1.5: omrekenen van l/s naar m3/h]
scope note: Cof HDX
type: Class
subclass of: Hydx Kolom
subclass of: Restriction
  author of change: Marinus Vonhof
  date of change: 2014-12-17
  author at start life: Marinus Vonhof
  date of start life: 2014-09-13
  on class: Hydx Kunstwerk regel
  on property: has as aspect (inverse)
  max qualified cardinality: 1
subclass of: Restriction
  on property: has as reference (qualification)
  all values from: Pompcapaciteit
subclass of: Restriction
  on property: has as value
  all values from: decimal

Hydx Maximale capaciteit doorlaat
definition: Maximale capaciteit doorlaat
notation: DRL_CAP
author at start life: Marinus Vonhof
date of start life: 2014-09-13
units of measurements: m3/h
comment: [Len=8.2] [T/m versie 1.5: omrekenen van l/s naar m3/h]
scope note: Cof HDX
type: Class
subclass of: Hydx Kolom
subclass of: Restriction
  author at start life: Marinus Vonhof
  date of start life: 2014-09-13
  on class: Hydx Kunstwerk regel
  on property: has as aspect (inverse)
  max qualified cardinality: 1
subclass of: Restriction
  on property: has as reference (qualification)
  all values from: Maximale capaciteit doorlaat
subclass of: Restriction
  on property: has as value
  all values from: decimal

Hydx Niveau binnenonderkant profiel
author of change: Marinus Vonhof
date of change: 2017-05-11
definition: Niveau binnenonderkant profiel t.o.v. NAP
notation: PRO_BOK
author at start life: Marinus Vonhof
date of start life: 2014-09-13
units of measurements: m
comment: [Len=8.2] [Verplicht als Kunstwerk/KWK_TYP=DRL]
scope note: Cof HDX
type: Class
subclass of: Hydx Kolom
subclass of: Restriction
  author at start life: Marinus Vonhof
  date of start life: 2014-09-13
  on class: Hydx Kunstwerk regel
  on property: has as aspect (inverse)
  max qualified cardinality: 1
subclass of: Restriction
  on property: has as reference (qualification)
  all values from: Doorlaatniveau
subclass of: Restriction
  on property: has as value
  all values from: decimal

Hydx Niveau overstortdrempel
author of change: Marinus Vonhof
date of change: 2019-03-20
definition: Niveau overstortdrempel of stuwmuur t.o.v. NAP
notation: OVS_NIV
author at start life: Marinus Vonhof
date of start life: 2014-09-13
units of measurements: m
comment: [Len=8.2] [Verplicht als Kunstwerk/KWK_TYP=OVS]
scope note: Cof HDX
type: Class
subclass of: Hydx Kolom
subclass of: Restriction
  author at start life: Marinus Vonhof
  date of start life: 2014-09-13
  on class: Hydx Kunstwerk regel
  on property: has as aspect (inverse)
  max qualified cardinality: 1
subclass of: Restriction
  on property: has as reference (qualification)
  all values from: Drempelniveau
subclass of: Restriction
  on property: has as value
  all values from: decimal

Hydx Niveauverschil debiet-verhangrelatie
author of change: Marinus Vonhof
date of change: 2019-02-19
definition: Debiet-verhangrelatie. Kolom bevat niveauverschillen bij elk debietverschil in kolom QDH_DEB. Formaat is tekststring met tabulated waarden [m t.o.v. NAP], decimaalteken toegestaan, gescheiden door spaties
notation: QDH_NIV
author at start life: Marinus Vonhof
date of start life: 2014-09-13
comment: [Len=1000]
scope note: Cof HDX
type: Class
subclass of: Hydx Kolom
subclass of: Restriction
  author at start life: Marinus Vonhof
  date of start life: 2014-09-13
  on class: Hydx Kunstwerk regel
  on property: has as aspect (inverse)
  max qualified cardinality: 1

Hydx Type kunstwerk
author of change: Marinus Vonhof
date of change: 2017-08-30
definition: Type hydraulisch component in het kunstwerk
notation: KWK_TYP
author at start life: Marinus Vonhof
date of start life: 2014-09-13
comment: [Len=3]
scope note: Cof HDX
type: Class
subclass of: Hydx Kolom
subclass of: Restriction
  author at start life: Marinus Vonhof
  date of start life: 2014-09-13
  on class: Hydx Kunstwerk regel
  on property: has as aspect (inverse)
  qualified cardinality: 1
subclass of: Restriction
  on property: has as reference (qualification)
  all values from: Type kunstwerk

Hydx Vrije overstorthoogte
author of change: Marinus Vonhof
date of change: 2019-03-20
definition: De vrije ruimte boven de overstortdrempel of stuwmuur
notation: OVS_VOH
author at start life: Marinus Vonhof
date of start life: 2017-12-07
units of measurements: mm
comment: [Len=8]
scope note: Cof HDX
type: Class
subclass of: Hydx Kolom
subclass of: Restriction
  author at start life: Marinus Vonhof
  date of start life: 2017-12-07
  on class: Hydx Kunstwerk regel
  on property: has as aspect (inverse)
  max qualified cardinality: 1
subclass of: Restriction
  on property: has as reference (qualification)
  all values from: Vrije overstorthoogte
subclass of: Restriction
  on property: has as value
  all values from: integer

Lengte put
author of change: Marinus Vonhof
author of change: Johan Post
date of change: 2021-08-06
date of change: 2026-05-01
definition: De inwendige lengte (horizontaal, uit het bovenaanzicht). Indien aanwezig de lengte van de onderbak - zie afbeelding dc (bron EN13508-2)
author at start life: Marinus Vonhof
date of start life: 2016-08-05
units of measurements: mm
validity context: 15d
comment: Intrinsiek aspect
comment: [is aspect]
scope note: Cof TOP
type: Class
subclass of: Lengte
subclass of: Restriction
  author of change: Marinus Vonhof
  date of change: 2014-08-01
  author at start life: Finy Teitsma (Oranjewoud)
  date of start life: 2006-02-25
  validity context: *t
  on class: Put
  on property: has as aspect (inverse)
  max qualified cardinality: 1
subclass of: Restriction
  on property: has as value
  all values from: Lengte put (datatype)

Hydx Lengte verbinding
author of change: Marinus Vonhof
date of change: 2017-09-08
definition: Lengte van de leiding of de lengte die via het kunstwerk overbrugd wordt (bijvoorbeeld de lengte van de persleiding tussen pomp en lozingspunt)
notation: VRB_LEN
author at start life: Marinus Vonhof
date of start life: 2014-09-13
units of measurements: m
comment: [Len=8.2] [Verplicht als Verbinding/VRB_TYP=GSL,OPL,ITR,PMP]
scope note: Cof HDX
type: Class
subclass of: Hydx Kolom
subclass of: Restriction
  author of change: Marinus Vonhof
  date of change: 2017-09-15
  author at start life: Marinus Vonhof
  date of start life: 2014-09-13
  on class: Hydx Verbinding regel
  on property: has as aspect (inverse)
  max qualified cardinality: 1
subclass of: Restriction
  on property: has as reference (qualification)
  all values from: Lengte leiding
subclass of: Restriction
  on property: has as value
  all values from: decimal

Lengte leiding
author of change: Marinus Vonhof
date of change: 2015-05-29
author at start life: Nic Roest (Idoro)
date of start life: 2006-02-21
units of measurements: m
comment: Intrinsiek aspect
comment: [is aspect]
scope note: Cof TOP
type: Class
subclass of: Lengte
subclass of: Restriction
  author of change: Marinus Vonhof
  date of change: 2015-08-24
  author at start life: Finy Teitsma (Oranjewoud)
  date of start life: 2006-02-25
  validity context: *t
  on class: Leiding
  on property: has as aspect (inverse)
  max qualified cardinality: 1
subclass of: Restriction
  date of change: 2015-11-03
  author at start life: Marinus Vonhof
  date of start life: 2013-03-29
  on class: Inwinning
  on property: has as aspect
  max qualified cardinality: 1
subclass of: Restriction
  on property: has as value
  all values from: Lengte leiding (datatype)

Maaiveldschematisering
author of change: Marinus Vonhof
date of change: 2014-12-19
author at start life: Marinus Vonhof
date of start life: 2014-12-17
see also: [HYD] Aanduiding schematisering maaiveld bij uitstroom van water via de putdeksel
comment: [is aspect]
scope note: Cof HYD
type: Class
subclass of: Kenmerk
subclass of: Restriction
  author of change: Marinus Vonhof
  date of change: 2018-05-03
  author at start life: Marinus Vonhof
  date of start life: 2011-12-15
  validity context: 5t 11t
  on class: Rioolput
  on property: has as aspect (inverse)
  max qualified cardinality: 1
subclass of: Restriction
  on property: has as reference (qualification)
  all values from: Maaiveldschematisering (coll)

Hydx Materiaal
definition: Materiaal profiel
notation: PRO_MAT
author at start life: Marinus Vonhof
date of start life: 2014-09-13
comment: [Len=3] [Verplicht als Verbinding/VRB_TYP=GSL,ITR]
scope note: Cof HDX
type: Class
subclass of: Hydx Kolom
subclass of: Restriction
  author at start life: Marinus Vonhof
  date of start life: 2014-09-13
  on class: Hydx Profiel regel
  on property: has as aspect (inverse)
  max qualified cardinality: 1
subclass of: Restriction
  on property: has as reference (qualification)
  all values from: Materiaal (hydx)

Materiaal (hydx)
author of change: Marinus Vonhof
date of change: 2014-12-17
author at start life: Marinus Vonhof
date of start life: 2014-12-17
see also: [HYD] Aanduiding materiaal van de leiding, koppeling met PRO_KNW
comment: [is aspect]
scope note: Cof HDX
type: Class
subclass of: Kenmerk
subclass of: Restriction
  on property: has as reference (qualification)
  all values from: Materiaal (hydx) (coll)

Hydx Maximum infiltratiecapaciteit
definition: Maximum infiltratiecapaciteit
notation: AFV_IFX
author at start life: Marinus Vonhof
date of start life: 2014-09-13
units of measurements: mm/h
comment: [Len=3] [afronden van decimal naar integer]
scope note: Cof HDX
type: Class
subclass of: Hydx Kolom
subclass of: Restriction
  author at start life: Marinus Vonhof
  date of start life: 2014-09-13
  on class: Hydx Nwrw regel
  on property: has as aspect (inverse)
  qualified cardinality: 1
subclass of: Restriction
  on property: has as value
  all values from: decimal

HydX-versie
author of change: Marinus Vonhof
date of change: 2026-08-20
definition: Versie GWSW.hydx
notation: ALG_VRS
author at start life: Marinus Vonhof
date of start life: 2014-09-13
comment: [Len=10]
scope note: Cof HDX
type: Class
subclass of: Hydx Kolom
subclass of: Restriction
  author of change: Marinus Vonhof
  date of change: 2014-09-14
  author at start life: Marinus Vonhof
  date of start life: 2014-09-13
  on class: Hydx Meta regel
  on property: has as aspect (inverse)
  max qualified cardinality: 1
subclass of: Restriction
  on property: has as reference (qualification)
  has value: GWSW12

Hydx Omschrijving rioolstelsel
definition: Omschrijving rioolstelsel
notation: ALG_OMS
author at start life: Marinus Vonhof
date of start life: 2014-09-13
comment: [Len=30]
scope note: Cof HDX
type: Class
subclass of: Hydx Kolom
subclass of: Restriction
  author at start life: Marinus Vonhof
  date of start life: 2014-09-13
  on class: Hydx Meta regel
  on property: has as aspect (inverse)
  max qualified cardinality: 1

Hydx Oorsprong export
definition: Oorsprong van export (naam modelleersoftware of beheerpakket)
notation: ALG_EXP
author at start life: Marinus Vonhof
date of start life: 2014-09-13
comment: [Len=30]
scope note: Cof HDX
type: Class
subclass of: Hydx Kolom
subclass of: Restriction
  author at start life: Marinus Vonhof
  date of start life: 2014-09-13
  on class: Hydx Meta regel
  on property: has as aspect (inverse)
  max qualified cardinality: 1

Hydx Opdrachtgevende instantie
definition: Opdrachtgevende instantie
notation: ALG_OPD
author at start life: Marinus Vonhof
date of start life: 2014-09-13
comment: [Len=30]
scope note: Cof HDX
type: Class
subclass of: Hydx Kolom
subclass of: Restriction
  author at start life: Marinus Vonhof
  date of start life: 2014-09-13
  on class: Hydx Meta regel
  on property: has as aspect (inverse)
  max qualified cardinality: 1
subclass of: Restriction
  on property: has as reference (qualification)
  all values from: Opdrachtgever

Hydx Uitvoerende instantie
definition: Uitvoerende instantie
notation: ALG_UIT
author at start life: Marinus Vonhof
date of start life: 2014-09-13
comment: [Len=30]
scope note: Cof HDX
type: Class
subclass of: Hydx Kolom
subclass of: Restriction
  author at start life: Marinus Vonhof
  date of start life: 2014-09-13
  on class: Hydx Meta regel
  on property: has as aspect (inverse)
  max qualified cardinality: 1
subclass of: Restriction
  on property: has as reference (qualification)
  all values from: Opdrachtnemer

Hydx Minimum infiltratiecapaciteit
definition: Minimum infiltratiecapaciteit
notation: AFV_IFN
author at start life: Marinus Vonhof
date of start life: 2014-09-13
units of measurements: mm/h
comment: [Len=3] [afronden van decimal naar integer]
scope note: Cof HDX
type: Class
subclass of: Hydx Kolom
subclass of: Restriction
  author at start life: Marinus Vonhof
  date of start life: 2014-09-13
  on class: Hydx Nwrw regel
  on property: has as aspect (inverse)
  qualified cardinality: 1
subclass of: Restriction
  on property: has as value
  all values from: decimal

Hydx Naam neerslagstation
author of change: Marinus Vonhof
date of change: 2017-05-08
definition: Naam neerslagstation
notation: NSL_STA
author at start life: Marinus Vonhof
date of start life: 2014-09-13
comment: [Len=30]
scope note: Cof HDX
type: Class
subclass of: Hydx Kolom
subclass of: Restriction
  author of change: Marinus Vonhof
  date of change: 2017-07-25
  author at start life: Marinus Vonhof
  date of start life: 2014-09-13
  on class: Hydx Oppervlak regel
  on property: has as aspect (inverse)
  max qualified cardinality: 1

Maaiveldhoogte
author of change: Marinus Vonhof
date of change: 2015-11-07
definition: Het niveau van het maaiveld
author at start life: Marinus Vonhof
date of start life: 2012-04-22
units of measurements: m
comment: [is aspect]
scope note: Cof TOP
type: Class
subclass of: Hoogte t.o.v. NAP
subclass of: Restriction
  author of change: Marinus Vonhof
  date of change: 2018-12-12
  author at start life: Marinus Vonhof
  date of start life: 2012-04-22
  on class: Maaiveldoriëntatie
  on property: has as aspect (inverse)
  qualified cardinality: 1
subclass of: Restriction
  author at start life: Marinus Vonhof
  date of start life: 2015-11-07
  on class: Inwinning
  on property: has as aspect
  max qualified cardinality: 1
subclass of: Restriction
  on property: has as value
  all values from: decimal

Hydx Oppervlakteberging
definition: Oppervlakteberging
notation: AFV_BRG
author at start life: Marinus Vonhof
date of start life: 2014-09-13
units of measurements: mm
comment: [Len=4.2]
scope note: Cof HDX
type: Class
subclass of: Hydx Kolom
subclass of: Restriction
  author at start life: Marinus Vonhof
  date of start life: 2014-09-13
  on class: Hydx Nwrw regel
  on property: has as aspect (inverse)
  qualified cardinality: 1
subclass of: Restriction
  on property: has as value
  all values from: integer

Opdrachtgever
label: Employing authority @en
author of change: Marinus Vonhof
date of change: 2025-01-16
date of change: 2020-04-20
definition: Een rechtspersoon die opdracht geeft voor het uitvoeren van activiteiten dan wel het leveren van producten of diensten. De initiator van het project, dus ongeacht onderaanneming.
definition: [IMBOR] Een opdrachtgever is een organisatie die een bepaalde opdracht tot het verrichten van werkzaamheden verstrekt aan een andere (rechts)persoon, de opdrachtnemer.
notation: AAM
notation: CAM
notation: EAM
notation: GAM
notation: JAM
author at start life: Marinus Vonhof
date of start life: 2011-12-02
validity context: 3d 14d
see also: [KIB] De naam van de bevoegde instantie
alternative label: Bevoegde instantie
scope note: Cof TOP
type: Class
subclass of: Levensvorm
subclass of: Restriction
  author at start life: Marinus Vonhof
  date of start life: 2015-10-26
  on class: Project
  on property: has as input (inverse)
  qualified cardinality: 1

Hydx Percentage volume dag VER_DAG uur 00
author of change: Marinus Vonhof
date of change: 2017-05-11
definition: Percentage van het dagvolume op 00 uur
notation: U00_DAG
author at start life: Marinus Vonhof
date of start life: 2014-09-13
units of measurements: %
comment: [Len=3] [Verplicht als Verloop/VER_TYP=DAG, VAR]
scope note: Cof HDX
type: Class
subclass of: Hydx Kolom
subclass of: Restriction
  author of change: Marinus Vonhof
  date of change: 2014-12-17
  author at start life: Marinus Vonhof
  date of start life: 2014-09-13
  on class: Hydx Verloop regel
  on property: has as aspect (inverse)
  max qualified cardinality: 1
subclass of: Restriction
  on property: has as value
  all values from: integer

Hydx Percentage volume dag VER_DAG uur 01
definition: Percentage van het dagvolume op 01 uur
notation: U01_DAG
author at start life: Marinus Vonhof
date of start life: 2014-09-13
units of measurements: %
comment: [Len=3] [Verplicht als Verloop/VER_TYP=DAG, VAR]
scope note: Cof HDX
type: Class
subclass of: Hydx Kolom
subclass of: Restriction
  author at start life: Marinus Vonhof
  date of start life: 2014-09-13
  on class: Hydx Verloop regel
  on property: has as aspect (inverse)
  max qualified cardinality: 1
subclass of: Restriction
  on property: has as value
  all values from: integer

Hydx Percentage volume dag VER_DAG uur 02
definition: Percentage van het dagvolume op 02 uur
notation: U02_DAG
author at start life: Marinus Vonhof
date of start life: 2014-09-13
units of measurements: %
comment: [Len=3] [Verplicht als Verloop/VER_TYP=DAG, VAR]
scope note: Cof HDX
type: Class
subclass of: Hydx Kolom
subclass of: Restriction
  author at start life: Marinus Vonhof
  date of start life: 2014-09-13
  on class: Hydx Verloop regel
  on property: has as aspect (inverse)
  max qualified cardinality: 1
subclass of: Restriction
  on property: has as value
  all values from: integer

Hydx Percentage volume dag VER_DAG uur 03
definition: Percentage van het dagvolume op 03 uur
notation: U03_DAG
author at start life: Marinus Vonhof
date of start life: 2014-09-13
units of measurements: %
comment: [Len=3] [Verplicht als Verloop/VER_TYP=DAG, VAR]
scope note: Cof HDX
type: Class
subclass of: Hydx Kolom
subclass of: Restriction
  author at start life: Marinus Vonhof
  date of start life: 2014-09-13
  on class: Hydx Verloop regel
  on property: has as aspect (inverse)
  max qualified cardinality: 1
subclass of: Restriction
  on property: has as value
  all values from: integer

Hydx Percentage volume dag VER_DAG uur 04
definition: Percentage van het dagvolume op 04 uur
notation: U04_DAG
author at start life: Marinus Vonhof
date of start life: 2014-09-13
units of measurements: %
comment: [Len=3] [Verplicht als Verloop/VER_TYP=DAG, VAR]
scope note: Cof HDX
type: Class
subclass of: Hydx Kolom
subclass of: Restriction
  author at start life: Marinus Vonhof
  date of start life: 2014-09-13
  on class: Hydx Verloop regel
  on property: has as aspect (inverse)
  max qualified cardinality: 1
subclass of: Restriction
  on property: has as value
  all values from: integer

Hydx Percentage volume dag VER_DAG uur 05
definition: Percentage van het dagvolume op 05 uur
notation: U05_DAG
author at start life: Marinus Vonhof
date of start life: 2014-09-13
units of measurements: %
comment: [Len=3] [Verplicht als Verloop/VER_TYP=DAG, VAR]
scope note: Cof HDX
type: Class
subclass of: Hydx Kolom
subclass of: Restriction
  author at start life: Marinus Vonhof
  date of start life: 2014-09-13
  on class: Hydx Verloop regel
  on property: has as aspect (inverse)
  max qualified cardinality: 1
subclass of: Restriction
  on property: has as value
  all values from: integer

Hydx Percentage volume dag VER_DAG uur 06
definition: Percentage van het dagvolume op 06 uur
notation: U06_DAG
author at start life: Marinus Vonhof
date of start life: 2014-09-13
units of measurements: %
comment: [Len=3] [Verplicht als Verloop/VER_TYP=DAG, VAR]
scope note: Cof HDX
type: Class
subclass of: Hydx Kolom
subclass of: Restriction
  author at start life: Marinus Vonhof
  date of start life: 2014-09-13
  on class: Hydx Verloop regel
  on property: has as aspect (inverse)
  max qualified cardinality: 1
subclass of: Restriction
  on property: has as value
  all values from: integer

Hydx Percentage volume dag VER_DAG uur 07
definition: Percentage van het dagvolume op 07 uur
notation: U07_DAG
author at start life: Marinus Vonhof
date of start life: 2014-09-13
units of measurements: %
comment: [Len=3] [Verplicht als Verloop/VER_TYP=DAG, VAR]
scope note: Cof HDX
type: Class
subclass of: Hydx Kolom
subclass of: Restriction
  author at start life: Marinus Vonhof
  date of start life: 2014-09-13
  on class: Hydx Verloop regel
  on property: has as aspect (inverse)
  max qualified cardinality: 1
subclass of: Restriction
  on property: has as value
  all values from: integer

Hydx Percentage volume dag VER_DAG uur 08
definition: Percentage van het dagvolume op 08 uur
notation: U08_DAG
author at start life: Marinus Vonhof
date of start life: 2014-09-13
units of measurements: %
comment: [Len=3] [Verplicht als Verloop/VER_TYP=DAG, VAR]
scope note: Cof HDX
type: Class
subclass of: Hydx Kolom
subclass of: Restriction
  author at start life: Marinus Vonhof
  date of start life: 2014-09-13
  on class: Hydx Verloop regel
  on property: has as aspect (inverse)
  max qualified cardinality: 1
subclass of: Restriction
  on property: has as value
  all values from: integer

Hydx Percentage volume dag VER_DAG uur 09
definition: Percentage van het dagvolume op 09 uur
notation: U09_DAG
author at start life: Marinus Vonhof
date of start life: 2014-09-13
units of measurements: %
comment: [Len=3] [Verplicht als Verloop/VER_TYP=DAG, VAR]
scope note: Cof HDX
type: Class
subclass of: Hydx Kolom
subclass of: Restriction
  author at start life: Marinus Vonhof
  date of start life: 2014-09-13
  on class: Hydx Verloop regel
  on property: has as aspect (inverse)
  max qualified cardinality: 1
subclass of: Restriction
  on property: has as value
  all values from: integer

Hydx Percentage volume dag VER_DAG uur 10
definition: Percentage van het dagvolume op 10 uur
notation: U10_DAG
author at start life: Marinus Vonhof
date of start life: 2014-09-13
units of measurements: %
comment: [Len=3] [Verplicht als Verloop/VER_TYP=DAG, VAR]
scope note: Cof HDX
type: Class
subclass of: Hydx Kolom
subclass of: Restriction
  author at start life: Marinus Vonhof
  date of start life: 2014-09-13
  on class: Hydx Verloop regel
  on property: has as aspect (inverse)
  max qualified cardinality: 1
subclass of: Restriction
  on property: has as value
  all values from: integer

Hydx Percentage volume dag VER_DAG uur 11
definition: Percentage van het dagvolume op 11 uur
notation: U11_DAG
author at start life: Marinus Vonhof
date of start life: 2014-09-13
units of measurements: %
comment: [Len=3] [Verplicht als Verloop/VER_TYP=DAG, VAR]
scope note: Cof HDX
type: Class
subclass of: Hydx Kolom
subclass of: Restriction
  author at start life: Marinus Vonhof
  date of start life: 2014-09-13
  on class: Hydx Verloop regel
  on property: has as aspect (inverse)
  max qualified cardinality: 1
subclass of: Restriction
  on property: has as value
  all values from: integer

Hydx Percentage volume dag VER_DAG uur 12
definition: Percentage van het dagvolume op 12 uur
notation: U12_DAG
author at start life: Marinus Vonhof
date of start life: 2014-12-17
units of measurements: %
comment: [Len=3] [Verplicht als Verloop/VER_TYP=DAG, VAR]
scope note: Cof HDX
type: Class
subclass of: Hydx Kolom
subclass of: Restriction
  author at start life: Marinus Vonhof
  date of start life: 2014-12-17
  on class: Hydx Verloop regel
  on property: has as aspect (inverse)
  max qualified cardinality: 1
subclass of: Restriction
  on property: has as value
  all values from: integer

Hydx Percentage volume dag VER_DAG uur 13
definition: Percentage van het dagvolume op 13 uur
notation: U13_DAG
author at start life: Marinus Vonhof
date of start life: 2014-12-17
units of measurements: %
comment: [Len=3] [Verplicht als Verloop/VER_TYP=DAG, VAR]
scope note: Cof HDX
type: Class
subclass of: Hydx Kolom
subclass of: Restriction
  author at start life: Marinus Vonhof
  date of start life: 2014-12-17
  on class: Hydx Verloop regel
  on property: has as aspect (inverse)
  max qualified cardinality: 1
subclass of: Restriction
  on property: has as value
  all values from: integer

Hydx Percentage volume dag VER_DAG uur 14
definition: Percentage van het dagvolume op 14 uur
notation: U14_DAG
author at start life: Marinus Vonhof
date of start life: 2014-12-17
units of measurements: %
comment: [Len=3] [Verplicht als Verloop/VER_TYP=DAG, VAR]
scope note: Cof HDX
type: Class
subclass of: Hydx Kolom
subclass of: Restriction
  author at start life: Marinus Vonhof
  date of start life: 2014-12-17
  on class: Hydx Verloop regel
  on property: has as aspect (inverse)
  max qualified cardinality: 1
subclass of: Restriction
  on property: has as value
  all values from: integer

Hydx Percentage volume dag VER_DAG uur 15
definition: Percentage van het dagvolume op 15 uur
notation: U15_DAG
author at start life: Marinus Vonhof
date of start life: 2014-12-17
units of measurements: %
comment: [Len=3] [Verplicht als Verloop/VER_TYP=DAG, VAR]
scope note: Cof HDX
type: Class
subclass of: Hydx Kolom
subclass of: Restriction
  author at start life: Marinus Vonhof
  date of start life: 2014-12-17
  on class: Hydx Verloop regel
  on property: has as aspect (inverse)
  max qualified cardinality: 1
subclass of: Restriction
  on property: has as value
  all values from: integer

Hydx Percentage volume dag VER_DAG uur 16
definition: Percentage van het dagvolume op 16 uur
notation: U16_DAG
author at start life: Marinus Vonhof
date of start life: 2014-12-17
units of measurements: %
comment: [Len=3] [Verplicht als Verloop/VER_TYP=DAG, VAR]
scope note: Cof HDX
type: Class
subclass of: Hydx Kolom
subclass of: Restriction
  author at start life: Marinus Vonhof
  date of start life: 2014-12-17
  on class: Hydx Verloop regel
  on property: has as aspect (inverse)
  max qualified cardinality: 1
subclass of: Restriction
  on property: has as value
  all values from: integer

Hydx Percentage volume dag VER_DAG uur 17
definition: Percentage van het dagvolume op 17 uur
notation: U17_DAG
author at start life: Marinus Vonhof
date of start life: 2014-12-17
units of measurements: %
comment: [Len=3] [Verplicht als Verloop/VER_TYP=DAG, VAR]
scope note: Cof HDX
type: Class
subclass of: Hydx Kolom
subclass of: Restriction
  author at start life: Marinus Vonhof
  date of start life: 2014-12-17
  on class: Hydx Verloop regel
  on property: has as aspect (inverse)
  max qualified cardinality: 1
subclass of: Restriction
  on property: has as value
  all values from: integer

Hydx Percentage volume dag VER_DAG uur 18
definition: Percentage van het dagvolume op 18 uur
notation: U18_DAG
author at start life: Marinus Vonhof
date of start life: 2014-12-17
units of measurements: %
comment: [Len=3] [Verplicht als Verloop/VER_TYP=DAG, VAR]
scope note: Cof HDX
type: Class
subclass of: Hydx Kolom
subclass of: Restriction
  author at start life: Marinus Vonhof
  date of start life: 2014-12-17
  on class: Hydx Verloop regel
  on property: has as aspect (inverse)
  max qualified cardinality: 1
subclass of: Restriction
  on property: has as value
  all values from: integer

Hydx Percentage volume dag VER_DAG uur 19
definition: Percentage van het dagvolume op 19 uur
notation: U19_DAG
author at start life: Marinus Vonhof
date of start life: 2014-12-17
units of measurements: %
comment: [Len=3] [Verplicht als Verloop/VER_TYP=DAG, VAR]
scope note: Cof HDX
type: Class
subclass of: Hydx Kolom
subclass of: Restriction
  author at start life: Marinus Vonhof
  date of start life: 2014-12-17
  on class: Hydx Verloop regel
  on property: has as aspect (inverse)
  max qualified cardinality: 1
subclass of: Restriction
  on property: has as value
  all values from: integer

Hydx Percentage volume dag VER_DAG uur 20
definition: Percentage van het dagvolume op 20 uur
notation: U20_DAG
author at start life: Marinus Vonhof
date of start life: 2014-12-17
units of measurements: %
comment: [Len=3] [Verplicht als Verloop/VER_TYP=DAG, VAR]
scope note: Cof HDX
type: Class
subclass of: Hydx Kolom
subclass of: Restriction
  author at start life: Marinus Vonhof
  date of start life: 2014-12-17
  on class: Hydx Verloop regel
  on property: has as aspect (inverse)
  max qualified cardinality: 1
subclass of: Restriction
  on property: has as value
  all values from: integer

Hydx Percentage volume dag VER_DAG uur 21
definition: Percentage van het dagvolume op 21 uur
notation: U21_DAG
author at start life: Marinus Vonhof
date of start life: 2014-12-17
units of measurements: %
comment: [Len=3] [Verplicht als Verloop/VER_TYP=DAG, VAR]
scope note: Cof HDX
type: Class
subclass of: Hydx Kolom
subclass of: Restriction
  author at start life: Marinus Vonhof
  date of start life: 2014-12-17
  on class: Hydx Verloop regel
  on property: has as aspect (inverse)
  max qualified cardinality: 1
subclass of: Restriction
  on property: has as value
  all values from: integer

Hydx Percentage volume dag VER_DAG uur 22
definition: Percentage van het dagvolume op 22 uur
notation: U22_DAG
author at start life: Marinus Vonhof
date of start life: 2014-12-17
units of measurements: %
comment: [Len=3] [Verplicht als Verloop/VER_TYP=DAG, VAR]
scope note: Cof HDX
type: Class
subclass of: Hydx Kolom
subclass of: Restriction
  author at start life: Marinus Vonhof
  date of start life: 2014-12-17
  on class: Hydx Verloop regel
  on property: has as aspect (inverse)
  max qualified cardinality: 1
subclass of: Restriction
  on property: has as value
  all values from: integer

Hydx Percentage volume dag VER_DAG uur 23
definition: Percentage van het dagvolume op 23 uur
notation: U23_DAG
author at start life: Marinus Vonhof
date of start life: 2014-12-17
units of measurements: %
comment: [Len=3] [Verplicht als Verloop/VER_TYP=DAG, VAR]
scope note: Cof HDX
type: Class
subclass of: Hydx Kolom
subclass of: Restriction
  author at start life: Marinus Vonhof
  date of start life: 2014-12-17
  on class: Hydx Verloop regel
  on property: has as aspect (inverse)
  max qualified cardinality: 1
subclass of: Restriction
  on property: has as value
  all values from: integer

Pompcapaciteit
author of change: Johan Post
date of change: 2022-11-25
definition: De in de praktijk maximaal leverbare hoeveelheid per tijdseenheid (de capaciteit kan variëren door wisselende drukhoogte)
definition: [Omgevingswet] De volume-productie van een pomp per tijdseenheid
author at start life: Nic Roest (Idoro)
date of start life: 2006-02-21
units of measurements: m3/h
alternative label: Geïnstalleerde pompcapaciteit
comment: [is aspect]
scope note: Cof MDS
scope note: Cof HYD
scope note: Cof RGM
type: Class
subclass of: Capaciteit
subclass of: Restriction
  author of change: Marinus Vonhof
  date of change: 2018-12-12
  author at start life: Marinus Vonhof
  date of start life: 2011-12-15
  validity context: 5t 11t
  on class: Pomp
  on property: has as aspect (inverse)
  max qualified cardinality: 1
subclass of: Restriction
  on property: has as value
  all values from: decimal

Hydx Vorm profiel
author of change: Marinus Vonhof
date of change: 2023-01-10
date of change: 2017-05-11
definition: Vorm profiel
notation: PRO_VRM
author at start life: Marinus Vonhof
date of start life: 2014-09-13
comment: [Len=3] [Verplicht als Verbinding/VRB_TYP=GSL,ITR,DRL,OPL] [Bij Verbinding/VRB_TYP=OPL altijd code YZP of TPZ invullen]
scope note: Cof HDX
type: Class
subclass of: Hydx Kolom
subclass of: Restriction
  author at start life: Marinus Vonhof
  date of start life: 2014-09-13
  on class: Hydx Profiel regel
  on property: has as aspect (inverse)
  max qualified cardinality: 1
subclass of: Restriction
  on property: has as reference (qualification)
  all values from: Vorm profiel

Status object
author of change: Marinus Vonhof
date of change: 2014-12-17
author at start life: Marinus Vonhof
date of start life: 2014-12-17
see also: [HYD] Status knooppunt of verbinding
comment: [is aspect]
scope note: Cof HDX
type: Class
subclass of: Kenmerk
subclass of: Restriction
  on property: has as reference (qualification)
  all values from: Status object (coll)

Hydx Stromingsrichting
author of change: Marinus Vonhof
date of change: 2019-07-11
definition: Mogelijke stromingsrichting door doorlaat, pomp en overstortdrempel. In leidingen is altijd stroming in beide richtingen mogelijk.
notation: STR_RCH
author at start life: Marinus Vonhof
date of start life: 2014-09-13
comment: [Len=3] [Verplicht als Verbinding/VRB_TYP=OVS,DRL,PMP]
scope note: Cof HDX
type: Class
subclass of: Hydx Kolom
subclass of: Restriction
  author at start life: Marinus Vonhof
  date of start life: 2014-09-13
  on class: Hydx Verbinding regel
  on property: has as aspect (inverse)
  max qualified cardinality: 1
subclass of: Restriction
  on property: has as reference (qualification)
  all values from: Stromingsrichting

Type debiet
author of change: Marinus Vonhof
date of change: 2014-12-17
author at start life: Marinus Vonhof
date of start life: 2014-12-17
see also: [HYD] Aanduiding van type debiet
comment: [is aspect]
scope note: Cof HDX
type: Class
subclass of: Kenmerk
subclass of: Restriction
  on property: has as reference (qualification)
  all values from: Type debiet (coll)

Hydx Type inzameling
author of change: Marinus Vonhof
date of change: 2017-09-08
definition: Type afvalwater dat wordt ingezameld
notation: INZ_TYP
author at start life: Marinus Vonhof
date of start life: 2014-09-13
comment: [Len=3] [Verplicht als Verbinding/VRB_TYP=GSL,OPL,ITR
scope note: Cof HDX
type: Class
subclass of: Hydx Kolom
subclass of: Restriction
  author at start life: Marinus Vonhof
  date of start life: 2014-09-13
  on class: Hydx Verbinding regel
  on property: has as aspect (inverse)
  max qualified cardinality: 1
subclass of: Restriction
  on property: has as reference (qualification)
  all values from: Type inzameling

Type inzameling
author of change: Marinus Vonhof
date of change: 2017-09-08
author at start life: Marinus Vonhof
date of start life: 2014-12-17
see also: [HYD] Aanduiding type leiding
comment: [is aspect]
scope note: Cof HDX
type: Class
subclass of: Kenmerk
subclass of: Restriction
  on property: has as reference (qualification)
  all values from: Type inzameling (coll)

Type knooppunt
author of change: Marinus Vonhof
date of change: 2014-12-17
author at start life: Marinus Vonhof
date of start life: 2014-12-17
see also: [HYD] Aanduiding type put
comment: [is aspect]
scope note: Cof HDX
type: Class
subclass of: Kenmerk
subclass of: Restriction
  on property: has as reference (qualification)
  all values from: Type knooppunt (coll)

Type kunstwerk
author of change: Marinus Vonhof
date of change: 2014-12-17
author at start life: Marinus Vonhof
date of start life: 2014-12-17
see also: [HYD] Aanduiding van type kunstwerk
comment: [is aspect]
scope note: Cof HDX
type: Class
subclass of: Kenmerk
subclass of: Restriction
  on property: has as reference (qualification)
  all values from: Type kunstwerk (coll)

Hydx Type verbinding
author of change: Marinus Vonhof
date of change: 2017-09-08
definition: Type verbinding
notation: VRB_TYP
author at start life: Marinus Vonhof
date of start life: 2014-09-13
comment: [Len=3]
scope note: Cof HDX
type: Class
subclass of: Hydx Kolom
subclass of: Restriction
  author at start life: Marinus Vonhof
  date of start life: 2014-09-13
  on class: Hydx Verbinding regel
  on property: has as aspect (inverse)
  qualified cardinality: 1
subclass of: Restriction
  on property: has as reference (qualification)
  all values from: Type verbinding

Type verbinding
author of change: Marinus Vonhof
date of change: 2017-08-30
author at start life: Marinus Vonhof
date of start life: 2014-12-17
see also: [HYD] Aanduiding welke kenmerken deze verbinding heeft
comment: [is aspect]
scope note: Cof HDX
type: Class
subclass of: Kenmerk
subclass of: Restriction
  on property: has as reference (qualification)
  all values from: Type verbinding (coll)

Hydx Type verloop
definition: Constant of variabel verloop
notation: VER_TYP
author at start life: Marinus Vonhof
date of start life: 2014-09-13
comment: [Len=3]
scope note: Cof HDX
type: Class
subclass of: Hydx Kolom
subclass of: Restriction
  author at start life: Marinus Vonhof
  date of start life: 2014-09-13
  on class: Hydx Verloop regel
  on property: has as aspect (inverse)
  qualified cardinality: 1
subclass of: Restriction
  on property: has as reference (qualification)
  all values from: Type verloop

Type verloop
author of change: Marinus Vonhof
date of change: 2014-12-17
author at start life: Marinus Vonhof
date of start life: 2014-12-17
see also: [HYD] Aanduiding van debietverloop van DWA of lateraal debiet (DWA en/of oppervlak)
comment: [is aspect]
scope note: Cof HDX
type: Class
subclass of: Kenmerk
subclass of: Restriction
  on property: has as reference (qualification)
  all values from: Type verloop (coll)

Opdrachtnemer
author of change: Marinus Vonhof
date of change: 2017-05-08
definition: Rechtspersoon die door middel van een overeenkomst door een opdrachtgever tegen vergoeding in staat wordt gesteld tot het uitvoeren van bepaalde activiteiten dan wel het leveren van producten of diensten
author at start life: Marinus Vonhof
date of start life: 2015-10-26
validity context: 3d 6d 14d
scope note: Cof TOP
type: Class
subclass of: Levensvorm
subclass of: Restriction
  author of change: Marinus Vonhof
  date of change: 2015-10-31
  author at start life: Marinus Vonhof
  date of start life: 2015-10-26
  on class: Project
  on property: has as output (inverse)
  qualified cardinality: 1

Vorm profiel
author of change: Marinus Vonhof
date of change: 2018-04-30
author at start life: Marinus Vonhof
date of start life: 2014-12-17
see also: [HYD] Aanduiding vorm leidingprofiel
comment: [is aspect]
scope note: Cof HDX
type: Class
subclass of: Vorm
subclass of: Restriction
  on property: has as reference (qualification)
  all values from: Vorm profiel (coll)

Vorm put
author of change: Marinus Vonhof
date of change: 2021-08-06
definition: De inwendige vorm (horizontaal, uit het bovenaanzicht). Indien aanwezig de vorm van de onderbak
author at start life: Marinus Vonhof
date of start life: 2012-05-01
comment: Intrinsiek aspect
comment: [is aspect]
scope note: Cof TOP
type: Class
subclass of: Vorm
subclass of: Restriction
  author of change: Marinus Vonhof
  date of change: 2021-08-06
  author at start life: Finy Teitsma (Oranjewoud)
  date of start life: 2006-02-25
  validity context: *t
  on class: Put
  on property: has as aspect (inverse)
  max qualified cardinality: 1
subclass of: Restriction
  date of change: 2017-05-17
  author at start life: Marinus Vonhof
  date of start life: 2015-10-30
  on class: Inwinning
  on property: has as aspect
  max qualified cardinality: 1
subclass of: Restriction
  on property: has as reference (qualification)
  all values from: Vorm put (coll)

Vrije overstorthoogte
definition: De vrije ruimte boven de overstortdrempel
author at start life: Marinus Vonhof
date of start life: 2017-12-07
units of measurements: mm
validity context: 1d 10d
comment: [is aspect]
scope note: Cof BAS
scope note: Cof HYD
type: Class
subclass of: Afstand
subclass of: Restriction
  author of change: Marinus Vonhof
  date of change: 2017-12-07
  author at start life: Marinus Vonhof
  date of start life: 2015-09-20
  on class: Overstortdrempel
  on property: has as aspect (inverse)
  max qualified cardinality: 1
subclass of: Restriction
  author at start life: Marinus Vonhof
  date of start life: 2019-03-20
  on class: Stuwmuur
  on property: has as aspect (inverse)
  max qualified cardinality: 1
subclass of: Restriction
  on property: has as value
  all values from: integer

X-coördinaat
author of change: Marinus Vonhof
date of change: 2017-09-08
definition: Conform coordinatenstelsel EPSG:7415 (x/y conform EPSG:28992 (=RD), z conform EPSG:5709 (=NAP).
author at start life: Marinus Vonhof
date of start life: 2011-12-15
units of measurements: m
comment: N 11 44-54 _mm *
comment: [is aspect]
scope note: Cof HDX
type: Class
subclass of: Kenmerk
subclass of: Restriction
  on property: has as value
  all values from: X-coördinaat (datatype)

Y-coördinaat
author of change: Marinus Vonhof
date of change: 2014-12-23
definition: Conform coordinatenstelsel EPSG:7415 (x/y conform EPSG:28992 (=RD), z conform EPSG:5709 (=NAP).
author at start life: Marinus Vonhof
date of start life: 2011-12-15
units of measurements: m
comment: N 11 33-43 mm *
comment: [is aspect]
scope note: Cof HDX
type: Class
subclass of: Kenmerk
subclass of: Restriction
  on property: has as value
  all values from: Y-coördinaat (datatype)

Status object (coll)
comment: [is coll]
scope note: Cof HDX
type: Class
subclass of: Verzameling soorten
subclass of: Class
  one of: In gebruik
  one of: In ontwerp

Infiltratiebassin
author of change: Marinus Vonhof
author of change: Johan Post
author of change: Eric van Gorkom
date of change: 2021-10-01
date of change: 2026-07-13
date of change: 2024-05-13
definition: Een open reservoir met waterdoorlatende wanden voor de tijdelijke berging van hemelwater, waarbij het hemelwater door middel van infiltratie door de wanden kan worden afgevoerd
author at start life: Finy Teitsma (Oranjewoud)
date of start life: 2007-10-23
scope note: Cof MDS
scope note: Cof HYD
type: Class
subclass of: Begroeide infiltratievoorziening
subclass of: Restriction
  on property: heeft Uitvoering
  has value: Waterdoorlatende wanden

Infiltratieberm
definition: Een strook grond langs een weg, tussen rijstroken of tussen een rijweg en een fiets- of voetpad in die het afstromende hemelwater van de verharding ernaast laat infiltreren. Dit kan bedoeld zijn om (schoon) water niet af te voeren, om grondwater aan te vullen en ook om de beplanting in bermen van voldoende water te voorzien.
author at start life: Marinus Vonhof
date of start life: 2026-07-14
scope note: Cof MDS
scope note: Cof HYD
type: Class
subclass of: Begroeide infiltratievoorziening
subclass of: Restriction
  on property: heeft Uitvoering
  has value: In de berm

Infiltratiegoot
author of change: Marinus Vonhof
date of change: 2025-01-16
date of change: 2026-07-13
definition: Een goot met waterdoorlatende wanden bestemd voor de inzameling en transport van hemelwater, waarbij het hemelwater door middel van infiltratie door de wanden kan worden afgevoerd. Kan ook beschouwd worden als een soort infiltratievoorziening.
author at start life: Marinus Vonhof
date of start life: 2021-08-06
scope note: Cof MDS
scope note: Cof HYD
type: Class
subclass of: Goot
subclass of: Restriction
  on property: heeft Uitvoering
  has value: In de vorm van een goot

Infiltratiegreppel
author of change: Marinus Vonhof
author of change: Johan Post
date of change: 2021-10-01
date of change: 2026-07-13
definition: Een natuurlijk open reservoir met waterdoorlatende wanden voor de tijdelijke berging van hemelwater, waarbij het hemelwater door middel van infiltratie door de wanden kan worden afgevoerd.
author at start life: Finy Teitsma (Oranjewoud)
date of start life: 2007-10-23
alternative label: Zaksloot
scope note: Cof MDS
scope note: Cof HYD
type: Class
subclass of: Begroeide infiltratievoorziening
subclass of: Restriction
  on property: heeft Uitvoering
  has value: In de vorm van een greppel

Substraat omstorting
definition: De omstorting van de constructie
author at start life: Marinus Vonhof
date of start life: 2026-08-05
alternative label: Omgestorte substraat
scope note: Cof MDS
scope note: Cof HYD
type: Class
subclass of: Substraat
subclass of: Restriction
  on class: Infiltratieput
  on property: has as part (inverse)
  max qualified cardinality: 1
subclass of: Restriction
  on property: heeft Toepassing
  has value: Omstorting van de constructie

Retentiewaarde
author of change: Eric van Gorkom
date of change: 2024-05-13
definition: De maximale verblijftijd van water boven de oppervlakte van het veld
author at start life: Marinus Vonhof
date of start life: 2022-10-01
units of measurements: h
validity context: 1d 3d 10d 15d
alternative label: Verblijftijd
comment: [is aspect]
scope note: Cof BAS
scope note: Cof HYD
type: Class
subclass of: Kenmerk
subclass of: Restriction
  author at start life: Marinus Vonhof
  date of start life: 2022-10-01
  on class: Wadi
  on property: has as aspect (inverse)
  max qualified cardinality: 1
subclass of: Restriction
  author at start life: Marinus Vonhof
  date of start life: 2026-07-26
  on class: Inwinning
  on property: has as aspect
  max qualified cardinality: 1
subclass of: Restriction
  on property: has as value
  all values from: integer

Infiltrerende wegconstructie
definition: Een verharding (doorlatend, passerend, halfverharding of traditioneel uitgevoerde verharding) op een constructielaag, met daar direct onder een infiltratiekoffer (fundatie/cunet met substraat met een hoge porositeit) of een infiltratiekrat. Het hemelwater wordt via een waterpasserende verharding, waterdoorlatende verharding, halfverharding, kolken met infiltratieriool en/of infiltratiegoot in het cunet of de infiltratiekrat gebracht en geborgen, waarbij het hemelwater via de bodem en wanden infiltreert in de ondergrond. Bij overbelasting en voor de vertraagde leegloop van de voorziening kunnen onderdelen (drainage, noodoverstort, slokop etc.) zijn aangebracht voor het reguleren van hemelwater- en grondwater.
author at start life: Marinus Vonhof
date of start life: 2026-07-13
scope note: Cof MDS
scope note: Cof HYD
type: Class
subclass of: Infiltratievoorziening
subclass of: Restriction
  author at start life: Marinus Vonhof
  date of start life: 2026-07-14
  on class: Infiltratiegoot
  on property: has as part
  min qualified cardinality: 0
subclass of: Restriction
  on property: heeft Uitvoering
  has value: Onderdeel van de weg

Tubelure
author of change: Marinus Vonhof
date of change: 2025-01-16
definition: [IMBOR] Een verbindingsstuk dat drie leidingen verbindt.
author at start life: Marinus Vonhof
date of start life: 2019-05-15
validity context: 1d
scope note: Cof MDS
scope note: Cof REV
scope note: Cof PLI
scope note: Cof HYD
type: Class
subclass of: Verbindingsstuk
subclass of: Restriction
  on property: heeft Toepassing
  has value: Toegang voor injecteren

Spoelklep
author of change: Marinus Vonhof
author of change: Johan Post
date of change: 2024-05-01
date of change: 2022-10-03
date of change: 2019-01-08
definition: Klep onder de oppervlaktewaterspiegel die geopend kan worden om het rioolstelsel door te spoelen met oppervlaktewater
author at start life: Marinus Vonhof
date of start life: 2015-03-01
scope note: Cof BAS
scope note: Cof HYD
scope note: Cof DMO
type: Class
subclass of: Mechanische afsluiter
subclass of: Restriction
  on property: heeft Functie
  has value: Afsluiten in twee stroomrichtingen
subclass of: Restriction
  on property: heeft Functie
  has value: Doorspoelen rioolstelsel

Wijze van inwinning
author of change: Johan Post
date of change: 2022-09-29
definition: Wijze waarop gegevens verzameld zijn
author at start life: Marinus Vonhof
date of start life: 2013-02-05
alternative label: Wijze van inwinnen
comment: [is aspect]
scope note: Cof TOP
type: Class
subclass of: Kenmerk
subclass of: Restriction
  author of change: Marinus Vonhof
  date of change: 2026-07-26
  date of change: 2024-05-15
  date of change: 2019-04-25
  author at start life: Marinus Vonhof
  date of start life: 2015-10-29
  on class: Inwinning
  on property: has as aspect (inverse)
  max qualified cardinality: 1
subclass of: Restriction
  on property: has as reference (qualification)
  all values from: Wijze van inwinning (coll)

Inspecteren
author of change: Marinus Vonhof
date of change: 2022-09-30
date of change: 2015-08-24
definition: [NEN 3300:1996] (Inspectie) Het waarnemen, herkennen en beschrijven van de toestand
author at start life: Marinus Vonhof
date of start life: 2013-03-26
validity context: 1f 3f 5d 10f 11d 12f 14f
scope note: Cof TOP
type: Class
subclass of: Onderzoeken

Mechanische transportleiding
author of change: Marinus Vonhof
author of change: Johan Post
author of change: Wouter van Riel
date of change: 2025-01-16
date of change: 2024-05-02
date of change: 2015-09-20
date of change: 2024-04-23
date of change: 2024-07-26
date of change: 2024-05-04
definition: [IMBOR] Een transportleiding waarin de materie op basis van onder- en bovendruk wordt verplaatst.
author at start life: Marinus Vonhof
date of start life: 2014-12-02
validity context: *f
scope note: Cof TOP
type: Class
subclass of: Transportleiding
subclass of: Restriction
  on property: heeft Structuur
  has value: Gesloten
subclass of: Restriction
  on property: heeft Technologie
  has value: Transport onder overdruk of onderdruk

Project
author of change: Marinus Vonhof
date of change: 2025-01-16
definition: [IMBOR] Afbakening van het gebied (begrenzing) waarbinnen werkzaamheden gepland zijn, uitgevoerd worden of uitgevoerd zijn.
author at start life: Marinus Vonhof
date of start life: 2013-09-03
validity context: 3d 14d
scope note: Cof TOP
type: Class
subclass of: Activiteit
subclass of: Restriction
  author of change: Marinus Vonhof
  date of change: 2015-10-26
  author at start life: Marinus Vonhof
  date of start life: 2011-12-02
  validity context: 1t 10t 12t
  on class: Projectreferentie opdrachtgever
  on property: has as aspect
  max qualified cardinality: 1
subclass of: Restriction
  author of change: Marinus Vonhof
  date of change: 2015-10-31
  author at start life: Marinus Vonhof
  date of start life: 2015-10-26
  on class: Opdrachtnemer
  on property: has as output
  min qualified cardinality: 1
subclass of: Restriction
  author at start life: Marinus Vonhof
  date of start life: 2015-10-26
  validity context: 1t 10t 12t
  on class: Projectreferentie opdrachtnemer
  on property: has as aspect
  max qualified cardinality: 1
subclass of: Restriction
  author at start life: Marinus Vonhof
  date of start life: 2015-10-26
  on class: Opdrachtgever
  on property: has as input
  qualified cardinality: 1

Vrijverval transportstelsel
author of change: Marinus Vonhof
author of change: Johan Post
date of change: 2025-01-16
date of change: 2021-10-01
definition: [IMBOR] Een netwerk van leidingen en putten ten behoeve van het transport van materie dat door middel van zwaartekracht plaatsvindt.
author at start life: Marinus Vonhof
date of start life: 2014-12-02
scope note: Cof TOP
type: Class
subclass of: Transportstelsel
subclass of: Restriction
  author of change: Marinus Vonhof
  date of change: 2015-04-21
  author at start life: Marinus Vonhof
  date of start life: 2014-12-02
  on class: Inspectieput
  on property: has as part
  min qualified cardinality: 1
subclass of: Restriction
  author of change: Marinus Vonhof
  date of change: 2015-09-20
  author at start life: Marinus Vonhof
  date of start life: 2014-12-02
  validity context: 1t 10t 12t
  on class: Vrijverval transportleiding
  on property: has as part
  min qualified cardinality: 1
subclass of: Restriction
  on property: heeft Technologie
  has value: Transport door de zwaartekracht

Interne overstortconstructie
author of change: Marinus Vonhof
date of change: 2015-09-01
definition: Een overstortconstructie die loost op een voorziening binnen hetzelfde rioolstelsel.
author at start life: Marinus Vonhof
date of start life: 2015-05-29
scope note: Cof MDS
scope note: Cof HYD
type: Class
subclass of: Overstortconstructie
subclass of: Restriction
  on property: heeft Functie
  has value: Lozen binnen het stelsel

Interne overstortput
author of change: Marinus Vonhof
author of change: Finy Teitsma (Oranjewoud)
author of change: Wouter van Riel
date of change: 2024-04-20
date of change: 2007-11-12
date of change: 2025-03-20
definition: Een overstortput die loost op een voorziening binnen hetzelfde rioolstelsel.
definition: [NEN 3300:1996] rioolput voorzien van een overstortdrempel die loost binnen het in beschouwing genomen rioolstelsel
author at start life: Finy Teitsma (Oranjewoud)
date of start life: 2006-05-23
alternative label: Interne overstort
scope note: Cof MDS
scope note: Cof REV
scope note: Cof HYD
scope note: Cof DMO
type: Class
subclass of: Overstortput
subclass of: Restriction
  on property: heeft Functie
  has value: Lozen binnen het stelsel

Waterpeil
author of change: Marinus Vonhof
date of change: 2018-12-06
definition: Gemiddeld peil van het oppervlaktewater. Waarbij meetpunt op het waperoppervlak ligt
author at start life: Nic Roest (Idoro)
date of start life: 2006-02-21
units of measurements: m
comment: [is aspect]
scope note: Cof MDS
scope note: Cof HYD
type: Class
subclass of: Hoogte t.o.v. NAP
subclass of: Restriction
  author at start life: Marinus Vonhof
  date of start life: 2018-12-06
  on class: Inwinning
  on property: has as aspect
  max qualified cardinality: 1
subclass of: Restriction
  on property: has as value
  all values from: decimal

Uitlaatconstructie
author of change: Marinus Vonhof
author of change: Johan Post
date of change: 2022-09-30
date of change: 2026-05-21
date of change: 2020-04-18
definition: [NEN-EN 752:2008] constructie of punt van waaruit afvalwater wordt geloosd naar een afvalwaterzuiveringsinstallatie of ontvangend water [EN 1085:2007, definitie 1280]
definition: Een bouwwerk bestaande uit een constructief vormgegeven uitstroomelement dat de uitstroming van water uit een leiding naar het oppervlaktewater mogelijk maakt.
definition: [NEN 3300:1996] constructie waar uitstroming van afvalwater uit het in beschouwing genomen rioolstelsel naar het oppervlaktewater mogelijk is
author at start life: Marinus Vonhof
date of start life: 2013-10-01
scope note: Cof MDS
scope note: Cof HYD
scope note: Cof DMO
type: Class
subclass of: Bouwwerk
subclass of: Oorzaakobject
subclass of: Restriction
  author at start life: Marinus Vonhof
  date of start life: 2016-04-24
  validity context: 5t 11t
  on class: Uitlaat (punt)
  on property: has as aspect
  max qualified cardinality: 1
subclass of: Restriction
  author at start life: Marinus Vonhof
  date of start life: 2026-07-17
  on class: Keerklep
  on property: has as part
  max qualified cardinality: 1
subclass of: Restriction
  on property: heeft Functie
  has value: Uitstroom van afvalwater naar oppervlaktewater

Kruisingsput
author of change: Johan Post
date of change: 2021-10-01
definition: [NEN 3300:1996] rioolput voor de kruising van riolen, zonder dat de stromen elkaar raken
author at start life: Marinus Vonhof
date of start life: 2012-04-29
scope note: Cof MDS
scope note: Cof RRB
scope note: Cof LDR
scope note: Cof REV
scope note: Cof HYD
type: Class
subclass of: Rioolput
subclass of: Restriction
  on property: heeft Functie
  has value: Leiding gescheiden laten kruisen
subclass of: Restriction
  on property: heeft Functie
  has value: Voorkomen dat stromen elkaar raken

Kruisstuk
definition: Een verbindingsstuk dat vier (drainage) leidingen onder een rechte hoek verbindt
author at start life: Marinus Vonhof
date of start life: 2018-12-06
validity context: 1d
scope note: Cof MDS
scope note: Cof LDR
scope note: Cof REV
scope note: Cof PLI
scope note: Cof HYD
type: Class
subclass of: Verbindingsstuk
subclass of: Restriction
  on property: heeft Functie
  has value: Verbinden van vier leidingen

Lozingsdebiet
author of change: Johan Post
date of change: 2022-11-25
author at start life: Marinus Vonhof
date of start life: 2013-02-05
units of measurements: m3/h
comment: [is aspect]
scope note: Cof HYD
type: Class
subclass of: Capaciteit
subclass of: Restriction
  on property: has as value
  all values from: decimal

Lateraal debiet DWA
author of change: Johan Post
date of change: 2022-11-25
definition: DWA lozingsdebiet vanuit ander rioolstelsel
author at start life: Marinus Vonhof
date of start life: 2017-08-31
units of measurements: m3/h
comment: [is aspect]
scope note: Cof HYD
type: Class
subclass of: Lateraal debiet
subclass of: Restriction
  author at start life: Marinus Vonhof
  date of start life: 2017-08-31
  on class: Vuilwaterriool
  on property: has as aspect (inverse)
  max qualified cardinality: 1
subclass of: Restriction
  on property: has as value
  all values from: decimal

Type debiet (coll)
comment: [is coll]
scope note: Cof HDX
type: Class
subclass of: Verzameling soorten
subclass of: Class
  one of: Vuilwaterdebiet
  one of: Lateraal debiet (lozing, DWA en/of HWA)

Leidingsegment
author of change: Marinus Vonhof
author of change: Johan Post
author of change: Eric van Gorkom
date of change: 2022-09-27
date of change: 2022-09-29
date of change: 2018-12-12
author at start life: Marinus Vonhof
date of start life: 2014-12-02
validity context: 12d
see also: [WSH 20141028] Deel van een persleiding begrensd door wijziging materiaal, wijziging afmeting, locatie inprikpunt of locatie appendages
scope note: Cof MDS
scope note: Cof PLI
scope note: Cof HYD
scope note: Cof DMO
type: Class
subclass of: Mechanische transportleiding
subclass of: Restriction
  author of change: Marinus Vonhof
  date of change: 2016-04-28
  author at start life: Marinus Vonhof
  date of start life: 2014-12-02
  on class: Persleiding
  on property: has as part (inverse)
  max qualified cardinality: 1
subclass of: Restriction
  on property: heeft Uitvoering
  has value: Deel van mechanische transportleiding

Lengte
author of change: Marinus Vonhof
date of change: 2025-01-16
date of change: 2015-05-29
definition: In de richting van de langste afstand
definition: [IMBOR] Kenmerk voor de registratie van de langste horizontale dimensie van het beheerobject.
author at start life: Nic Roest (Idoro)
date of start life: 2006-02-17
comment: [is aspect]
scope note: Cof TOP
type: Class
subclass of: Afstand

Lengte toegang
author of change: Marinus Vonhof
author of change: Nic Roest (Idoro)
date of change: 2025-01-16
date of change: 2006-11-23
definition: [IMBOR] Kenmerk voor de registratie van de langste horizontale dimensie van de opening die het mogelijk maakt tot het object te komen.
notation: JCB
author at start life: Nic Roest (Idoro)
date of start life: 2006-03-23
units of measurements: mm
validity context: 5d
comment: [is aspect]
scope note: Cof RRB
scope note: Cof LDR
scope note: Cof HYD
type: Class
subclass of: Lengte
subclass of: Restriction
  author of change: Marinus Vonhof
  date of change: 2018-05-03
  author at start life: Finy Teitsma (Oranjewoud)
  date of start life: 2006-02-25
  on class: Rioolput
  on property: has as aspect (inverse)
  max qualified cardinality: 1
subclass of: Restriction
  on property: has as value
  all values from: integer

Lijngoot
author of change: Marinus Vonhof
author of change: Johan Post
date of change: 2025-01-16
date of change: 2021-10-01
definition: Goot in de lengterichting van de verharding, voorzien van een afdekking
author at start life: Marinus Vonhof
date of start life: 2014-09-06
scope note: Cof MDS
scope note: Cof HYD
type: Class
subclass of: Goot
subclass of: Oorzaakobject
subclass of: Restriction
  on property: heeft Uitvoering
  has value: Langs verharding met afdekking

Vrijverval transportleiding
author of change: Johan Post
author of change: Wouter van Riel
date of change: 2026-05-01
date of change: 2024-04-22
definition: Een transportleiding waarin de materie door de zwaartekracht wordt verplaatst
author at start life: Marinus Vonhof
date of start life: 2015-09-20
validity context: 3f
scope note: Cof TOP
type: Class
subclass of: Transportleiding
subclass of: Restriction
  author of change: Marinus Vonhof
  date of change: 2015-09-20
  author at start life: Marinus Vonhof
  date of start life: 2014-12-02
  validity context: 1t 10t 12t
  on class: Vrijverval transportstelsel
  on property: has as part (inverse)
  qualified cardinality: 1
subclass of: Restriction
  author at start life: Johan Post
  date of start life: 2026-05-01
  on class: Vrijverval rioolstelsel
  on property: has as part (inverse)
  max qualified cardinality: 1
subclass of: Restriction
  author at start life: Marinus Vonhof
  date of start life: 2019-05-15
  on class: Profiel leiding
  on property: has as aspect
  max qualified cardinality: 1
subclass of: Restriction
  on property: heeft Technologie
  has value: Transport door de zwaartekracht

Luchtpersgemaal
author of change: Marinus Vonhof
date of change: 2025-01-16
date of change: 2018-11-07
definition: Een gemaal uitgevoerd met een luchtcompressor die het afvalwater door de persleiding drukt
author at start life: Marinus Vonhof
date of start life: 2018-05-03
scope note: Cof MDS
scope note: Cof HYD
scope note: Cof RGM
scope note: Cof DMO
type: Class
subclass of: Rioolgemaal
subclass of: Restriction
  on property: heeft Uitvoering
  has value: Verpompt met een luchtcompressor

Substraat
definition: De vulling van een ruimte met een variabele porositeit en doorlaatbaarheid
author at start life: Marinus Vonhof
date of start life: 2026-08-05
scope note: Cof MDS
scope note: Cof HYD
type: Class
subclass of: Constructieonderdeel
subclass of: Restriction
  on property: heeft Functie
  has value: Opslag van hemelwater
subclass of: Restriction
  on property: heeft Functie
  has value: Transport van hemelwater
subclass of: Restriction
  on class: Porositeit
  on property: has as aspect
  max qualified cardinality: 1

Niveau benedenstrooms openen
author of change: Marinus Vonhof
date of change: 2025-01-16
date of change: 2019-07-11
definition: [IMBOR] Hoogte t.o.v. NAP om de afsluiter benedenstrooms te openen.
author at start life: Marinus Vonhof
date of start life: 2016-04-23
units of measurements: m
alternative label: Niveau stroomafwaarts openen
comment: [is aspect]
scope note: Cof HYD
type: Class
subclass of: Hoogte t.o.v. NAP
subclass of: Restriction
  author of change: Marinus Vonhof
  date of change: 2019-05-15
  author at start life: Marinus Vonhof
  date of start life: 2013-02-05
  on class: Mechanische afsluiter
  on property: has as aspect (inverse)
  max qualified cardinality: 1
subclass of: Restriction
  on property: has as value
  all values from: decimal

Niveau benedenstrooms sluiten
author of change: Marinus Vonhof
date of change: 2025-01-16
date of change: 2019-07-11
definition: [IMBOR] Hoogte t.o.v. NAP om de afsluiter benedenstrooms te sluiten.
author at start life: Marinus Vonhof
date of start life: 2013-02-05
units of measurements: m
alternative label: Niveau stroomafwaarts sluiten
comment: [is aspect]
scope note: Cof HYD
type: Class
subclass of: Hoogte t.o.v. NAP
subclass of: Restriction
  author of change: Marinus Vonhof
  date of change: 2019-05-15
  author at start life: Marinus Vonhof
  date of start life: 2013-02-05
  on class: Mechanische afsluiter
  on property: has as aspect (inverse)
  max qualified cardinality: 1
subclass of: Restriction
  on property: has as value
  all values from: decimal

Niveau bovenstrooms openen
author of change: Marinus Vonhof
date of change: 2025-01-16
date of change: 2019-07-11
definition: [IMBOR] Hoogte t.o.v. NAP om de afsluiter bovenstrooms te openen.
author at start life: Marinus Vonhof
date of start life: 2013-02-05
units of measurements: m
alternative label: Niveau stroomopwaarts openen
comment: [is aspect]
scope note: Cof HYD
type: Class
subclass of: Hoogte t.o.v. NAP
subclass of: Restriction
  author of change: Marinus Vonhof
  date of change: 2019-05-15
  author at start life: Marinus Vonhof
  date of start life: 2013-02-05
  on class: Mechanische afsluiter
  on property: has as aspect (inverse)
  max qualified cardinality: 1
subclass of: Restriction
  on property: has as value
  all values from: decimal

Niveau bovenstrooms sluiten
author of change: Marinus Vonhof
date of change: 2025-01-16
date of change: 2019-07-11
definition: [IMBOR] Hoogte t.o.v. NAP om de afsluiter bovenstrooms te sluiten.
author at start life: Marinus Vonhof
date of start life: 2013-02-05
units of measurements: m
alternative label: Niveau stroomopwaarts sluiten
comment: [is aspect]
scope note: Cof HYD
type: Class
subclass of: Hoogte t.o.v. NAP
subclass of: Restriction
  author of change: Marinus Vonhof
  date of change: 2019-05-15
  author at start life: Marinus Vonhof
  date of start life: 2013-02-05
  on class: Mechanische afsluiter
  on property: has as aspect (inverse)
  max qualified cardinality: 1
subclass of: Restriction
  on property: has as value
  all values from: decimal

Mof
definition: Een hulpstuk bestemd voor het verbinden van twee leidingen
author at start life: Wouter van Riel
date of start life: 2024-04-20
scope note: Cof MDS
scope note: Cof LDR
scope note: Cof PLI
scope note: Cof HYD
type: Class
subclass of: Verbindingsstuk
subclass of: Restriction
  on property: heeft Functie
  has value: Verbinden van twee leidingen

Molgoot
author of change: Marinus Vonhof
date of change: 2019-04-30
definition: Goot in de lengterichting van de verharding, met veelal een cirkelsegment als dwarsprofiel.
definition: [NEN 3300:1996] verdieping langs de rand van het wegoppervlak voor de afvoer van op het wegoppervlak gevallen neerslag
author at start life: Finy Teitsma (Oranjewoud)
date of start life: 2007-10-23
scope note: Cof MDS
scope note: Cof HYD
type: Class
subclass of: Goot
subclass of: Restriction
  on property: heeft Uitvoering
  has value: Met een cirkelsegment als dwarsprofiel

Taludgoot
author of change: Johan Post
date of change: 2021-10-01
definition: Goot die in het talud loodrecht op de kruinlijn is aangebracht.
author at start life: Finy Teitsma (Oranjewoud)
date of start life: 2007-10-23
scope note: Cof MDS
scope note: Cof HYD
type: Class
subclass of: Goot
subclass of: Restriction
  on property: heeft Uitvoering
  has value: In een talud loodrecht op de kruinlijn aangebracht

Schildmuur
author of change: Marinus Vonhof
author of change: Johan Post
date of change: 2025-01-16
date of change: 2019-04-05
definition: [IMBOR] Een scheiding, vaak gemaakt van metselwerk, die in een put aangebracht kan worden om de stroming door de put aan te passen.
author at start life: Marinus Vonhof
date of start life: 2013-10-04
validity context: 1d
comment: Een schildmuur is topologisch gezien een verbinding (zoals wand, pomp, doorlaat). Een schildmuur kan ook als knooppunt beschreven worden, gebruik dan het concept "Schildmuur (eindkap)".
scope note: Cof MDS
scope note: Cof HYD
scope note: Cof DMO
type: Class
subclass of: Wand
subclass of: Restriction
  on property: heeft Functie
  has value: Volledig keren van water

Roostergoot
author of change: Johan Post
date of change: 2021-10-01
definition: Goot die aan de bovenzijde is afgedekt met een metalen rooster.
author at start life: Finy Teitsma (Oranjewoud)
date of start life: 2007-10-23
scope note: Cof MDS
scope note: Cof HYD
type: Class
subclass of: Lijngoot
subclass of: Restriction
  on property: heeft Uitvoering
  has value: Afgedekt met een metalen rooster

Wadi
author of change: Marinus Vonhof
author of change: Johan Post
date of change: 2025-01-16
date of change: 2024-04-30
date of change: 2017-05-31
definition: Een verdiept terrein, bestemd om het hemelwater tijdelijk te bergen, voorzien van waterdoorlatende bodem waardoor water door middel van infiltratie door de bodem kan worden afgevoerd.
definition: [IMBOR] Een (beplante) laagte, bestemd om het hemelwater tijdelijk te bergen en in de bodem te laten infiltreren. Voorzien van een infiltratiebed en veelal van infiltratiekratten.
definition: [IMBOR] Een verdiept terrein met waterdoorlatende bodem bestemd voor de inzameling van hemelwater, waarbij dit water door middel van infiltratie door de bodem kan worden afgevoerd.
definition: [NEN 3300:1996] verdiept terrein waarop overstort- of regenwater wordt geloosd om in de bodem te infiltreren.
author at start life: Finy Teitsma (Oranjewoud)
date of start life: 2007-10-23
comment: Vanaf versie 1.7.0 is de wadi een groepering van objecten geworden (was een reservoir), daarmee vervallen de kenmerken Breedte Bouwwerk, Lengte Bouwwerk en dergelijke. Gebruik nu de geometrie Buitengrens om de afmeting te beschijven.
see also: [Waterkring West] Een bufferings- en infiltratievoorziening, die tijdelijk gevuld is met hemelwater. De naam verwijst naar de Arabische naam voor een vaak droogstaand rivierdal en is ook een acroniem van Water Afvoer Door Infiltratie.
alternative label: Infiltratieveld
scope note: Cof MDS
scope note: Cof HYD
type: Class
subclass of: Begroeide infiltratievoorziening
subclass of: Restriction
  on property: heeft Uitvoering
  has value: Beplante/begroeide laagte

Noodoverstortput
author of change: Finy Teitsma (Oranjewoud)
date of change: 2007-11-12
definition: Een externe overstortput aangelegd voor afvoer als gevolg van een calamiteit.
author at start life: Finy Teitsma (Oranjewoud)
date of start life: 2007-10-23
alternative label: Noodoverlaat
scope note: Cof MDS
scope note: Cof HYD
scope note: Cof DMO
type: Class
subclass of: Externe overstortput
subclass of: Restriction
  on property: heeft Functie
  has value: Bij calamiteit afvalwater afvoeren

Nooduitlaat
author of change: Marinus Vonhof
date of change: 2015-03-01
definition: Een uitlaat aangelegd voor afvoer als gevolg van een calamiteit.
definition: [NEN 3300:1996] constructie voor de lozing van afvalwater op het oppervlaktewater bij calamiteiten
author at start life: Finy Teitsma (Oranjewoud)
date of start life: 2007-10-23
scope note: Cof MDS
scope note: Cof HYD
scope note: Cof DMO
type: Class
subclass of: Uitlaatconstructie
subclass of: Restriction
  on property: heeft Functie
  has value: Bij calamiteit afvalwater afvoeren
subclass of: Restriction
  on property: heeft Toepassing
  has value: Calamiteit
subclass of: Restriction
  on property: heeft Functie
  has value: Lozen afvalwater

Ondergrondse infiltratievoorziening
definition: Een ondergrondse voorziening (infiltratieriool, infiltratieput, infiltratiekolk, infiltratiekrat, -koffer en/of bassin) met waterdoorlatende wanden, waarin het hemelwater wordt ingezameld, getransporteerd en tijdelijk wordt geborgen en waarbij het hemelwater via de wanden en bodem infiltreert in de ondergrond. Bij overbelasting en voor de vertraagde leegloop van de voorziening kunnen onderdelen (drainage, noodoverstort, slokop etc.) zijn aangebracht voor het reguleren van hemelwater- en grondwater.
author at start life: Marinus Vonhof
date of start life: 2026-07-13
scope note: Cof MDS
scope note: Cof HYD
type: Class
subclass of: Infiltratievoorziening
subclass of: Restriction
  on property: heeft Uitvoering
  has value: Gelegen onder maaiveld

Onverhard oppervlak hellend
notation: ONV_HEL
author at start life: Marinus Vonhof
date of start life: 2011-12-15
units of measurements: m2
comment: [is aspect]
scope note: Cof MDS
scope note: Cof HYD
type: Class
subclass of: Afvoerend oppervlak hellend
subclass of: Restriction
  on property: has as value
  all values from: Onverhard oppervlak hellend (datatype)

Onverhard oppervlak vlak
notation: ONV_VLA
author at start life: Marinus Vonhof
date of start life: 2011-12-15
units of measurements: m2
comment: [is aspect]
scope note: Cof MDS
scope note: Cof HYD
type: Class
subclass of: Afvoerend oppervlak vlak
subclass of: Restriction
  on property: has as value
  all values from: Onverhard oppervlak vlak (datatype)

Onverhard oppervlak vlak uitgestrekt
notation: ONV_VLU
author at start life: Marinus Vonhof
date of start life: 2011-12-15
units of measurements: m2
comment: [is aspect]
scope note: Cof MDS
scope note: Cof HYD
type: Class
subclass of: Afvoerend oppervlak vlak uitgestrekt
subclass of: Restriction
  on property: has as value
  all values from: Onverhard oppervlak vlak uitgestrekt (datatype)

Projectreferentie opdrachtnemer
notation: EBI
author at start life: Marinus Vonhof
date of start life: 2015-10-26
validity context: 3d 6d 14d
comment: [is aspect]
scope note: Cof TOP
type: Class
subclass of: Unieke identificatie
subclass of: Restriction
  author at start life: Marinus Vonhof
  date of start life: 2015-10-26
  validity context: 1t 10t 12t
  on class: Project
  on property: has as aspect (inverse)
  max qualified cardinality: 1

Open verhard oppervlak hellend
notation: OVH_HEL
author at start life: Marinus Vonhof
date of start life: 2011-12-15
units of measurements: m2
comment: [is aspect]
scope note: Cof MDS
scope note: Cof HYD
type: Class
subclass of: Afvoerend oppervlak hellend
subclass of: Restriction
  on property: has as value
  all values from: Open verhard oppervlak hellend (datatype)

Open verhard oppervlak vlak
notation: OVH_VLA
author at start life: Marinus Vonhof
date of start life: 2011-12-15
units of measurements: m2
comment: [is aspect]
scope note: Cof MDS
scope note: Cof HYD
type: Class
subclass of: Afvoerend oppervlak vlak
subclass of: Restriction
  on property: has as value
  all values from: Open verhard oppervlak vlak (datatype)

Open verhard oppervlak vlak uitgestrekt
notation: OVH_VLU
author at start life: Marinus Vonhof
date of start life: 2011-12-15
units of measurements: m2
comment: [is aspect]
scope note: Cof MDS
scope note: Cof HYD
type: Class
subclass of: Afvoerend oppervlak vlak uitgestrekt
subclass of: Restriction
  on property: has as value
  all values from: Open verhard oppervlak vlak uitgestrekt (datatype)

Opening in wand
author of change: Marinus Vonhof
date of change: 2025-01-16
date of change: 2019-05-15
definition: Een opening in een wand zonder afvoerregeling
definition: [IMBOR] Een doorlaat in de vorm van een opening in een wand.
author at start life: Marinus Vonhof
date of start life: 2012-04-24
comment: Als de opening gecombineerd is met bijvoorbeeld een klep of schuif, gebruik dan een subtype van Mechanische Afsluiter als hydraulisch element
scope note: Cof MDS
scope note: Cof REV
scope note: Cof HYD
scope note: Cof DMO
type: Class
subclass of: Doorlaat
subclass of: Restriction
  author of change: Marinus Vonhof
  date of change: 2018-12-12
  author at start life: Marinus Vonhof
  date of start life: 2015-09-07
  on class: Stuwconstructie
  on property: has as part (inverse)
  qualified cardinality: 1
subclass of: Restriction
  author of change: Marinus Vonhof
  date of change: 2018-12-12
  author at start life: Marinus Vonhof
  date of start life: 2017-12-07
  on class: Stuwput
  on property: has as part (inverse)
  max qualified cardinality: 1
subclass of: Restriction
  on property: heeft Uitvoering
  has value: Uitsparing in wand

Waarneming
label: Observation @en
author of change: Marinus Vonhof
date of change: 2018-04-06
author at start life: Marinus Vonhof
date of start life: 2013-01-07
validity context: 5d 6d 11d
comment: Was specialisatie van Inspecteren
scope note: Cof TOP
type: Class
subclass of: Activiteit

Opvoergemaal
author of change: Marinus Vonhof
date of change: 2025-01-16
date of change: 2019-01-11
definition: Een gemaal in een vrijverval rioolstelsel voor het verpompen van afvalwater naar een hoger gelegen vrijverval rioolstelsel zonder gebruik te maken van een persleiding buiten het bouwwerk.
author at start life: Nic Roest (Idoro)
date of start life: 2007-11-29
scope note: Cof MDS
scope note: Cof HYD
scope note: Cof RGM
scope note: Cof DMO
type: Class
subclass of: Rioolgemaal
subclass of: Restriction
  on property: heeft Uitvoering
  has value: Verpompt binnen het bouwwerk

Overgangsstuk
definition: [NEN 3300:1996] hulpstuk voor het verbinden van twee buizen van verschillende materialen of verbindingstypen
author at start life: Marinus Vonhof
date of start life: 2012-04-29
scope note: Cof MDS
scope note: Cof LDR
scope note: Cof PLI
scope note: Cof HYD
type: Class
subclass of: Verbindingsstuk
subclass of: Restriction
  on property: heeft Functie
  has value: Verbinden van leidingen met verschillend materiaal of verbindingstype

Riooleindgemaal
author of change: Marinus Vonhof
date of change: 2025-01-16
date of change: 2017-04-06
definition: Het rioolgemaal waar de overdracht plaatsvindt van een stelsel onder beheer van een gemeente naar een stelsel of ontvangstput onder beheer van een waterschap.
author at start life: Marinus Vonhof
date of start life: 2014-11-30
see also: [IRIS-RIOKEN:2012] Voor het waterschap zijn in principe alleen de riooleindgemalen interessant, waar overdracht van afvalwater plaatsvindt naar een stelsel dat onder beheer van dit waterschap is.
alternative label: Overnamegemaal
scope note: Cof MDS
scope note: Cof HYD
scope note: Cof RGM
scope note: Cof DMO
type: Class
subclass of: Rioolgemaal
subclass of: Restriction
  on property: heeft Toepassing
  has value: Is overdrachtspunt

Overstortbemaling
author of change: Marinus Vonhof
author of change: Johan Post
date of change: 2016-04-15
date of change: 2024-04-30
date of change: 2024-07-15
definition: Bemaling, meestal naar oppervlaktewater, die eerst dan in werking treedt als een bepaald peil in het rioolstelsel is bereikt
definition: [NEN 3300:1996] aanvullende bemaling, meestal naar oppervlaktewater, die eerst dan in werking treedt als een bepaald peil in het rioolstelsel is bereikt
author at start life: Marinus Vonhof
date of start life: 2012-04-29
scope note: Cof BAS
scope note: Cof HYD
scope note: Cof RGM
type: Class
subclass of: Constructieonderdeel
subclass of: Restriction
  author of change: Marinus Vonhof
  date of change: 2024-05-17
  on class: Overstortput
  on property: has as part (inverse)
  max qualified cardinality: 1
subclass of: Restriction
  author at start life: Marinus Vonhof
  date of start life: 2024-07-15
  on class: Rioolgemaal
  on property: has as part (inverse)
  max qualified cardinality: 1
subclass of: Restriction
  author at start life: Wouter van Riel
  date of start life: 2022-09-26
  on class: Constructieonderdeeloriëntatie
  on property: has as aspect
  max qualified cardinality: 1
subclass of: Restriction
  on property: heeft Functie
  has value: Aanvullende bemaling
subclass of: Restriction
  on class: Pomp
  on property: has as part
  min qualified cardinality: 1

Overstortleiding
author of change: Finy Teitsma (Oranjewoud)
date of change: 2007-11-12
definition: Een gesloten rioolleiding voor het transport van het afvalwater van een overstortput naar het lozingspunt
definition: [NEN 3300:1996] riool bestemd voor de afvoer van afvalwater geloosd via een overstort
author at start life: Finy Teitsma (Oranjewoud)
date of start life: 2007-10-23
alternative label: Overstortriool
scope note: Cof MDS
scope note: Cof REV
scope note: Cof HYD
type: Class
subclass of: Vrijverval rioolleiding
subclass of: Restriction
  on property: heeft Functie
  has value: Transport van overstortend afvalwater

Persluchtpomp
author of change: Finy Teitsma (Oranjewoud)
date of change: 2007-10-25
definition: Een pomp waarbij de vloeistof door middel van perslucht wordt verplaatst.
author at start life: Finy Teitsma (Oranjewoud)
date of start life: 2007-10-24
scope note: Cof BAS
scope note: Cof HYD
scope note: Cof RGM
scope note: Cof DMO
type: Class
subclass of: Pomp
subclass of: Restriction
  on property: heeft Technologie
  has value: Verplaatsing door middel van perslucht

Projectreferentie opdrachtgever
label: Employers job reference @en
definition: [EN13508-2+A1] De opdrachtcode van de opdrachtgever
definition: [EN13508-2+A1] The employer’s job reference code @en
notation: ABJ
notation: CBJ
notation: EBJ
notation: GBJ
notation: JBJ
author at start life: Marinus Vonhof
date of start life: 2011-12-02
validity context: 3d 6d 14d
alternative label: Opdrachtcode opdrachtgever (EN)
comment: [is aspect]
scope note: Cof TOP
type: Class
subclass of: Unieke identificatie
subclass of: Restriction
  author of change: Marinus Vonhof
  date of change: 2015-10-26
  author at start life: Marinus Vonhof
  date of start life: 2011-12-02
  validity context: 1t 10t 12t
  on class: Project
  on property: has as aspect (inverse)
  max qualified cardinality: 1

Putbuis
author of change: Marinus Vonhof
date of change: 2025-01-16
date of change: 2018-12-11
definition: Een inspectieschacht aangebracht op een buis met grote afmeting
author at start life: Marinus Vonhof
date of start life: 2018-12-05
scope note: Cof MDS
scope note: Cof REV
scope note: Cof HYD
type: Class
subclass of: Rioolput
subclass of: Restriction
  on property: heeft Uitvoering
  has value: Inspectieschacht op leiding

Reinigende put
author of change: Marinus Vonhof
date of change: 2018-12-05
definition: Een rioolput met een fysisch reinigende voorziening, waarbij de vervuiling wordt gescheiden van het afvalwater. Kan ook beschouwd worden als een soort reinigende voorziening.
author at start life: Finy Teitsma (Oranjewoud)
date of start life: 2006-11-29
scope note: Cof MDS
scope note: Cof HYD
type: Class
subclass of: Inspectieput
subclass of: Restriction
  on property: heeft Uitvoering
  has value: Bevat fysisch reinigende voorziening
subclass of: Restriction
  on property: heeft Technologie
  has value: Fysisch reinigen
subclass of: Restriction
  on property: heeft Functie
  has value: Verwijderen vervuiling

SDR-waarde
label: Standard dimension ratio @en
author of change: Marinus Vonhof
date of change: 2019-09-02
definition: De SDR-waarde (Standard Dimension Ratio) is gebaseerd op de kunststof leiding in nieuwstaat. Het is de waarde van de buitendiameter van de leiding gedeeld door de wanddikte van de leiding.
author at start life: Marinus Vonhof
date of start life: 2019-03-20
alternative label: Buiskengetal
comment: [is aspect]
scope note: Cof PLI
scope note: Cof HYD
type: Class
subclass of: Kenmerk
subclass of: Restriction
  author at start life: Marinus Vonhof
  date of start life: 2024-05-16
  on class: Rioolleiding
  on property: has as aspect (inverse)
  max qualified cardinality: 1
subclass of: Restriction
  author at start life: Marinus Vonhof
  date of start life: 2024-05-16
  on class: Transportleiding
  on property: has as aspect (inverse)
  max qualified cardinality: 1
subclass of: Restriction
  author at start life: Marinus Vonhof
  date of start life: 2025-11-11
  on property: has as value
  all values from: integer

Schildmuur (eindkap)
definition: Een schildmuur als eindkap (knooppunt). Bevindt zich aan het eind van een leiding (uitlegger), zonder verdere koppeling met een put en dergelijke.
author at start life: Marinus Vonhof
date of start life: 2026-07-16
scope note: Cof HYD
type: Class
subclass of: Hulpstuk
subclass of: Restriction
  on property: heeft Functie
  has value: Afsluiten van leidingen

Schroefcentrifugaalpomp
author of change: Marinus Vonhof
date of change: 2016-04-13
definition: Een pomp waarbij de vloeistof door middel van een schroefcentrifugaalwaaier wordt verplaatst.
author at start life: Finy Teitsma (Oranjewoud)
date of start life: 2007-10-24
scope note: Cof BAS
scope note: Cof HYD
scope note: Cof RGM
scope note: Cof DMO
type: Class
subclass of: Pomp
subclass of: Restriction
  on property: heeft Technologie
  has value: Verplaatsing door middel van een draaiende schroef

Schroefpomp
author of change: Finy Teitsma (Oranjewoud)
date of change: 2007-10-25
definition: Een pomp waarbij de vloeistof door middel van een schroef wordt verplaatst.
author at start life: Finy Teitsma (Oranjewoud)
date of start life: 2007-10-24
scope note: Cof BAS
scope note: Cof HYD
scope note: Cof RGM
scope note: Cof DMO
type: Class
subclass of: Pomp
subclass of: Restriction
  on property: heeft Technologie
  has value: Verplaatsing door middel van een schroef

Spoelgemaal
author of change: Marinus Vonhof
date of change: 2025-01-16
definition: Een gemaal voor het verpompen van spoelwater
author at start life: Eric van Gorkom
date of start life: 2022-09-27
validity context: 11d 12d
scope note: Cof MDS
scope note: Cof HYD
scope note: Cof RGM
type: Class
subclass of: Gemaal
subclass of: Restriction
  on property: heeft Functie
  has value: Verpompt spoelwater

Stuwklep
author of change: Marinus Vonhof
definition: Klep als onderdeel van de stuwconstructie
author at start life: Marinus Vonhof
date of start life: 2026-07-17
date of start life: 2020-04-17
scope note: Cof HYD
type: Class
subclass of: Keerklep
subclass of: Restriction
  author of change: Marinus Vonhof
  date of change: 2020-04-17
  author at start life: Marinus Vonhof
  date of start life: 2014-04-29
  on class: Stuwconstructie
  on property: has as part (inverse)
  max qualified cardinality: 1
subclass of: Restriction
  on property: heeft Toepassing
  has value: Deel van een stuwconstructie
subclass of: Restriction
  author of change: Marinus Vonhof
  date of change: 2020-04-17
  author at start life: Marinus Vonhof
  date of start life: 2017-12-07
  on class: Stuwput
  on property: has as part (inverse)
  max qualified cardinality: 1

Wervelventiel
label: Vortex flow control @en
author of change: Marinus Vonhof
date of change: 2017-12-13
definition: [NEN 3300:1996] doorlaat die het debiet regelt
notation: D
author at start life: Nic Roest (Idoro)
date of start life: 2007-11-29
validity context: 1d 3d
scope note: Cof MDS
scope note: Cof REV
scope note: Cof HYD
scope note: Cof DMO
type: Class
subclass of: Doorlaat
subclass of: Restriction
  author at start life: Marinus Vonhof
  date of start life: 2018-12-12
  on class: Stuwconstructie
  on property: has as part (inverse)
  max qualified cardinality: 1
subclass of: Restriction
  author at start life: Marinus Vonhof
  date of start life: 2018-12-12
  on class: Stuwput
  on property: has as part (inverse)
  max qualified cardinality: 1
subclass of: Restriction
  on property: heeft Functie
  has value: Afremmen van de stroomsnelheid van het afvalwater

Stuwrioolleiding
author of change: Finy Teitsma (Oranjewoud)
date of change: 2007-11-12
definition: Een gesloten rioolleiding met een verkleinde doorsnede om de bergingscapaciteit van het bovenstroomse rioolstelsel te benutten.
definition: [NEN 3300:1996] 1. riool met een verkleinde doorsnede om de bergingscapaciteit bovenstrooms door stuwen van afvalwater te vergroten; 2. riool om de afvoer te beperken
author at start life: Finy Teitsma (Oranjewoud)
date of start life: 2006-11-29
alternative label: Knijpriool
alternative label: Stuwriool
scope note: Cof MDS
scope note: Cof HYD
type: Class
subclass of: Vrijverval rioolleiding
subclass of: Restriction
  on property: heeft Functie
  has value: Regelen van het debiet om de bergingscapaciteit van het bovenstroomse rioolstelsel te benutten

Verholen goot
author of change: Johan Post
date of change: 2021-10-01
definition: Grotendeels overdekte goot waarvan de bovenkant gelijk ligt met het oppervlak van de verharding.
author at start life: Finy Teitsma (Oranjewoud)
date of start life: 2007-10-23
scope note: Cof MDS
scope note: Cof HYD
type: Class
subclass of: Goot
subclass of: Restriction
  on property: heeft Uitvoering
  has value: Grotendeels overdekt, bovenkant gelijk met de verharding.
subclass of: Restriction
  on class: Goot
  on property: is represented by (inverse)
  max qualified cardinality: 1

Vrijverval leidingsegment
author of change: Marinus Vonhof
author of change: Johan Post
date of change: 2025-01-16
date of change: 2021-10-01
definition: Deel van een vrijverval rioolleiding begrensd door wijziging materiaal, wijziging afmeting of locatie appendages
author at start life: Marinus Vonhof
date of start life: 2018-12-06
scope note: Cof MDS
scope note: Cof HYD
scope note: Cof DMO
type: Class
subclass of: Vrijverval transportleiding
subclass of: Restriction
  author of change: Marinus Vonhof
  date of change: 2025-01-03
  author at start life: Marinus Vonhof
  date of start life: 2018-12-06
  on class: Transportrioolleiding
  on property: has as part (inverse)
  max qualified cardinality: 1
subclass of: Restriction
  on property: heeft Uitvoering
  has value: Deel van vrijverval transportleiding

Terugslagklep
label: Non-return valve @en
author of change: Marinus Vonhof
date of change: 2019-05-15
definition: [NEN 3300:1996] Afsluitconstructie waardoor stroming in slechts één richting mogelijk is. Het scharnierpunt zit aan de bovenzijde
author at start life: Finy Teitsma (Oranjewoud)
date of start life: 2007-10-23
comment: 20151014: NEN3300-definitie aangepast
scope note: Cof PLI
scope note: Cof HYD
type: Class
subclass of: Keerklep
subclass of: Restriction
  on property: heeft Uitvoering
  has value: Met scharnier aan de bovenzijde

Tunnelgemaal
author of change: Marinus Vonhof
date of change: 2025-01-16
definition: Een gemaal dat hemelwater verpompt uit een tunnel
author at start life: Marinus Vonhof
date of start life: 2018-05-03
scope note: Cof MDS
scope note: Cof HYD
scope note: Cof RGM
scope note: Cof DMO
type: Class
subclass of: Rioolgemaal
subclass of: Restriction
  on property: heeft Doel
  has value: Tunnel drooghouden
subclass of: Restriction
  on property: heeft Functie
  has value: Verpompt tunnelwater

Type afvoerend oppervlak (coll)
definition: Verzameling identificaties van type neerslag-afvoer. Identificeert de regel in definitiebestand neerslag-afvoer (bijoorbeeld nwrw.csv)
comment: [is coll]
scope note: Cof HDX
type: Class
subclass of: Verzameling soorten
subclass of: Class
  one of: Gesloten verhard oppervlak hellend
  one of: Gesloten verhard oppervlak vlak
  one of: Gesloten verhard oppervlak vlak uitgestrekt
  one of: Open verhard oppervlak hellend
  one of: Open verhard oppervlak vlak
  one of: Open verhard oppervlak vlak uitgestrekt
  one of: Dakoppervlak hellend
  one of: Dakoppervlak vlak
  one of: Dakoppervlak vlak uitgestrekt
  one of: Onverhard oppervlak hellend
  one of: Onverhard oppervlak vlak
  one of: Onverhard oppervlak vlak uitgestrekt

Type knooppunt (coll)
comment: [is coll]
scope note: Cof HDX
type: Class
subclass of: Verzameling soorten
subclass of: Class
  one of: Inspectieput
  one of: Infiltratieput
  one of: Compartiment
  one of: Uitlaat

Uitlaat
label: Outfall @en
author of change: Marinus Vonhof
date of change: 2018-12-05
definition: De aanduiding van een uitstroommogelijkheid, het is een punt (leidinguiteinde) of constructie (zie ook de EN/NEN definitie). De uitlaat wordt binnen het stelsel (netwerk) altijd beschreven als "Uitlaat (punt)", eventueel in combinatie met een "Uitlaatconstructie".
definition: [EN 16323:2014] structure or point from which wastewater is discharged to a wastewater treatment plant or receiving water @en
definition: [NEN-EN 752:2008] constructie of punt van waaruit afvalwater wordt geloosd naar een afvalwaterzuiveringsinstallatie of ontvangend water [EN 1085:2007, definitie 1280]
definition: [Omgevingswet] Opening waardoor water stroomt of onttrokken wordt aan een reservoir of oppervlaktewaterlichaam
notation: UIT
author at start life: Marinus Vonhof
date of start life: 2017-09-08
scope note: Cof HYD
type: Class
subclass of: Representatie fysiek object

Type kunstwerk (coll)
comment: [is coll]
scope note: Cof HDX
type: Class
subclass of: Verzameling soorten
subclass of: Class
  one of: Overstortdrempel
  one of: Uitlaat
  one of: Doorlaat
  one of: Pomp

Uitstroombak
author of change: Marinus Vonhof
date of change: 2025-01-16
definition: [IMBOR] Een uitlaatconstructie aan de onderkant voorzien van een bakconstructie, waar uitgelaten water op terecht komt.
author at start life: Marinus Vonhof
date of start life: 2018-12-05
scope note: Cof MDS
scope note: Cof HYD
scope note: Cof DMO
type: Class
subclass of: Uitlaatconstructie
subclass of: Restriction
  on property: heeft Uitvoering
  has value: Vorm van een bak

Veerklep
definition: Voorzien van een veer om gestuurd te reageren op de vloeistofdruk.
author at start life: Marinus Vonhof
date of start life: 2026-07-17
scope note: Cof PLI
scope note: Cof HYD
type: Class
subclass of: Keerklep
subclass of: Restriction
  on property: heeft Uitvoering
  has value: Voorzien van een veer

Verbeterd gemengd rioolstelsel
author of change: Marinus Vonhof
date of change: 2015-09-20
definition: [NEN 3300:1996] gemengd rioolstelsel met (rand)voorzieningen die de vuiluitworp richting oppervlaktewater beperken ten opzichte van de traditionele gemengde rioolstelsels
author at start life: Marinus Vonhof
date of start life: 2012-04-29
scope note: Cof TOP
type: Class
subclass of: Gemengd rioolstelsel
subclass of: Restriction
  on property: heeft Doel
  has value: Verminderen vuilbelasting van oppervlaktewater

Verdekte put
author of change: Marinus Vonhof
author of change: Eric van Gorkom
date of change: 2022-09-27
date of change: 2014-12-02
date of change: 2024-08-01
definition: [NEN 3300:1996] rioolput waarvan de bovenzijde niet zichtbaar is
author at start life: Marinus Vonhof
date of start life: 2012-04-29
scope note: Cof REV
scope note: Cof BAS
scope note: Cof HYD
type: Class
subclass of: Put
subclass of: Extra objecttype (rol)
subclass of: Restriction
  on property: heeft Uitvoering
  has value: Bovenzijde niet zichtbaar

Verloopstuk
author of change: Marinus Vonhof
date of change: 2017-12-13
definition: [NEN 3300:1996] hulpstuk voor het verbinden van twee buizen van dezelfde materiaalsoort maar met verschillende diameters
author at start life: Marinus Vonhof
date of start life: 2013-09-28
scope note: Cof MDS
scope note: Cof LDR
scope note: Cof PLI
scope note: Cof HYD
type: Class
subclass of: Verbindingsstuk
subclass of: Restriction
  on property: heeft Functie
  has value: Verbinden van leidingen met verschillende diameter

Vijzelgemaal
author of change: Marinus Vonhof
date of change: 2025-01-16
date of change: 2017-05-31
definition: [IMBOR] Gemaal voor het verpompen van (afval)water met behulp van een vijzel.
author at start life: Marinus Vonhof
date of start life: 2013-10-04
scope note: Cof MDS
scope note: Cof HYD
scope note: Cof RGM
scope note: Cof DMO
type: Class
subclass of: Rioolgemaal
subclass of: Restriction
  author at start life: Marinus Vonhof
  date of start life: 2013-10-04
  on class: Vijzelpomp
  on property: has as part
  qualified cardinality: 1
subclass of: Restriction
  on property: heeft Technologie
  has value: Verpompen met een vijzel

Vijzelpomp
author of change: Finy Teitsma (Oranjewoud)
date of change: 2007-10-25
definition: Een pomp waarbij de vloeistof door middel van een vijzel wordt verplaatst.
author at start life: Finy Teitsma (Oranjewoud)
date of start life: 2007-10-24
scope note: Cof BAS
scope note: Cof HYD
scope note: Cof RGM
scope note: Cof DMO
type: Class
subclass of: Pomp
subclass of: Restriction
  author at start life: Marinus Vonhof
  date of start life: 2013-10-04
  on class: Vijzelgemaal
  on property: has as part (inverse)
  qualified cardinality: 1
subclass of: Restriction
  on property: heeft Technologie
  has value: Verplaatsing door middel van een vijzel

Vlinderklep
definition: Afsluitconstructie waarbij stroming in twee richtingen mogelijk is. De klep draait om haar middellijn.
author at start life: Marinus Vonhof
date of start life: 2019-05-15
scope note: Cof BAS
scope note: Cof PLI
scope note: Cof HYD
scope note: Cof DMO
type: Class
subclass of: Mechanische afsluiter
subclass of: Restriction
  on property: heeft Functie
  has value: Afsluiten in twee stroomrichtingen

Werveloverstortput
definition: [NEN 3300:1996] een overstortput waarbij een cilindrische vorm, een spiraalachtige goot, een duikschot en een langere drempel zijn toegepast en de inhoud voor de drempel is vergroot om de vuiluitworp tijdens overstorting te beperken
author at start life: Marinus Vonhof
date of start life: 2012-04-29
scope note: Cof MDS
scope note: Cof HYD
scope note: Cof DMO
type: Class
subclass of: Verbeterde overstortput
subclass of: Restriction
  on property: heeft Structuur
  has value: Cilindrische vorm
subclass of: Restriction
  on property: heeft Uitvoering
  has value: Spiraalachtige goot

Wervelput
author of change: Marinus Vonhof
date of change: 2017-05-31
definition: [NEN-EN 752:2008] ronde mantoegankelijke put waarin een groot niveauverschil wordt overbrugd doordat het afvalwater tangentiaal wordt ingelaten en spiraalsgewijs afstroomt
author at start life: Marinus Vonhof
date of start life: 2012-04-29
scope note: Cof MDS
scope note: Cof RRB
scope note: Cof LDR
scope note: Cof REV
scope note: Cof HYD
type: Class
subclass of: Rioolput
subclass of: Restriction
  on property: heeft Uitvoering
  has value: Mantoegankelijk
subclass of: Restriction
  on property: heeft Functie
  has value: Overbruggen groot niveauverschil
subclass of: Restriction
  on property: heeft Structuur
  has value: Rond
subclass of: Restriction
  on property: heeft Uitvoering
  has value: Tangentiaal inlaten en spiraalsgewijs laten afstromen

Y-stuk
author of change: Marinus Vonhof
date of change: 2025-01-16
definition: Een verbindingsstuk dat drie leidingen onder een niet-rechte hoek verbindt
definition: [IMBOR] Een verbindingsstuk in de vorm van een Y-splitsing.
author at start life: Marinus Vonhof
date of start life: 2017-05-31
validity context: 1d
scope note: Cof MDS
scope note: Cof LDR
scope note: Cof REV
scope note: Cof PLI
scope note: Cof HYD
type: Class
subclass of: Verbindingsstuk
subclass of: Restriction
  on property: heeft Functie
  has value: Verbinden van drie leidingen

Zinkerput
author of change: Marinus Vonhof
date of change: 2017-05-31
definition: [NEN 3300:1996] rioolput waarop een zinker is aangesloten
author at start life: Marinus Vonhof
date of start life: 2012-04-29
validity context: 1d 3d
scope note: Cof MDS
scope note: Cof RRB
scope note: Cof LDR
scope note: Cof REV
scope note: Cof HYD
type: Class
subclass of: Rioolput
subclass of: Restriction
  on property: heeft Functie
  has value: Toegang geven tot zinker

Zuigerpomp
author of change: Marinus Vonhof
date of change: 2015-09-20
definition: Een pomp waarbij de vloeistof door middel van een zuiger wordt verplaatst.
author at start life: Finy Teitsma (Oranjewoud)
date of start life: 2007-10-24
scope note: Cof BAS
scope note: Cof HYD
scope note: Cof RGM
scope note: Cof DMO
type: Class
subclass of: Pomp
subclass of: Restriction
  on property: heeft Technologie
  has value: Verplaatsing door middel van een zuiger

Anders
label: Other @en
definition: Geen standaard profiel. De geometrie kan beschreven worden met het kenmerk Profiel Leiding of Profiel Open Leiding
definition: Toelichting in attribuut NDE opnemen
notation: Z
validity context: 6d
see also: [RIB] Verdere informatie moet worden opgenomen in het opmerkingenveld van de waarneming
type: Vorm leiding (coll)

AHN
definition: Actueel Hoogtebestand Nederland (alle versies)
validity context: 16d
comment: Was AHN2 (tm versie 1.4)
type: Wijze van inwinning (coll)

AHN1
definition: Actueel Hoogtebestand Nederland (versie 1)
validity context: 16d
type: Wijze van inwinning (coll)

AHN2
definition: Actueel Hoogtebestand Nederland (versie 2, anno 2011)
validity context: 16d
type: Wijze van inwinning (coll)

AHN3
definition: Actueel Hoogtebestand Nederland (versie 3, anno 2015)
validity context: 16d
type: Wijze van inwinning (coll)

AHN4
definition: Actueel Hoogtebestand Nederland (versie 4, anno 2020)
validity context: 16d
type: Wijze van inwinning (coll)

Afgeleid
definition: Via interpolatie, extrapolatie of berekening
validity context: 16d
type: Wijze van inwinning (coll)

Afvalwaterakkoord
definition: Productie afvalwater gebaseerd op het afvalwaterakkoord
author at start life: Johan Post
date of start life: 2022-03-27
validity context: 16d
type: Wijze van inwinning (coll)

BGT
alternative label: IMGeo of BGT
type: Wijze van inwinning (coll)

Basisregistratie Adressen en Gebouwen (BAG)
definition: Afgeleid uit gegevens van de Basisregistratie Adressen en Gebouwen (BAG)
validity context: 16d
type: Wijze van inwinning (coll)

Bruto vloeroppervlak
definition: Productie afvalwater gebaseerd op een vergunning
author at start life: Johan Post
date of start life: 2022-05-05
validity context: 16d
type: Wijze van inwinning (coll)

CBS
definition: Centraal Bureau voor de Statistiek
validity context: 16d
type: Wijze van inwinning (coll)

Drinkwaterverbruik
definition: Productie afvalwater gebaseerd op het drinkwaterverbruik
author at start life: Johan Post
date of start life: 2022-03-27
validity context: 16d
type: Wijze van inwinning (coll)

GBKN
validity context: 16d
type: Wijze van inwinning (coll)

GNSS Landmeting
author of change: Johan Post
date of change: 2024-05-01
definition: GNSS staat voor global navigation sattelite system, wat naast GPS ook het Europese Galileo, het Russische Glonass en het Chinese Beidoe omvat.
type: Wijze van inwinning (coll)

GNSS Vanuit wagen
author of change: Johan Post
date of change: 2024-05-01
definition: Bijvoorbeeld tijdens kolkenreinigen
type: Wijze van inwinning (coll)

Grondradar
author of change: Marinus Vonhof
date of change: 2025-01-16
date of change: 2024-11-07
definition: Door middel van radarmeting vanaf maaivled
definition: [IMBOR] Het gegeven over het object is ingewonnen door middel van een meetinstrument dat signalen uitzendt richting de bodem en opvangt voor het verrichten van bodemonderzoek. De situatie in de ondergrond wordt in kaart gebracht door een profiel te ontwikkelen op basis van de ontvangen signalen.
author at start life: Marinus Vonhof
date of start life: 2024-11-07
validity context: 16d
type: Wijze van inwinning (coll)

Inmeting
author of change: Marinus Vonhof
date of change: 2025-01-16
definition: Met waterpastoestel, theodoliet, meetlint
definition: [IMBOR] Het gegeven over het object is ingewonnen door middel van een nader te specificeren meetinstrument dat, bijvoorbeeld, gebruikt is om de exacte omvang of de inhoud van een object op te meten.
type: Wijze van inwinning (coll)

Inspectie
author of change: Marinus Vonhof
date of change: 2025-01-16
definition: Via uitgevoerde inspectie
definition: [IMBOR] De wijze waarop het gegeven over het object is ingewonnen is middels het beoordelen van het object in de daadwerkelijke buitenruimte.
validity context: 16d
type: Wijze van inwinning (coll)

LIDAR 3D
author at start life: Johan Post
date of start life: 2026-05-04
type: Wijze van inwinning (coll)

Luchtfoto
author of change: Marinus Vonhof
date of change: 2025-01-16
definition: [IMBOR] Het gegeven over het object is ingewonnen door middel van grootschalige fotografie vanuit een helikopter, vliegtuig of door een drone.
validity context: 16d
type: Wijze van inwinning (coll)

Niet kunnen achterhalen
author of change: Johan Post
date of change: 2022-09-22
definition: Een poging om het gevraagde kenmerk te achterhalen is niet succesvol geweest
validity context: 16d
type: Wijze van inwinning (coll)

Objecttype niet kunnen achterhalen
definition: Een poging om het objecttype te achterhalen is niet succesvol geweest
author at start life: Johan Post
date of start life: 2026-08-12
type: Wijze van inwinning (coll)

Plan/Ontwerp
validity context: 16d
alternative label: Plan of ontwerp
type: Wijze van inwinning (coll)

Revisie
author of change: Marinus Vonhof
date of change: 2025-01-16
definition: Via uitgevoerde revisie
definition: [IMBOR] De wijze waarop het gegeven over het object is ingewonnen is middels gegevens die zijn ontvangen aangaande de herziening van het object of de omgeving.
validity context: 16d
type: Wijze van inwinning (coll)

Schatting
author of change: Marinus Vonhof
date of change: 2025-01-16
definition: [IMBOR] Het gegeven over het object is ingewonnen door middel van een bepaling met een bepaalde onzekerheid van welke aard dan ook.
validity context: 16d
type: Wijze van inwinning (coll)

Sensor (inwinning)
validity context: 16d
type: Wijze van inwinning (coll)

Vergunning
author of change: Marinus Vonhof
date of change: 2025-01-16
definition: Productie afvalwater gebaseerd op een vergunning
definition: [IMBOR] Een document dat een officiële toestemming van de overheid om een bepaalde activiteit uit te voeren vastlegt ter raadpleging door derden.
author at start life: Johan Post
date of start life: 2022-03-27
validity context: 16d
type: Wijze van inwinning (coll)

Waterpassing
definition: Een specificatie van inmeting
author at start life: Marinus Vonhof
date of start life: 2025-10-07
type: Wijze van inwinning (coll)

Direct transport door pompen zonder opvang in een ontvangput/kelder
type: Technologie

Verplaatsing door middel van een draaiend rad
type: Technologie

Door middel van drukverschil
type: Technologie

Transport onder overdruk
type: Technologie

Fysisch reinigen
type: Technologie

Over bestaande leiding gebouwd
type: Technologie

Infiltreren
type: Technologie

Mechanisch
type: Technologie

Transport onder overdruk of onderdruk
type: Technologie

Verplaatsing door middel van perslucht
type: Technologie

Verplaatsing door middel van een draaiende schroef
type: Technologie

Verplaatsing door middel van een schroef
type: Technologie

Statisch
type: Technologie

Transport door de zwaartekracht
type: Technologie

Verplaatsing door middel van een vijzel
type: Technologie

Verplaatsing door middel van een zuiger
type: Technologie

Verpompen met een vijzel
type: Technologie

Afgedekt met een metalen rooster
type: Uitvoering

Voorzien van een inwendige bal
type: Uitvoering

Verdiept terrein met waterdoorlatende bodem
type: Uitvoering

Bekleding buitenzijde object
type: Uitvoering

Bekleding met doek
type: Uitvoering

Beplante/begroeide laagte
type: Uitvoering

Uitgevoerd als leiding
type: Uitvoering

In de berm
type: Uitvoering
type: Toepassing

Beton
label: Concrete @en
author of change: Marinus Vonhof
date of change: 2025-01-16
definition: [IMBOR] Een kunstmatig, steenachtig materiaal dat veelal is samengesteld uit het bindmiddel cement en uit een of meer toeslagmaterialen zoals zand, grind of steenslag.
notation: BET
notation: AG
notation: BETON
type: Uitvoering
type: Mechanisme
type: Materiaal deksel (coll)
type: Materiaal (hydx) (coll)
type: Materiaal leiding (coll)
type: Materiaal put (coll)

Bevat fysisch reinigende voorziening
type: Uitvoering

Put met speciale voorzieningen
type: Uitvoering

Geen opening aan de bovenzijde
type: Uitvoering

Buis in gebogen vorm
type: Uitvoering

Constructie van enige omvang
type: Uitvoering

Verbonden met de grond
type: Uitvoering

Bovenzijde niet zichtbaar
type: Uitvoering

Deel van mechanische transportleiding
type: Uitvoering

Deel van vrijverval transportleiding
type: Uitvoering

Waterdoorlatende wanden
type: Uitvoering

Geheel van verbonden DIT riolen, drains en hemelwaterriolen
type: Uitvoering

Vrijstaand, overdekt, omsloten en toegankelijk
type: Uitvoering

Gegraven of geboorde kokervormige diepte
type: Uitvoering

Geheel van stelsels
type: Uitvoering

Geheel van verbonden infiltratievoorzieningen
type: Uitvoering

Opstelling pomp(en) buiten de ontvangput/kelder
type: Uitvoering

Opstelling pomp(en) in de ontvangput/kelder
type: Uitvoering

Open en aansluitend aan verharding
type: Uitvoering

Opening aan de bovenzijde
type: Uitvoering

Grotendeels overdekt, bovenkant gelijk met de verharding.
type: Uitvoering

In de vorm van een goot
type: Uitvoering

In de vorm van een greppel
type: Uitvoering

In een talud loodrecht op de kruinlijn aangebracht
type: Uitvoering

Onderdeel van de weg
type: Uitvoering

Toegankelijk voor inspectie- en reinigingsapparatuur
type: Uitvoering

Verwijderbaar deksel
type: Uitvoering

Inspectieschacht op leiding
type: Uitvoering

Langere drempel
type: Uitvoering

Langs verharding met afdekking
type: Uitvoering

Naar ander rioolstelsel
type: Uitvoering

Verpompt met een luchtcompressor
type: Uitvoering

Mantoegankelijk
type: Uitvoering

Staal
label: Steel @en
author of change: Marinus Vonhof
date of change: 2025-01-16
definition: [IMBOR] Een legering die bestaat uit ijzer en een geringe hoeveelheid koolstof, zodanig dat dit metaal gekarakteriseerd wordt door de eigenschap van vervormbaarheid bij verhitting.
notation: AP
notation: STAAL
notation: STL
type: Uitvoering
type: Materiaal deksel (coll)
type: Materiaal (hydx) (coll)
type: Materiaal leiding (coll)
type: Materiaal put (coll)

Met een cirkelsegment als dwarsprofiel
type: Uitvoering

Natuurlijk of kunstmatig gebied
type: Uitvoering

Netwerk van verbonden knooppunten
type: Uitvoering

Gelegen onder maaiveld
type: Uitvoering

Uitsparing in wand
type: Uitvoering

Verpompt binnen het bouwwerk
type: Uitvoering

Verticale waterdichte constructie
type: Uitvoering

Met scharnier aan de bovenzijde
type: Uitvoering

Schuifbare plaat
type: Uitvoering

Spiraalachtige goot
type: Uitvoering

Tangentiaal inlaten en spiraalsgewijs laten afstromen
type: Uitvoering

Zonder aansluitingen
type: Uitvoering

Vorm van een bak
type: Uitvoering

Voorzien van een veer
type: Uitvoering

Vergrote inhoud voor de drempel
type: Uitvoering

Expert judgement
notation: EXJ
type: Aanname HydX (coll)

Conform ontwerp
notation: ONT
type: Aanname HydX (coll)

Conform norm
definition: Bijvoorbeeld de aanname van de pompcapaciteit op basis van de vereiste pompovercapaciteit
notation: NRM
type: Aanname HydX (coll)

Aanvoer van afvalwater
type: Functie

Aanvullende bemaling
type: Functie

Afdekken
type: Functie

Afremmen van de stroomsnelheid van het afvalwater
type: Functie

Afsluiten in één stroomrichting
type: Functie

Afsluiten in twee stroomrichtingen
type: Functie

Afsluiten van leidingen
type: Functie

Inzameling van afvalwater
type: Functie

Transport van afvalwater
type: Functie

Afvoer van afvalwater naar een RWZI
type: Functie

Afvoer van hemelwater
type: Functie

Afvoeren hemelwater naar de bovengrond
author at start life: Johan Post
date of start life: 2026-05-04
type: Functie

Afvoeren hemelwater naar de ondergrond
type: Functie

Meten, regelen, controleren en onderhouden
type: Functie

Beluchten of ventileren
type: Functie

Beperken debiet
type: Functie

Bezinken stoffen
type: Functie

Tijdelijke berging van afvalwater
type: Functie

Regeling van de afvoer van het afvalwater
type: Functie

Bij calamiteit afvalwater afvoeren
type: Functie

Verbinden van leidingen in een hoek
type: Functie

Bovenstrooms waterpeil regelen
type: Functie

Inzamelen hemelwater en afgifte aan ondergrond
type: Functie

Inzameling van grondwater
type: Functie

Inzameling van hemelwater
type: Functie

Transport van grondwater
type: Functie

Transport van hemelwater
type: Functie

Doorspoelen rioolstelsel
type: Functie

Toegang geven voor doorspoelen
type: Functie

Drainage en transport van hemel- en grondwater
type: Functie

Transport van vuilwater
type: Functie

Lozen buiten het stelsel
type: Functie

Verpompen van water
type: Functie

Inzameling van vuilwater
type: Functie

Inzameling van hemelwater en vuilwater
type: Functie

Tijdelijke berging van hemelwater en vuilwater
type: Functie

Transport van hemelwater en vuilwater
type: Functie

Opvang en afvoer hemelwater
type: Functie

Hemelwater afvoeren naar ondergrond
type: Functie

In stand houden onderdruk
type: Functie

Infiltratie en transport van hemelwater
type: Functie

Tijdelijke berging van hemelwater
type: Functie

Toegang geven tot het rioolstelsel
type: Functie

Toegang verschaffen
type: Functie

Lozen binnen het stelsel
type: Functie

Keren van water
type: Functie

Opvang van afstromend hemelwater
type: Functie

Leiding gescheiden laten kruisen
type: Functie

Voorkomen dat stromen elkaar raken
type: Functie

Verbinden van vier leidingen
type: Functie

Verwijderen van water
type: Functie

Voortgeleiding van materie
type: Functie

Leidingen aansluiten
type: Functie

Lozen afvalwater
type: Functie

Overtollig afvalwater laten wegstromen
type: Functie

Verbinden van twee leidingen
type: Functie

Zonder toestandswijziging
type: Functie

Opslag van hemelwater
type: Functie

Opslag van water
type: Functie

Opvang hemelwater
type: Functie

Overbruggen groot niveauverschil
type: Functie

Verbinden van leidingen met verschillend materiaal of verbindingstype
type: Functie

Transport van overstortend afvalwater
type: Functie

Overtollig hemelwater infiltratievoorziening afvoeren
type: Functie

Verplaatsen van water
type: Functie

Verpompen van afvalwater
type: Functie

Regelen van het debiet om de bergingscapaciteit van het bovenstroomse rioolstelsel te benutten
type: Functie

Verwijderen vervuiling
type: Functie

Rioolleidingen aansluiten
type: Functie

Volledig keren van water
type: Functie

Verpompt spoelwater
type: Functie

Waterniveau in stelsel regelen
type: Functie

Verbinden van drie leidingen
type: Functie

Tijdelijke berging van vuilwater
type: Functie

Toegang geven tot zinker
type: Functie

Verpompt tunnelwater
type: Functie

Uitstroom van afvalwater naar oppervlaktewater
type: Functie

Verbinden van leidingen
type: Functie

Verbinden van leidingen met verschillende diameter
type: Functie

Verminderen vuilbelasting van oppervlaktewater
type: Doel

Verwijderen bezinksel
type: Doel

Goed blijven functioneren
validity context: 5d 11d
type: Doel

Tunnel drooghouden
type: Doel

Calamiteit
type: Toepassing

Deel van een op zichzelf staande constructie
type: Toepassing

Deel van pompunit
type: Toepassing

Onderdeel van een leiding
type: Toepassing

Is overdrachtspunt
type: Toepassing

Deel van een stuwconstructie
type: Toepassing

Vulling van de constructie
type: Toepassing

Omstorting van de constructie
type: Toepassing

Toegang voor injecteren
type: Toepassing

Gietijzer
label: Cast iron @en
author of change: Marinus Vonhof
date of change: 2025-01-16
definition: [IMBOR] Een in vormen gegoten legering van ijzer, koolstof, mangaan en silicium.
notation: AM
notation: GIJ
type: Materiaal deksel (coll)
type: Materiaal (hydx) (coll)
type: Materiaal leiding (coll)
type: Materiaal put (coll)

Grijs gietijzer
label: Grey cast iron @en
author of change: Marinus Vonhof
date of change: 2025-01-16
definition: [IMBOR] Een grijskleurig, in vormen gegoten legering van ijzer, koolstof, mangaan en silicium.
notation: AN
type: Materiaal deksel (coll)
type: Materiaal leiding (coll)
type: Materiaal put (coll)

Nodulair gietijzer
label: Ductile cast iron @en
author of change: Marinus Vonhof
date of change: 2025-01-16
definition: [IMBOR] Een materiaal waarin koolstof in gesloten nodulen aanwezig is in het ijzer.
notation: AO
type: Materiaal deksel (coll)
type: Materiaal leiding (coll)
type: Materiaal put (coll)

Roestvast staal
label: Stainless steel @en
author of change: Marinus Vonhof
date of change: 2025-01-16
definition: [IMBOR] Afkorting van roestvast staal, een verzamelnaam voor legeringen die hoofdzakelijk uit ijzer bestaan met minimaal 11 tot 12% chroom en maximaal 1,2% koolstof.
notation: C
alternative label: RVS
alternative label: Roestvaststaal
alternative label: Roestvrijstaal
type: Materiaal deksel (coll)
type: Materiaal leiding (coll)

Eivormig
label: Egg shaped @en
author of change: Marinus Vonhof
date of change: 2025-01-16
definition: Met de brede zijde bovenaan
definition: [IMBOR] Elliptisch.
notation: C
notation: EIV
type: Vorm leiding (coll)
type: Vorm profiel (coll)

Eivormig omgekeerd
definition: Met de brede zijde onderaan
notation: EIG
type: Vorm leiding (coll)
type: Vorm profiel (coll)

Heul
label: Arch shaped @en
author of change: Marinus Vonhof
date of change: 2025-01-16
definition: [EN13508-2+A1] Circular soffit and flat invert with parallel sides @en
definition: [EN13508-2+A1] Cirkelvormige bovenkant en vlakke bodem met evenwijdige zijden
definition: [IMBOR] Het object is boogvormig en is met een platte onderzijde aan de ondergrond bevestigd.
notation: E
notation: HEU
type: Vorm leiding (coll)
type: Vorm profiel (coll)

Muil
label: Mouth profile @en
author of change: Marinus Vonhof
date of change: 2025-01-16
definition: [IMBOR] Het object heeft een liggend ellipsprofiel, waarbij de bovenzijde ronder is dan de onderzijde.
notation: MVR
type: Vorm leiding (coll)
type: Vorm profiel (coll)

Ovaal
label: Oval @en
author of change: Marinus Vonhof
date of change: 2025-01-16
definition: [EN13508-2+A1] Cirkelvormige bodem en bovenkant (met gelijke middellijn) met evenwijdige zijden
definition: [IMBOR] Een afgeplatte of uitgerekte cirkel.
definition: [Wikipedia] Ellips vorm, gevormd door alle punten waarvoor de som van de afstanden tot twee gekozen punten, de brandpunten, een vaste waarde heeft.
notation: F
notation: OVA
comment: Bron afbeelding: nl.wikipedia.org
type: Vorm leiding (coll)
type: Vorm profiel (coll)

Rechthoekig
label: Rectangular @en
author of change: Marinus Vonhof
date of change: 2025-01-16
date of change: 2025-12-19
definition: [IMBOR] Een vierhoek met louter rechte hoeken.
notation: B
notation: RHK
alternative label: Kokerprofiel
type: Vorm leiding (coll)
type: Vorm opening (coll)
type: Vorm put (coll)
type: Vorm profiel (coll)

Rond
label: Circular @en
author of change: Marinus Vonhof
author of change: Johan Post
date of change: 2025-01-16
date of change: 2022-09-29
date of change: 2024-04-30
date of change: 2025-12-19
date of change: 2024-07-15
date of change: 2024-05-20
definition: [IMBOR] Cirkelvormig en zonder hoeken.
notation: A
notation: RND
type: Vorm leiding (coll)
type: Vorm opening (coll)
type: Vorm put (coll)
type: Structuur
type: Vorm profiel (coll)

Trapezium
author of change: Marinus Vonhof
date of change: 2026-07-13
definition: In het geval van een leidingvorm: Gesloten of open leidingprofiel. Als er geen profiel-geometrie is meegegeven geldt: de breedte leiding = bodembreedte, de hellingshoek aan beide zijden = 45 graden. De hoogte leiding bepaalt dan de bovenbreedte.
definition: Trapeziumvormig
notation: TPZ
type: Vorm leiding (coll)
type: Vorm profiel (coll)

U-vorm
label: U-shape @en
author of change: Marinus Vonhof
date of change: 2025-01-16
definition: In het geval van een leidingvorm: Omgekeerd heul profiel, cirkelvormige onderkant
definition: [IMBOR] De vorm van de letter U hebbende.
notation: D
notation: UVR
type: Vorm leiding (coll)
type: Vorm profiel (coll)

Anders (vorm)
author of change: Marinus Vonhof
date of change: 2025-12-19
definition: Als de vorm van het object niet rechthoeking of rond is. Vul bij de afmeting de grootste waarden in.
type: Vorm opening (coll)
type: Vorm put (coll)

Asbestcement
label: Asbestos cement @en
author of change: Marinus Vonhof
date of change: 2025-01-16
date of change: 2024-08-20
definition: [IMBOR] Een samengeperst en versteend mengsel van cementmateriaal en soms zand waarin 10 tot 15% asbestvezels (golfplaten, vlakke platen) en bij standleidingen 15 tot 30% als versterking verwerkt zijn. (Bron: Wikipedia)
notation: AA
notation: BET
validity context: 16d
type: Materiaal deksel (coll)
type: Materiaal (hydx) (coll)
type: Materiaal leiding (coll)
type: Materiaal put (coll)

Epoxy
author of change: Marinus Vonhof
date of change: 2025-01-16
definition: [IMBOR] Een thermohardende kunststof waarmee vezelmateriaal geïmpregneerd kan worden.
notation: AT
type: Materiaal deksel (coll)
type: Materiaal leiding (coll)
type: Materiaal put (coll)
type: Materiaal lining (coll)

Glasvezel versterkte kunststof
label: Fibre reinforced plastics @en
author of change: Marinus Vonhof
date of change: 2025-01-16
definition: [IMBOR] Een kunststof die is versterkt met een haarfijne vezel gemaakt van glas.
notation: AL
notation: GVK
alternative label: GVK
type: Materiaal deksel (coll)
type: Materiaal leiding (coll)
type: Materiaal put (coll)
type: Materiaal lining (coll)

Gewapend beton
label: Reinforced concrete @en
author of change: Marinus Vonhof
date of change: 2025-01-16
definition: [IMBOR] Beton waarin een versterkende constructie is aangebracht.
definition: [IMBOR] Beton waarin een versterkende constructie, vaak in de vorm van een metalen raster, is aangebracht.
notation: BET
notation: AH
notation: GBT
type: Materiaal deksel (coll)
type: Materiaal (hydx) (coll)
type: Materiaal leiding (coll)
type: Materiaal put (coll)

Vezelcement
label: Fibre cement @en
author of change: Marinus Vonhof
date of change: 2025-01-16
definition: [IMBOR] Een voornamelijk uit mineralen bestaand materiaal waar versterkingsvezels in aangebracht zijn en veelal gebruikt wordt voor gevelplaten en gevelstroken.
notation: AK
type: Materiaal deksel (coll)
type: Materiaal leiding (coll)
type: Materiaal put (coll)
type: Materiaal lining (coll)

Polyester
author of change: Marinus Vonhof
date of change: 2025-01-16
definition: [IMBOR] Een polymeer dat bestaat uit een keten van esterbindingen en dat zowel thermoplastisch als thermohardend kan zijn.
notation: HPE
notation: AU
type: Materiaal deksel (coll)
type: Materiaal (hydx) (coll)
type: Materiaal leiding (coll)
type: Materiaal put (coll)
type: Materiaal lining (coll)

Polyetheen
label: Polyethylene @en
author of change: Marinus Vonhof
date of change: 2025-01-16
definition: [IMBOR] De meest gebruikte kunststof, bestaande uit etheen dat gepolymeriseerd is.
notation: HPE
notation: AV
notation: PE
alternative label: PE
type: Materiaal deksel (coll)
type: Materiaal (hydx) (coll)
type: Materiaal leiding (coll)
type: Materiaal put (coll)
type: Materiaal lining (coll)

Polypropyleen
label: Polypropylene @en
author of change: Marinus Vonhof
date of change: 2025-01-16
definition: [IMBOR] Een thermoplastisch polymeer dat sterker is dan polyetheen en ontstaat uit de polymerisatie van propeen.
notation: HPE
notation: AW
notation: PP
type: Materiaal deksel (coll)
type: Materiaal (hydx) (coll)
type: Materiaal leiding (coll)
type: Materiaal put (coll)
type: Materiaal lining (coll)

PVC
label: Polyvinyl chloride @en
author of change: Marinus Vonhof
date of change: 2025-01-16
definition: [IMBOR] Een veelvuldig toegepaste thermoplast die ontstaat na polymerisatie van vinylchloride.
notation: AX
notation: PVC
alternative label: PVC-U @en
alternative label: Polyvinylchloride
type: Materiaal deksel (coll)
type: Materiaal (hydx) (coll)
type: Materiaal leiding (coll)
type: Materiaal put (coll)
type: Materiaal lining (coll)

Gres
author of change: Marinus Vonhof
date of change: 2025-01-16
definition: [IMBOR] Een keramisch materiaal dat gemaakt is van een kleisoort die tegen hoge temperaturen bestand is. (Bron: Wikipedia)
notation: GRE
notation: GRES
type: Materiaal (hydx) (coll)
type: Materiaal leiding (coll)
type: Materiaal put (coll)

HDPE
author of change: Marinus Vonhof
date of change: 2025-01-16
definition: [IMBOR] Een afkorting van 'high-density polyethylene,' een thermoplastisch polymeer met een goede verhouding tussen de kracht en de dichtheid van het materiaal.
notation: HDPE
notation: HPE
alternative label: Hogedichtheidpolyetheen
type: Materiaal (hydx) (coll)
type: Materiaal leiding (coll)
type: Materiaal put (coll)
type: Materiaal lining (coll)

Metselwerk
author of change: Marinus Vonhof
date of change: 2025-01-16
definition: [IMBOR] Stenen die met cement of een variant daarop aan elkaar verbonden zijn.
notation: METSELWERK
notation: MSW
author at start life: Marinus Vonhof
author at start life: Johan Post
date of start life: 2022-10-03
date of start life: 2026-05-21
validity context: 1d 3d 10d 12d 14d
type: Materiaal (hydx) (coll)
type: Materiaal leiding (coll)
type: Materiaal put (coll)

Metselwerk (baksteen)
label: Brickwork @en
author of change: Marinus Vonhof
date of change: 2025-01-16
definition: [IMBOR] Gebakken klinkers die met cement of een variant daarop aan elkaar verbonden zijn.
notation: MSW
notation: AD
type: Materiaal (hydx) (coll)
type: Materiaal leiding (coll)
type: Materiaal put (coll)

Metselwerk (bepleisterd)
label: Masonry (coursed) @en
author of change: Marinus Vonhof
date of change: 2025-01-16
definition: [IMBOR] Gebakken klinkers die met cement of een variant daarop aan elkaar verbonden zijn en waar een pleisterlaag (een smeerbaar materiaal ten behoeve van de afwerking) op is aangebracht.
notation: MSW
notation: AR
type: Materiaal (hydx) (coll)
type: Materiaal leiding (coll)
type: Materiaal put (coll)

Metselwerk (onbepleisterd)
label: Masonry (uncoursed) @en
author of change: Marinus Vonhof
date of change: 2025-01-16
definition: [IMBOR] Gebakken klinkers die met cement of een variant daarop aan elkaar verbonden zijn en waar geen pleisterlaag (een smeerbaar materiaal ten behoeve van de afwerking) op is aangebracht.
notation: MSW
notation: AS
type: Materiaal (hydx) (coll)
type: Materiaal leiding (coll)
type: Materiaal put (coll)

Plaatijzer
author of change: Marinus Vonhof
date of change: 2025-01-16
definition: [IMBOR] IJzer dat in de vorm van een plaat is gedrukt.
notation: PIJ
type: Materiaal (hydx) (coll)
type: Materiaal leiding (coll)

Cementmortel
label: Cement mortar @en
author of change: Marinus Vonhof
date of change: 2025-01-16
definition: [IMBOR] Een mengsel van cement en water.
definition: [IMBOR] Een samenstelling van cement, kalk en zand met water vermengd tot een mortel, welke dient voor het metselen en pleisteren.
notation: B
notation: AF
type: Materiaal leiding (coll)
type: Materiaal put (coll)
type: Materiaal lining (coll)

Beton met stalen kern
type: Materiaal leiding (coll)

Betonnen segmenten
label: Concrete segments @en
notation: AJ
alternative label: Betonnen segment
type: Materiaal leiding (coll)
type: Materiaal put (coll)
type: Materiaal lining (coll)

Bitumen
author of change: Marinus Vonhof
date of change: 2025-01-16
definition: [IMBOR] Een bij kamertemperatuur vast mengsel van koolwaterstoffen die voorkomen in aardolie, dat een belangrijk bestandsdeel van asfalt is.
notation: AB
type: Materiaal leiding (coll)
type: Materiaal put (coll)

Gespoten beton
label: Sprayed concrete @en
definition: [IMBOR] Betonspecie die onder druk door een slang op een dragend oppervlak wordt gespoten, zodat het daarop sterk kan verharden.
notation: AI
type: Materiaal leiding (coll)
type: Materiaal put (coll)

Glad staal
type: Materiaal leiding (coll)

Klei
label: Clay @en
author of change: Marinus Vonhof
date of change: 2025-01-16
definition: [IMBOR] Grond die voor meer dan 25% bestaat uit lutumdeeltjes.
definition: [IMBOR] Verschijningsvorm van grondsoort, grond voor meer dan 25% bestaat uit lutumdeeltjes.
notation: AE
type: Materiaal leiding (coll)
type: Materiaal put (coll)

Zwavelbeton
definition: een betonsoort waarbij het aandeel cement en water vervangen is door gemodificeerd zwavel als bindmiddel. Dit geeft een CO2 reductie en maakt het geschikt voor chemisch agressieve omgevingen
author at start life: Johan Post
date of start life: 2026-07-02
type: Materiaal leiding (coll)
type: Materiaal put (coll)

Mergel
definition: [IMBOR] Een sedimentair gesteente dat voor 25-75% uit kalk bestaat en voor het restant uit klei.
author at start life: Johan Post
date of start life: 2026-05-04
type: Materiaal leiding (coll)
type: Materiaal put (coll)

Rubber
author of change: Marinus Vonhof
date of change: 2025-01-16
definition: [IMBOR] Een polymeer dat voorkomt als een emulsie in het sap van een aantal plantensoorten, zoals sommige bomen uit de familie Hevea.
type: Materiaal leiding (coll)

Voorgespannen Beton
type: Materiaal leiding (coll)
type: Materiaal put (coll)

Cilindrische vorm
type: Structuur

Gesloten
type: Structuur

In gebruik
author of change: Marinus Vonhof
date of change: 2025-01-16
definition: [IMBOR] Het object is een actualiteit in de werkelijkheid.
notation: ACT
type: Status object (coll)

In ontwerp
author of change: Marinus Vonhof
date of change: 2025-01-16
definition: [IMBOR] Het object is planmatig geschapen, maar nog niet gerealiseerd in de werkelijkheid.
notation: ONT
type: Status object (coll)

Constant debiet per uur met variabel dagvolume
notation: CST
type: Type verloop (coll)

Variabel debiet per uur met vast dagvolume
notation: DAG
type: Type verloop (coll)

Variabel debiet per uur met variabel dagvolume
notation: VAR
type: Type verloop (coll)

Tabulated
definition: Beschrijving van een gesloten profiel met X / Y waarden in [m]. De eerste en laatste coördinaat in de reeks zijn gelijk.
notation: TAB
type: Vorm profiel (coll)

YZ profiel
definition: Conform de gangbare aanduiding voor open water: een curve die de dwarsdoorsnede beschrijft over YZ, waarden in [m].
notation: YZP
type: Vorm profiel (coll)

Geen inzameling
notation: NVT
type: Type inzameling (coll)

Geen stroming, gesloten
author of change: Marinus Vonhof
date of change: 2025-01-16
definition: [IMBOR] Vloeistoffen stromen in geen van beide richtingen van de leiding, omdat de stroming is afgesloten.
notation: GSL
type: Stromingsrichting (coll)

Stroming in beide richtingen
author of change: Marinus Vonhof
date of change: 2025-01-16
definition: [IMBOR] Vloeistoffen stromen in geen van beide richtingen van de leiding.
notation: OPN
type: Stromingsrichting (coll)

Stroming van beginpunt naar eindpunt
author of change: Marinus Vonhof
date of change: 2025-01-16
definition: [IMBOR] Vloeistoffen stromen van het referentiepunt dat is aangegeven als begin van de leiding naar het referentiepunt dat is aangegeven als eindpunt van de leiding.
notation: 1_2
type: Stromingsrichting (coll)

Stroming van eindpunt naar beginpunt
author of change: Marinus Vonhof
date of change: 2025-01-16
definition: [IMBOR] Vloeistoffen stromen van het referentiepunt dat is aangegeven als eind van de leiding naar het referentiepunt dat is aangegeven als begin van de leiding.
notation: 2_1
type: Stromingsrichting (coll)

Gekneveld
author of change: Marinus Vonhof
date of change: 2025-01-16
definition: [IMBOR] Een maaiveldschematisering die op een bepaalde manier gesloten is met knevels, dat wil zeggen met voorzieningen bedoeld om een afdekking af te dichten.
notation: KNV
type: Maaiveldschematisering (coll)

Reservoir (maaiveldschematisering)
author of change: Marinus Vonhof
author of change: Wouter van Riel
date of change: 2024-05-16
date of change: 2024-07-16
notation: RES
type: Maaiveldschematisering (coll)

Verlies
author of change: Marinus Vonhof
date of change: 2025-01-16
definition: [IMBOR] Binnen de maaiveldschematisering van het object is er sprake van een vermindering aan stabiliteit.
notation: VRL
type: Maaiveldschematisering (coll)

Gesloten leiding
notation: GSL
type: Type verbinding (coll)

Lateraal debiet (lozing, DWA en/of HWA)
notation: LAT
type: Type debiet (coll)

Vuilwaterdebiet
notation: VWD
type: Type debiet (coll)