Deelmodel Basis, filter collectie_BASHYDMDSNLCSTOP_v1.7
type: Ontology
version info: Deelmodel Basis, filter op CoFs BAS HYD MDS NLCS TOP, versie=1.7 (2026-08-26T14:20:31)

has as aspect
type: ObjectProperty

has as output (inverse)
type: ObjectProperty
inverse of: has as output

has as aspect (inverse)
type: ObjectProperty
inverse of: has as aspect

has as reference (qualification)
type: ObjectProperty
type: FunctionalProperty

has as part (inverse)
type: ObjectProperty
inverse of: has as part

has as input
type: ObjectProperty

has as output
type: ObjectProperty

has as part
type: ObjectProperty

is connected to
type: ObjectProperty
type: SymmetricProperty

heeft Functie
type: ObjectProperty
range: Functie

has as input (inverse)
type: ObjectProperty
inverse of: has as input

heeft Doel
validity context: 6d
type: ObjectProperty
range: Doel

is represented by
author of change: Marinus Vonhof
date of change: 2026-07-23
comment: Vanaf versie 1.7.0 is deze relatie niet meer functioneel. Documentatie is representatie ipv kenmerk geworden, daarmee kan een subject meerdere representaties (symbool, revisietekening) hebben.
type: ObjectProperty

heeft Uitvoering
validity context: 6d
type: ObjectProperty
range: Uitvoering

heeft Technologie
validity context: 6d
type: ObjectProperty
range: Technologie

heeft Mechanisme
validity context: 6d
type: ObjectProperty
range: Mechanisme

heeft Toepassing
validity context: 6d
type: ObjectProperty
range: Toepassing

heeft Structuur
validity context: 6d
type: ObjectProperty
range: Structuur

is represented by (inverse)
type: ObjectProperty
inverse of: is represented by

author of change
type: AnnotationProperty
range: string

date of change
type: AnnotationProperty
range: date

author at start life
type: AnnotationProperty
range: string

date of start life
type: AnnotationProperty
range: date

units of measurements
type: AnnotationProperty

validity context
type: AnnotationProperty

has as value
type: FunctionalProperty
type: DatatypeProperty

Restriction
author at start life: Marinus Vonhof
date of start life: 2018-11-07
on class: Vrijverval transportstelsel
on property: is represented by (inverse)
max qualified cardinality: 1

Restriction
author at start life: Marinus Vonhof
date of start life: 2018-11-07
on class: Vuilwaterriool
on property: is represented by (inverse)
max qualified cardinality: 1

Restriction
author at start life: Marinus Vonhof
date of start life: 2018-11-07
on class: Vuilwaterstelsel
on property: is represented by (inverse)
max qualified cardinality: 1

Restriction
author at start life: Marinus Vonhof
date of start life: 2018-11-07
on class: Waterniveaumeter
on property: is represented by (inverse)
max qualified cardinality: 1

Restriction
author at start life: Marinus Vonhof
date of start life: 2018-11-07
on class: Zandvangput
on property: is represented by (inverse)
max qualified cardinality: 1

Restriction
author at start life: Marinus Vonhof
date of start life: 2018-11-07
on class: Zuiveringseenheid
on property: is represented by (inverse)
max qualified cardinality: 1

Restriction
author of change: Marinus Vonhof
date of change: 2018-04-23
author at start life: Marinus Vonhof
date of start life: 2015-07-08
on class: Zuiveringseenheid
on property: has as part (inverse)
max qualified cardinality: 1

Restriction
author at start life: Marinus Vonhof
date of start life: 2014-04-29
on class: RTC-sturing
on property: has as input (inverse)
max qualified cardinality: 1

Restriction
author at start life: Marinus Vonhof
date of start life: 2022-10-04
on class: Transportstelsel
on property: has as part
min qualified cardinality: 1

Restriction
on class: Vacuümpompstation
on property: has as part (inverse)
qualified cardinality: 1

Restriction
on class: Vacuümpompstation
on property: has as part (inverse)
max qualified cardinality: 1

Restriction
author of change: Marinus Vonhof
date of change: 2018-05-01
author at start life: Marinus Vonhof
date of start life: 2018-04-29
on class: Systeem
on property: has as input
qualified cardinality: 1

Restriction
author at start life: Marinus Vonhof
date of start life: 2018-12-10
validity context: *t
on class: Zonk
on property: has as part
qualified cardinality: 1

Restriction
on class: Vacuümpompstation
on property: has as part (inverse)
max qualified cardinality: 1

Restriction
author at start life: Marinus Vonhof
date of start life: 2013-10-04
on class: Vijzelpomp
on property: has as part
qualified cardinality: 1

Restriction
author at start life: Marinus Vonhof
date of start life: 2013-10-04
on class: Vijzelgemaal
on property: has as part (inverse)
qualified cardinality: 1

Restriction
on class: Vacuümpompstation
on property: has as part (inverse)
qualified cardinality: 1

Restriction
author at start life: Marinus Vonhof
date of start life: 2026-07-15
on class: Bufferput
on property: has as part (inverse)
max qualified cardinality: 1

Restriction
author at start life: Wouter van Riel
date of start life: 2024-04-22
on class: Compartiment
on property: has as part (inverse)
max qualified cardinality: 1

Restriction
author at start life: Wouter van Riel
date of start life: 2024-04-22
on class: Put
on property: has as part (inverse)
max qualified cardinality: 1

Restriction
on class: Sym Waterniveaumeter
on property: is represented by
max qualified cardinality: 1

Restriction
author of change: Finy Teitsma (Oranjewoud)
date of change: 2006-03-23
author at start life: Finy Teitsma (Oranjewoud)
date of start life: 2006-02-25
on class: Waterdeel
on property: has as aspect (inverse)
max qualified cardinality: 1

Restriction
author of change: Finy Teitsma (Oranjewoud)
date of change: 2006-03-23
author at start life: Finy Teitsma (Oranjewoud)
date of start life: 2006-02-25
on class: Waterdeel
on property: has as aspect (inverse)
max qualified cardinality: 1

Restriction
author of change: Marinus Vonhof
date of change: 2018-12-13
author at start life: Marinus Vonhof
date of start life: 2014-11-29
on class: Planvorming rioleringsbeheer
on property: has as output (inverse)
qualified cardinality: 1

Aantal woningen (datatype)
type: Datatype
equivalent class: Datatype
  on datatype: integer
  with restrictions:
    min inclusive: 0
  with restrictions:
    max inclusive: 9999

Afvloeiingscoëfficiënt (datatype)
type: Datatype
equivalent class: Datatype
  on datatype: decimal
  with restrictions:
    min inclusive: 0
  with restrictions:
    max inclusive: 1

Afvoercoëfficiënt (datatype)
type: Datatype
equivalent class: Datatype
  on datatype: decimal
  with restrictions:
    min inclusive: 0
  with restrictions:
    max inclusive: 99

Breedte bouwwerk (datatype)
type: Datatype
equivalent class: Datatype
  on datatype: integer
  with restrictions:
    min inclusive: 500
  with restrictions:
    max inclusive: 10000

Breedte hulpstuk (datatype)
type: Datatype
equivalent class: Datatype
  on datatype: integer
  with restrictions:
    min inclusive: 63
  with restrictions:
    max inclusive: 4000

Breedte leiding (datatype)
type: Datatype
equivalent class: Datatype
  on datatype: integer
  with restrictions:
    min inclusive: 63
  with restrictions:
    max inclusive: 4000

Breedte put (datatype)
type: Datatype
equivalent class: Datatype
  on datatype: integer
  with restrictions:
    min inclusive: 300
  with restrictions:
    max inclusive: 4000

Continue lozing (datatype)
type: Datatype
equivalent class: Datatype
  on datatype: decimal
  with restrictions:
    min inclusive: 1
  with restrictions:
    max inclusive: 99999

Contractiecoëfficiënt doorlaatprofiel (datatype)
type: Datatype
equivalent class: Datatype
  on datatype: decimal
  with restrictions:
    min inclusive: 0
  with restrictions:
    max inclusive: 99999

Dakoppervlak hellend (datatype)
type: Datatype
equivalent class: Datatype
  on datatype: decimal
  with restrictions:
    min inclusive: 0
  with restrictions:
    max inclusive: 999999

Dakoppervlak vlak (datatype)
type: Datatype
equivalent class: Datatype
  on datatype: decimal
  with restrictions:
    min inclusive: 0
  with restrictions:
    max inclusive: 999999

Dakoppervlak vlak uitgestrekt (datatype)
type: Datatype
equivalent class: Datatype
  on datatype: decimal
  with restrictions:
    min inclusive: 0
  with restrictions:
    max inclusive: 999999

Diameter hulpstuk (datatype)
type: Datatype
equivalent class: Datatype
  on datatype: integer
  with restrictions:
    min inclusive: 63
  with restrictions:
    max inclusive: 4000

Diameter leiding (datatype)
type: Datatype
equivalent class: Datatype
  on datatype: integer
  with restrictions:
    min inclusive: 63
  with restrictions:
    max inclusive: 4000

Diameter put (datatype)
type: Datatype
equivalent class: Datatype
  on datatype: integer
  with restrictions:
    min inclusive: 300
  with restrictions:
    max inclusive: 4000

Energieverliescoëfficiënt (datatype)
type: Datatype
equivalent class: Datatype
  on datatype: decimal
  with restrictions:
    min inclusive: 0
  with restrictions:
    max inclusive: 1

Gesloten verhard oppervlak hellend (datatype)
type: Datatype
equivalent class: Datatype
  on datatype: decimal
  with restrictions:
    min inclusive: 0
  with restrictions:
    max inclusive: 999999

Gesloten verhard oppervlak vlak (datatype)
type: Datatype
equivalent class: Datatype
  on datatype: decimal
  with restrictions:
    min inclusive: 0
  with restrictions:
    max inclusive: 999999

Gesloten verhard oppervlak vlak uitgestrekt (datatype)
type: Datatype
equivalent class: Datatype
  on datatype: decimal
  with restrictions:
    min inclusive: 0
  with restrictions:
    max inclusive: 999999

Hoogte bouwwerk (datatype)
type: Datatype
equivalent class: Datatype
  on datatype: integer
  with restrictions:
    min inclusive: 500
  with restrictions:
    max inclusive: 10000

Hoogte hulpstuk (datatype)
type: Datatype
equivalent class: Datatype
  on datatype: integer
  with restrictions:
    min inclusive: 63
  with restrictions:
    max inclusive: 4000

Hoogte leiding (datatype)
type: Datatype
equivalent class: Datatype
  on datatype: integer
  with restrictions:
    min inclusive: 63
  with restrictions:
    max inclusive: 4000

Hoogte put (datatype)
type: Datatype
equivalent class: Datatype
  on datatype: integer
  with restrictions:
    min inclusive: 500
  with restrictions:
    max inclusive: 4000

Lengte bouwwerk (datatype)
type: Datatype
equivalent class: Datatype
  on datatype: integer
  with restrictions:
    min inclusive: 500
  with restrictions:
    max inclusive: 10000

Lengte leiding (datatype)
type: Datatype
equivalent class: Datatype
  on datatype: decimal
  with restrictions:
    min inclusive: 1
  with restrictions:
    max inclusive: 75

Lengte put (datatype)
type: Datatype
equivalent class: Datatype
  on datatype: integer
  with restrictions:
    min inclusive: 300
  with restrictions:
    max inclusive: 4000

Maximale capaciteit doorlaat (datatype)
type: Datatype
equivalent class: Datatype
  on datatype: decimal
  with restrictions:
    min inclusive: 0
  with restrictions:
    max inclusive: 99999

Onverhard oppervlak hellend (datatype)
type: Datatype
equivalent class: Datatype
  on datatype: decimal
  with restrictions:
    min inclusive: 0
  with restrictions:
    max inclusive: 999999

Onverhard oppervlak vlak (datatype)
type: Datatype
equivalent class: Datatype
  on datatype: decimal
  with restrictions:
    min inclusive: 0
  with restrictions:
    max inclusive: 999999

Onverhard oppervlak vlak uitgestrekt (datatype)
type: Datatype
equivalent class: Datatype
  on datatype: decimal
  with restrictions:
    min inclusive: 0
  with restrictions:
    max inclusive: 999999

Open verhard oppervlak hellend (datatype)
type: Datatype
equivalent class: Datatype
  on datatype: decimal
  with restrictions:
    min inclusive: 0
  with restrictions:
    max inclusive: 999999

Open verhard oppervlak vlak (datatype)
type: Datatype
equivalent class: Datatype
  on datatype: decimal
  with restrictions:
    min inclusive: 0
  with restrictions:
    max inclusive: 999999

Open verhard oppervlak vlak uitgestrekt (datatype)
type: Datatype
equivalent class: Datatype
  on datatype: decimal
  with restrictions:
    min inclusive: 0
  with restrictions:
    max inclusive: 999999

Porositeit (datatype)
type: Datatype
equivalent class: Datatype
  on datatype: decimal
  with restrictions:
    min inclusive: 0
  with restrictions:
    max inclusive: 99

Wandruwheid (datatype)
type: Datatype
equivalent class: Datatype
  on datatype: integer
  with restrictions:
    min inclusive: 0
  with restrictions:
    max inclusive: 99

Z-coördinaat (datatype)
type: Datatype
equivalent class: Datatype
  on datatype: decimal
  with restrictions:
    min inclusive: -20
  with restrictions:
    max inclusive: 325

Collection of facts MDX
author of change: Wouter van Riel
date of change: 2021-11-19
definition: Model met uitwisselformaat SufMeld (proefneming). Is aanvullend op feitencollectie TOP.
author at start life: Marinus Vonhof
date of start life: 2020-12-15
scope note: Collection of facts BAS
type: Class
subclass of: Feitencollectie

Collection of facts MLD
author of change: Wouter van Riel
date of change: 2021-11-19
definition: Meldingen Stedelijk Water (proefneming). Is aanvullend op feitencollectie TOP.
author at start life: Marinus Vonhof
date of start life: 2020-12-15
scope note: Collection of facts BAS
type: Class
subclass of: Feitencollectie

Datacommunicatie (coll)
validity context: *d
comment: [is coll]
scope note: Collection of facts MDS
type: Class
subclass of: Verzameling soorten
subclass of: Class
  one of: 2G
  one of: 3G
  one of: 4G
  one of: 5G
  one of: ADSL
  one of: Bluetooth
  one of: GPRS
  one of: IPv6LoPAN
  one of: LokaleCommunicatiebus
  one of: LoRa
  one of: NB-IoT
  one of: NFR
  one of: PowerLine
  one of: PSTN
  one of: Radiofrequentie
  one of: WiFi
  one of: ZigBee

Collection of facts MDS
author of change: Wouter van Riel
date of change: 2021-11-19
definition: Minimale Dataset. Bevat de minimaal benodigde concepten voor beheer. Is aanvullend op feitencollectie TOP.
author at start life: Marinus Vonhof
date of start life: 2020-12-15
comment: In oorsprong opgezet door de Waterkring West-Brabant en in 2015 opgenomen in het GWSW.
scope note: Collection of facts BAS
type: Class
subclass of: Feitencollectie
subclass of: Restriction
  author of change: Marinus Vonhof
  date of change: 2021-09-17
  author at start life: Marinus Vonhof
  date of start life: 2021-01-28
  on class: Deelmodel MdsProj
  on property: has as part (inverse)
  qualified cardinality: 1
subclass of: Restriction
  author at start life: Marinus Vonhof
  date of start life: 2021-01-28
  on class: Deelmodel Basis
  on property: has as part (inverse)
  qualified cardinality: 1
subclass of: Restriction
  author at start life: Marinus Vonhof
  date of start life: 2021-01-28
  on class: Deelmodel Dataset
  on property: has as part (inverse)
  qualified cardinality: 1
subclass of: Restriction
  author at start life: Marinus Vonhof
  date of start life: 2021-01-28
  on class: Deelmodel MdsPlan
  on property: has as part (inverse)
  qualified cardinality: 1
subclass of: Restriction
  author at start life: Marinus Vonhof
  date of start life: 2021-01-28
  on class: Deelmodel Totaal
  on property: has as part (inverse)
  qualified cardinality: 1
subclass of: Restriction
  author at start life: Marinus Vonhof
  date of start life: 2024-10-31
  on class: Deelmodel IMBOR-SW
  on property: has as part (inverse)
  qualified cardinality: 1

Collection of facts EN
author of change: Wouter van Riel
date of change: 2021-11-19
definition: Bevat norm EN13508-2 2011 wijz A1 (Engelstalig). Is aanvullend op feitencollectie TOP.
author at start life: Marinus Vonhof
date of start life: 2020-12-15
scope note: Collection of facts BAS
type: Class
subclass of: Feitencollectie
subclass of: Restriction
  author of change: Marinus Vonhof
  date of change: 2021-09-17
  author at start life: Marinus Vonhof
  date of start life: 2021-01-30
  on class: Deelmodel RibHeen
  on property: has as part (inverse)
  qualified cardinality: 1
subclass of: Restriction
  author at start life: Marinus Vonhof
  date of start life: 2021-01-30
  on class: Deelmodel RibTerug
  on property: has as part (inverse)
  qualified cardinality: 1
subclass of: Restriction
  author at start life: Marinus Vonhof
  date of start life: 2021-01-30
  on class: Deelmodel Totaal
  on property: has as part (inverse)
  qualified cardinality: 1
subclass of: Restriction
  author at start life: Marinus Vonhof
  date of start life: 2021-01-31
  on class: Deelmodel Maatregelen
  on property: has as part (inverse)
  qualified cardinality: 1

Collection of facts RRB
author of change: Wouter van Riel
date of change: 2021-11-19
definition: Bevat concepten voor reinigen vrijverval riolering. Is aanvullend op feitencollectie TOP.
author at start life: Marinus Vonhof
date of start life: 2020-12-15
scope note: Collection of facts BAS
type: Class
subclass of: Feitencollectie
subclass of: Restriction
  author at start life: Marinus Vonhof
  date of start life: 2021-01-28
  on class: Deelmodel RibHeen
  on property: has as part (inverse)
  qualified cardinality: 1
subclass of: Restriction
  author at start life: Marinus Vonhof
  date of start life: 2021-01-28
  on class: Deelmodel RibTerug
  on property: has as part (inverse)
  qualified cardinality: 1
subclass of: Restriction
  author at start life: Marinus Vonhof
  date of start life: 2021-01-28
  on class: Deelmodel Totaal
  on property: has as part (inverse)
  qualified cardinality: 1

Visueel inspecteren vrijverval leiding
label: Visual inspection drains and sewers @en
author of change: Marinus Vonhof
date of change: 2018-05-01
author at start life: Marinus Vonhof
date of start life: 2012-08-15
scope note: Collection of facts MDS
scope note: Collection of facts EN
scope note: Collection of facts MTR
type: Class
subclass of: VisueelInspecteren
subclass of: Restriction
  author of change: Marinus Vonhof
  date of change: 2014-09-03
  author at start life: Marinus Vonhof
  date of start life: 2014-04-29
  on class: Inspectieproject riolering
  on property: has as part (inverse)
  qualified cardinality: 1
subclass of: Restriction
  author of change: Marinus Vonhof
  date of change: 2015-10-20
  author at start life: Marinus Vonhof
  date of start life: 2012-08-15
  validity context: *t
  comment: Relatie (kardinaliteit) uitgeschakeld voor CFK's (SHACL-syntax) (20260403) (20260824)
  on class: Vrijverval rioolleiding
  on property: has as output
  qualified cardinality: 1
subclass of: Restriction
  author of change: Marinus Vonhof
  date of change: 2018-04-06
  author at start life: Marinus Vonhof
  date of start life: 2014-08-29
  on class: Vrijverval rioolleiding
  on property: has as input
  qualified cardinality: 1
subclass of: Restriction
  author of change: Marinus Vonhof
  date of change: 2024-07-29
  author at start life: Marinus Vonhof
  date of start life: 2020-04-20
  on class: Voegmateriaal
  on property: has as output
  min qualified cardinality: 0

Vorm leiding
label: Shape @en
author of change: Marinus Vonhof
date of change: 2015-05-29
definition: [EN13508-2+A1] The shape of the cross-section of the pipeline as follows @en
notation: ACA
notation: GCA
author at start life: Marinus Vonhof
date of start life: 2012-05-01
comment: Intrinsiek aspect
comment: [is aspect]
scope note: Collection of facts TOP
type: Class
subclass of: Vorm
subclass of: Restriction
  author of change: Marinus Vonhof
  date of change: 2015-10-31
  author at start life: Finy Teitsma (Oranjewoud)
  date of start life: 2006-02-25
  validity context: *t
  on class: Leiding
  on property: has as aspect (inverse)
  max qualified cardinality: 1
subclass of: Restriction
  author at start life: Marinus Vonhof
  date of start life: 2015-10-30
  on class: Inwinning
  on property: has as aspect
  max qualified cardinality: 1
subclass of: Restriction
  on property: has as reference (qualification)
  all values from: Vorm leiding (coll)

Hoogte leiding
label: Height @en
author of change: Marinus Vonhof
date of change: 2019-01-24
definition: De bij het materiaal gebruikelijke aanduiding van de hoogte van een leiding (zie diameter leiding)
definition: [EN13508-2+A1] The height of the section in millimetres @en
notation: ACB
notation: GCB
author at start life: Marinus Vonhof
date of start life: 2011-12-15
units of measurements: mm
comment: Intrinsiek aspect
comment: [is aspect]
scope note: Collection of facts TOP
type: Class
subclass of: Hoogte
subclass of: Restriction
  author of change: Marinus Vonhof
  date of change: 2014-12-03
  author at start life: Marinus Vonhof
  date of start life: 2011-12-15
  validity context: *t
  on class: Leiding
  on property: has as aspect (inverse)
  max qualified cardinality: 1
subclass of: Restriction
  author at start life: Marinus Vonhof
  date of start life: 2024-05-16
  on class: Inwinning
  on property: has as aspect
  max qualified cardinality: 1
subclass of: Restriction
  on property: has as value
  all values from: Hoogte leiding (datatype)

Breedte leiding
label: Width @en
author of change: Marinus Vonhof
date of change: 2019-01-24
definition: De bij het materiaal gebruikelijke aanduiding van de breedte van een leiding (zie diameter leiding)
definition: [EN13508-2+A1] The width of the section in millimetres. (Not required where both dimensions are the same -e.g. circle) @en
notation: ACC
notation: GCC
author at start life: Marinus Vonhof
date of start life: 2013-09-17
units of measurements: mm
comment: Intrinsiek aspect
comment: [is aspect]
scope note: Collection of facts TOP
type: Class
subclass of: Breedte
subclass of: Restriction
  author of change: Marinus Vonhof
  date of change: 2015-05-29
  author at start life: Marinus Vonhof
  date of start life: 2011-12-15
  validity context: *t
  on class: Leiding
  on property: has as aspect (inverse)
  max qualified cardinality: 1
subclass of: Restriction
  author at start life: Marinus Vonhof
  date of start life: 2024-05-16
  on class: Inwinning
  on property: has as aspect
  max qualified cardinality: 1
subclass of: Restriction
  on property: has as value
  all values from: Breedte leiding (datatype)

Materiaal leiding
label: Material sewer @en
author of change: Johan Post
date of change: 2022-09-29
definition: De bouwstof van de leiding
definition: [EN13508-2+A1] The material of the fabric of the sewer, in accordance with Table C.4. Where the pipeline has been lined the material recorded is the material of the original pipeline @en
notation: ACD
notation: GCD
author at start life: Marinus Vonhof
date of start life: 2013-09-17
comment: Intrinsiek aspect
alternative label: Leidingmateriaal
comment: [is aspect]
scope note: Collection of facts TOP
type: Class
subclass of: Materiaal
subclass of: Restriction
  author of change: Marinus Vonhof
  date of change: 2015-06-01
  author at start life: Finy Teitsma (Oranjewoud)
  date of start life: 2006-02-25
  validity context: *t
  on class: Leiding
  on property: has as aspect (inverse)
  max qualified cardinality: 1
subclass of: Restriction
  on property: has as reference (qualification)
  all values from: Materiaal leiding (coll)
subclass of: Restriction
  on class: Inwinning
  on property: has as aspect
  max qualified cardinality: 1

Materiaal lining
label: Lining material @en
author of change: Marinus Vonhof
definition: [EN13508-2+A1] Het materiaal van de lining in overeenstemming met tabel C.4 @en
notation: ACF
author at start life: Marinus Vonhof
date of start life: 2018-12-13
comment: Intrinsiek aspect
comment: Vanaf GWSW 1.7 is de collectie lining-materialen beperkt t.o.v. de EN13508-2+A1
comment: [is aspect]
scope note: Collection of facts MDS
scope note: Collection of facts EN
scope note: Collection of facts RRB
scope note: Collection of facts MTR
type: Class
subclass of: Materiaal
subclass of: Restriction
  author of change: Marinus Vonhof
  date of change: 2018-12-12
  author at start life: Marinus Vonhof
  date of start life: 2013-09-20
  on class: Lining
  on property: has as aspect (inverse)
  max qualified cardinality: 1
subclass of: Restriction
  on property: has as reference (qualification)
  all values from: Materiaal lining (coll)

Lengte buisdeel
label: Pipe unit length @en
author of change: Marinus Vonhof
date of change: 2015-08-24
definition: Lengte van een buisdeel
definition: [EN 16323:2014] internal length of the pipe barrel @en
definition: [EN13508-2+A1] The length in millimetres of individual pipe units which comprise the pipeline. Where the pipe is continuous (e.g. masonry or brickwork), this code is not used @en
notation: ACG
author at start life: Nic Roest (Idoro)
date of start life: 2006-02-21
units of measurements: m
comment: [is aspect]
scope note: Collection of facts RRB
scope note: Collection of facts LDR
scope note: Collection of facts BAS
scope note: Collection of facts PLI
type: Class
subclass of: Lengte
subclass of: Restriction
  author at start life: Marinus Vonhof
  date of start life: 2013-03-29
  on class: Buisdeel
  on property: has as aspect (inverse)
  max qualified cardinality: 1
subclass of: Restriction
  on property: has as value
  all values from: decimal

Wijze van inwinning (coll)
author of change: Johan Post
date of change: 2022-11-25
comment: [is coll]
scope note: Collection of facts TOP
type: Class
subclass of: Verzameling soorten

Collection of facts LDR
author of change: Wouter van Riel
date of change: 2021-11-19
definition: Bevat concepten voor inspecteren conform leidraad 2019. Is aanvullend op feitencollecties TOP, EN.
author at start life: Marinus Vonhof
date of start life: 2020-12-15
comment: 20210131/mv: De combi met EN verwijderd, geheel EN meenemen. Er was al nagenoeg complete overlap
scope note: Collection of facts BAS
type: Class
subclass of: Feitencollectie
subclass of: Restriction
  author at start life: Marinus Vonhof
  date of start life: 2021-01-28
  on class: Deelmodel RibHeen
  on property: has as part (inverse)
  qualified cardinality: 1
subclass of: Restriction
  author at start life: Marinus Vonhof
  date of start life: 2021-01-28
  on class: Deelmodel RibTerug
  on property: has as part (inverse)
  qualified cardinality: 1
subclass of: Restriction
  author at start life: Marinus Vonhof
  date of start life: 2021-01-28
  on class: Deelmodel Totaal
  on property: has as part (inverse)
  qualified cardinality: 1

Technologie
author of change: Marinus Vonhof
date of change: 2021-01-09
definition: Bij activiteit: werkwijze, eisen
author at start life: Nic Roest (Idoro)
date of start life: 2008-03-11
validity context: 6d
comment: Onderscheidend kenmerk
comment: [is aspect]
scope note: Collection of facts TOP
type: Class
subclass of: Onderscheidend kenmerk

Uitvoering
author of change: Marinus Vonhof
date of change: 2021-01-09
definition: Materiaal, afwerking, vorm
author at start life: Nic Roest (Idoro)
date of start life: 2008-03-11
validity context: 6d
comment: Onderscheidend kenmerk
comment: [is aspect]
scope note: Collection of facts TOP
type: Class
subclass of: Onderscheidend kenmerk

Collection of facts REV
author of change: Marinus Vonhof
date of change: 2025-05-19
definition: Model voor de registratie van revisies. Is aanvullend op feitencollectie TOP.
author at start life: Johan Post
date of start life: 2024-09-10
scope note: Collection of facts BAS
type: Class
subclass of: Feitencollectie
subclass of: Restriction
  on class: Deelmodel Dataset
  on property: has as part (inverse)
  qualified cardinality: 1
subclass of: Restriction
  on class: Deelmodel Revisies
  on property: has as part (inverse)
  qualified cardinality: 1

Aangroei
definition: [NEN 3300:1996] Verzameling van organismen, die zich op de buiswand hebben vastgehecht of in slierten aan de buiswand hangen
author at start life: Marinus Vonhof
date of start life: 2022-09-30
validity context: *d
scope note: Collection of facts BAS
type: Class
subclass of: NEN 3300 Term

NEN 3300 Term
definition: Term uit de NEN 3300:1996 die verder niet wordt toegepast (als activiteit, fysiek object, ...) in dit datamodel
author at start life: Marinus Vonhof
date of start life: 2022-09-30
validity context: *d
scope note: Collection of facts BAS
scope note: Collection of facts DMO
type: Class
subclass of: Informatiedrager

Collection of facts BAS
author of change: Wouter van Riel
date of change: 2021-11-19
definition: Bevat de concepten die in het algemeen worden uitgewisseld in GWSW Datasets (voorkomen in beheersystemen). Is aanvullend op feitencollecties TOP, MDS, HYD.
author at start life: Marinus Vonhof
date of start life: 2020-12-15
type: Class
subclass of: Feitencollectie
subclass of: Restriction
  author at start life: Marinus Vonhof
  date of start life: 2021-01-28
  on class: Deelmodel Basis
  on property: has as part (inverse)
  qualified cardinality: 1
subclass of: Restriction
  author at start life: Marinus Vonhof
  date of start life: 2021-01-28
  on class: Deelmodel Dataset
  on property: has as part (inverse)
  qualified cardinality: 1
subclass of: Restriction
  author at start life: Marinus Vonhof
  date of start life: 2021-01-28
  on class: Deelmodel Totaal
  on property: has as part (inverse)
  qualified cardinality: 1
subclass of: Restriction
  author at start life: Marinus Vonhof
  date of start life: 2024-10-31
  on class: Deelmodel IMBOR-SW
  on property: has as part (inverse)
  qualified cardinality: 1

Datum
author of change: Marinus Vonhof
date of change: 2025-01-16
date of change: 2017-11-16
definition: [IMBOR] Aanduiding van een bepaalde dag volgens een kalender.
author at start life: Marinus Vonhof
date of start life: 2015-02-28
units of measurements: yyyy-mm-dd
comment: [is aspect]
scope note: Collection of facts TOP
type: Class
subclass of: Kenmerk
subclass of: Restriction
  on property: has as value
  all values from: date

Aanlegdiepte
definition: De algemene aanlegdiepte van leidingen en hulpstukken die onderdeel zijn van de aansluiting
author at start life: Marinus Vonhof
date of start life: 2024-05-16
units of measurements: m
comment: [is aspect]
scope note: Collection of facts BAS
type: Class
subclass of: Afstand
subclass of: Restriction
  on property: has as value
  all values from: decimal
subclass of: Restriction
  on class: Aansluiting
  on property: has as aspect (inverse)
  max qualified cardinality: 1

Afstand
author of change: Marinus Vonhof
date of change: 2015-02-28
author at start life: Nic Roest (Idoro)
date of start life: 2006-03-03
comment: [is aspect]
scope note: Collection of facts TOP
type: Class
subclass of: Kenmerk

Aansluiting
author of change: Marinus Vonhof
date of change: 2018-10-17
definition: Het geheel van overdrachtspunt, leiding en inlaat voor de aanvoer van afvalwater
author at start life: Marinus Vonhof
date of start life: 2015-02-28
validity context: 3d 5d 10f 11d 13d 14f 15d
scope note: Collection of facts TOP
type: Class
subclass of: Fysiek object
subclass of: Restriction
  author of change: Marinus Vonhof
  date of change: 2019-05-15
  author at start life: Finy Teitsma (Oranjewoud)
  date of start life: 2007-11-30
  on class: Inlaat
  on property: has as part
  qualified cardinality: 1
subclass of: Restriction
  author of change: Marinus Vonhof
  date of change: 2016-04-22
  author at start life: Marinus Vonhof
  date of start life: 2014-03-15
  on class: Vrijverval rioolstelsel
  on property: has as part (inverse)
  qualified cardinality: 1
subclass of: Restriction
  author of change: Marinus Vonhof
  date of change: 2020-02-17
  author at start life: Marinus Vonhof
  date of start life: 2019-05-15
  on class: Registratief gebied
  on property: has as part (inverse)
  max qualified cardinality: 1
subclass of: Restriction
  author of change: Marinus Vonhof
  date of change: 2021-08-05
  author at start life: Marinus Vonhof
  date of start life: 2018-04-05
  on class: Standpijp
  on property: has as part
  min qualified cardinality: 0
subclass of: Restriction
  author of change: Marinus Vonhof
  date of change: 2021-08-05
  author at start life: Marinus Vonhof
  date of start life: 2018-12-06
  on class: Ontlastput
  on property: has as part
  min qualified cardinality: 0
subclass of: Restriction
  author of change: Marinus Vonhof
  date of change: 2021-08-06
  author at start life: Marinus Vonhof
  date of start life: 2021-08-05
  on class: Flexibel zettingsstuk
  on property: has as part
  min qualified cardinality: 0
subclass of: Restriction
  author of change: Marinus Vonhof
  date of start life: 2024-05-16
  on class: Aanlegdiepte
  on property: has as aspect
  max qualified cardinality: 1
subclass of: Restriction
  author at start life: Marinus Vonhof
  date of start life: 2019-05-15
  on class: Ondergrond
  on property: has as part (inverse)
  max qualified cardinality: 1
subclass of: Restriction
  author at start life: Marinus Vonhof
  date of start life: 2019-05-15
  on class: Straat
  on property: has as part (inverse)
  max qualified cardinality: 1
subclass of: Restriction
  author at start life: Marinus Vonhof
  date of start life: 2019-05-15
  on class: Goot
  on property: has as part
  min qualified cardinality: 0
subclass of: Restriction
  author at start life: Marinus Vonhof
  date of start life: 2021-08-05
  on class: Slangsifon
  on property: has as part
  min qualified cardinality: 0
subclass of: Restriction
  author at start life: Marinus Vonhof
  date of start life: 2022-10-02
  on class: Ontstoppingsstuk
  on property: has as part
  min qualified cardinality: 0
subclass of: Restriction
  author at start life: Marinus Vonhof
  date of start life: 2022-10-02
  on class: Verbindingsstuk
  on property: has as part
  min qualified cardinality: 0
subclass of: Restriction
  author at start life: Marinus Vonhof
  date of start life: 2024-07-16
  on class: Maaiveldoriëntatie
  on property: is connected to
  max qualified cardinality: 1
subclass of: Restriction
  on property: heeft Functie
  has value: AanvoerVanAfvalwater

Collection of facts PLI
author of change: Wouter van Riel
date of change: 2021-11-19
definition: Model voor de registratie van persleidingen inclusief incidenten. Is aanvullend op feitencollectie TOP.
author at start life: Marinus Vonhof
date of start life: 2020-12-15
comment: 20210201/mv: De selectieve combi met TOP verwijderd, geheel TOP meenemen
scope note: Collection of facts BAS
type: Class
subclass of: Feitencollectie
subclass of: Restriction
  author at start life: Marinus Vonhof
  date of start life: 2021-01-28
  on class: Deelmodel Persleidingen
  on property: has as part (inverse)
  qualified cardinality: 1
subclass of: Restriction
  author at start life: Marinus Vonhof
  date of start life: 2024-10-25
  on class: Deelmodel Dataset
  on property: has as part (inverse)
  qualified cardinality: 1
subclass of: Restriction
  author at start life: Marinus Vonhof
  date of start life: 2024-10-29
  on class: Deelmodel Totaal
  on property: has as part (inverse)
  qualified cardinality: 1

Maatregel
author of change: Marinus Vonhof
date of change: 2018-12-10
definition: [IRIS-RIOKEN:2012] Activiteiten die worden uitgevoerd ter verbetering van werken
author at start life: Marinus Vonhof
date of start life: 2013-03-26
validity context: 1f 3f 5d 10f 11d 12f 14f
scope note: Collection of facts TOP
type: Class
subclass of: Activiteit
subclass of: Restriction
  author of change: Marinus Vonhof
  date of change: 2018-05-01
  author at start life: Marinus Vonhof
  date of start life: 2013-03-26
  validity context: 1t 3t 12t
  on class: Datum maatregel
  on property: has as aspect
  max qualified cardinality: 1
subclass of: Restriction
  author of change: Marinus Vonhof
  date of change: 2019-03-14
  author at start life: Marinus Vonhof
  date of start life: 2013-03-26
  on class: Grondslag maatregel
  on property: has as aspect
  max qualified cardinality: 1
subclass of: Restriction
  author of change: Marinus Vonhof
  date of change: 2019-07-10
  author at start life: Marinus Vonhof
  date of start life: 2013-03-26
  on class: Interval maatregel
  on property: has as aspect
  max qualified cardinality: 1
subclass of: Restriction
  author of change: Marinus Vonhof
  date of change: 2019-07-10
  author at start life: Marinus Vonhof
  date of start life: 2013-03-26
  on class: Status maatregel
  on property: has as aspect
  max qualified cardinality: 1

Collection of facts MTR
author of change: Wouter van Riel
date of change: 2021-11-19
definition: Model voor maatregelen, focus op renovaties rioolleidingen. Bevat verwijzingen naar de EN13508-2. toestandsaspecten zijn input voor de activiteiten. Is aanvullend op feitencollecties TOP, EN.
author at start life: Marinus Vonhof
date of start life: 2020-12-15
comment: 20210131/mv: De selectieve combi met EN verwijderd, geheel EN meenemen
scope note: Collection of facts BAS
type: Class
subclass of: Feitencollectie
subclass of: Restriction
  author at start life: Marinus Vonhof
  date of start life: 2021-01-28
  on class: Deelmodel Maatregelen
  on property: has as part (inverse)
  qualified cardinality: 1

Aanlegvergunning
definition: [NEN 3300:1996] Vergunning op grond van de Wro
author at start life: Marinus Vonhof
date of start life: 2022-09-30
validity context: *d
scope note: Collection of facts BAS
type: Class
subclass of: NEN 3300 Term

Kenmerk
author of change: Marinus Vonhof
author of change: Wouter van Riel
date of change: 2024-04-22
date of change: 2017-11-16
definition: Eigenschap van iets
definition: [Gellish] Is an individual object that is a phenomenon that is possessed by a totality and cannot exist without the existence of its possessor. It is an intrinsic, non-separable facet of its possessor @en
author at start life: Marinus Vonhof
date of start life: 2013-09-03
validity context: *f
scope note: Collection of facts TOP
type: Class

Collection of facts HDX
author of change: Wouter van Riel
date of change: 2021-11-19
definition: Model met uitwisselformaat HydX. Is aanvullend op feitencollectie TOP.
author at start life: Marinus Vonhof
date of start life: 2020-12-15
scope note: Collection of facts BAS
type: Class
subclass of: Feitencollectie
subclass of: Restriction
  author at start life: Marinus Vonhof
  date of start life: 2021-01-28
  on class: Deelmodel HydX
  on property: has as part (inverse)
  qualified cardinality: 1

Verzameling soorten
author of change: Marinus Vonhof
date of change: 2017-11-16
author at start life: Marinus Vonhof
date of start life: 2014-07-11
comment: collection of qualitative aspects is specialisatie van collection of classes
alternative label: Collectie kenmerkwaarden
alternative label: Domeinwaarden
alternative label: Verzameling kenmerkwaarden
scope note: Collection of facts TOP
type: Class

Activiteit
author of change: Marinus Vonhof
date of change: 2025-01-16
date of change: 2016-09-16
definition: [Gellish] Is a deed (a performance by changing a state of affairs) by carrying out an action or pattern of behavior. @en
definition: [IMBOR] Iets dat mogelijk of daadwerkelijke gebeurt in ruimte en tijd.
author at start life: Marinus Vonhof
date of start life: 2011-12-02
validity context: 1f 3f 5d 6d 10f 11d 12f 14f 15d
scope note: Collection of facts TOP
type: Class

Functie
author of change: Marinus Vonhof
date of change: 2025-01-16
date of change: 2021-01-09
definition: Wat doet het
definition: [IMBOR] Een activiteit die het externe gedrag beschrijft van het object die de activiteit uitvoert.
author at start life: Marinus Vonhof
date of start life: 2013-09-03
comment: Onderscheidend kenmerk
comment: [is aspect]
scope note: Collection of facts TOP
type: Class
subclass of: Onderscheidend kenmerk

Doel
author of change: Marinus Vonhof
date of change: 2021-01-09
definition: Bij activiteit: wat te bereiken
author at start life: Marinus Vonhof
date of start life: 2014-04-29
validity context: 6d
comment: Onderscheidend kenmerk
comment: [is aspect]
scope note: Collection of facts TOP
type: Class
subclass of: Onderscheidend kenmerk

Aanslagniveau
author of change: Marinus Vonhof
date of change: 2018-05-03
definition: [NEN 3300:1996] Peil waarop een pomp in werking treedt
author at start life: Nic Roest (Idoro)
date of start life: 2006-02-21
units of measurements: m
see also: [IRIS-RIOKEN:2012] Ingesteld peil in de pompkelder van rioolgemaal. Als de pompkelder tot aan het inslagpeil is gevuld, wordt een pomp gestart om de kelder weer leeg te pompen.
alternative label: Inslagpeil
comment: [is aspect]
scope note: Collection of facts MDS
scope note: Collection of facts HYD
scope note: Collection of facts RGM
type: Class
subclass of: Hoogte t.o.v. NAP
subclass of: Restriction
  on property: has as value
  all values from: decimal

Hoogte t.o.v. NAP
author of change: Marinus Vonhof
author of change: Eric van Gorkom
date of change: 2015-05-29
date of change: 2024-05-13
date of change: 2024-05-20
date of change: 2024-07-12
definition: Conform coordinatenstelsel EPSG:5709
definition: Hoogte aangegeven t.o.v. NAP
author at start life: Nic Roest (Idoro)
date of start life: 2006-02-21
units of measurements: m
alternative label: Normaal Amsterdams Peil
comment: [is aspect]
scope note: Collection of facts TOP
type: Class
subclass of: Kenmerk
subclass of: Restriction
  on property: has as value
  all values from: Z-coördinaat (datatype)

Collection of facts HYD
author of change: Wouter van Riel
date of change: 2021-11-19
definition: Model voor netwerkberekeningen vrijvervalstelsels. Is aanvullend op feitencollectie TOP.
author at start life: Marinus Vonhof
date of start life: 2020-12-15
scope note: Collection of facts BAS
type: Class
subclass of: Feitencollectie
subclass of: Restriction
  author at start life: Marinus Vonhof
  date of start life: 2021-01-28
  on class: Deelmodel Basis
  on property: has as part (inverse)
  qualified cardinality: 1
subclass of: Restriction
  author at start life: Marinus Vonhof
  date of start life: 2021-01-28
  on class: Deelmodel Dataset
  on property: has as part (inverse)
  qualified cardinality: 1
subclass of: Restriction
  author at start life: Marinus Vonhof
  date of start life: 2021-01-28
  on class: Deelmodel Hyd
  on property: has as part (inverse)
  qualified cardinality: 1
subclass of: Restriction
  author at start life: Marinus Vonhof
  date of start life: 2021-01-28
  on class: Deelmodel HydX
  on property: has as part (inverse)
  qualified cardinality: 1
subclass of: Restriction
  author at start life: Marinus Vonhof
  date of start life: 2021-01-28
  on class: Deelmodel Totaal
  on property: has as part (inverse)
  qualified cardinality: 1
subclass of: Restriction
  author at start life: Marinus Vonhof
  date of start life: 2024-10-31
  on class: Deelmodel IMBOR-SW
  on property: has as part (inverse)
  qualified cardinality: 1

Collection of facts RGM
author of change: Wouter van Riel
date of change: 2021-11-19
definition: Model met details rioolgemalen en pompputten (concept). Is aanvullend op feitencollectie TOP.
author at start life: Marinus Vonhof
date of start life: 2020-12-15
scope note: Collection of facts BAS
type: Class
subclass of: Feitencollectie
subclass of: Restriction
  author at start life: Marinus Vonhof
  date of start life: 2021-01-28
  on class: Deelmodel Gemalen
  on property: has as part (inverse)
  qualified cardinality: 1

Aanslagniveau benedenstrooms
author of change: Marinus Vonhof
date of change: 2018-05-03
definition: Aanslagniveau aan de uitlaatzijde van de pomp(en)
author at start life: Marinus Vonhof
date of start life: 2013-02-05
units of measurements: m
alternative label: Aanslagniveau stroomafwaarts
comment: [is aspect]
scope note: Collection of facts HYD
scope note: Collection of facts RGM
type: Class
subclass of: Aanslagniveau
subclass of: Restriction
  author of change: Marinus Vonhof
  date of change: 2016-04-23
  author at start life: Marinus Vonhof
  date of start life: 2013-02-05
  on class: Pomp
  on property: has as aspect (inverse)
  max qualified cardinality: 1
subclass of: Restriction
  on property: has as value
  all values from: decimal

Pomp
author of change: Marinus Vonhof
author of change: Johan Post
date of change: 2017-08-31
date of change: 2024-04-30
definition: Een technische installatie die het afvalwater onder druk transporteert.
notation: PMP
author at start life: Finy Teitsma (Oranjewoud)
date of start life: 2007-10-23
validity context: 1d 10d 12d
see also: Vervallen link: https://imgeo.geostandaarden.nl/def/imgeo-object/installatie/pomp-niet-bgt
see also: [IHW:20130706] Werktuig dat door middel van een verschil in druk vloeistoffen of gassen verplaatst
see also: [IMGeo:1.0/2007] Werktuig dat door middel van een verschil in druk vloeistoffen of gassen verplaatst.
see also: [IRIS-RIOKEN:2012] Werktuig dat door middel van een verschil in druk vloeistoffen of gassen verplaatst.
alternative label: Pomp (type installatie)
scope note: Collection of facts MDS
scope note: Collection of facts REV
scope note: Collection of facts HYD
scope note: Collection of facts RGM
scope note: Collection of facts DMO
type: Class
subclass of: Constructieonderdeel
subclass of: Restriction
  author of change: Finy Teitsma (Oranjewoud)
  date of change: 2007-11-29
  author at start life: Finy Teitsma (Oranjewoud)
  date of start life: 2007-10-23
  on class: Besturingskast
  on property: is connected to
  max qualified cardinality: 1
subclass of: Restriction
  author of change: Marinus Vonhof
  date of change: 2016-04-15
  author at start life: Finy Teitsma (Oranjewoud)
  date of start life: 2006-02-25
  on class: Pompput
  on property: has as part (inverse)
  max qualified cardinality: 1
subclass of: Restriction
  author of change: Marinus Vonhof
  date of change: 2017-08-19
  author at start life: Finy Teitsma (Oranjewoud)
  date of start life: 2006-02-25
  on class: Gemaal
  on property: has as part (inverse)
  max qualified cardinality: 1
subclass of: Restriction
  author of change: Marinus Vonhof
  date of change: 2013-09-10
  author at start life: Marinus Vonhof
  date of start life: 2013-02-05
  on class: Serienummer
  on property: has as aspect
  max qualified cardinality: 1
subclass of: Restriction
  author of change: Marinus Vonhof
  date of change: 2014-03-25
  author at start life: Marinus Vonhof
  date of start life: 2013-02-05
  on class: Ontwerpcapaciteit pomp
  on property: has as aspect
  max qualified cardinality: 1
subclass of: Restriction
  author of change: Marinus Vonhof
  date of change: 2015-09-20
  author at start life: Marinus Vonhof
  date of start life: 2015-07-27
  on class: Spoelvoorziening
  on property: has as part (inverse)
  max qualified cardinality: 1
subclass of: Restriction
  author of change: Marinus Vonhof
  date of change: 2016-04-13
  author at start life: Marinus Vonhof
  date of start life: 2015-05-29
  on class: Ledigingsvoorziening
  on property: has as part (inverse)
  max qualified cardinality: 1
subclass of: Restriction
  author of change: Marinus Vonhof
  date of change: 2016-04-23
  author at start life: Marinus Vonhof
  date of start life: 2013-02-05
  validity context: 11t 14t
  on class: Aanslagniveau benedenstrooms
  on property: has as aspect
  max qualified cardinality: 1
subclass of: Restriction
  author of change: Marinus Vonhof
  date of change: 2016-04-23
  author at start life: Marinus Vonhof
  date of start life: 2013-02-05
  validity context: 11t 14t
  on class: Afslagniveau benedenstrooms
  on property: has as aspect
  max qualified cardinality: 1
subclass of: Restriction
  author of change: Marinus Vonhof
  date of change: 2017-08-31
  author at start life: Marinus Vonhof
  date of start life: 2011-12-15
  validity context: 11t 14t
  on class: Aanslagniveau bovenstrooms
  on property: has as aspect
  max qualified cardinality: 1
subclass of: Restriction
  author of change: Marinus Vonhof
  date of change: 2017-08-31
  author at start life: Marinus Vonhof
  date of start life: 2011-12-15
  validity context: 11t 14t
  on class: Afslagniveau bovenstrooms
  on property: has as aspect
  max qualified cardinality: 1
subclass of: Restriction
  author of change: Marinus Vonhof
  date of change: 2018-05-03
  author at start life: Marinus Vonhof
  date of start life: 2012-04-22
  validity context: 5t 11t 14t
  on class: Onderdeeloriëntatie
  on property: has as aspect
  max qualified cardinality: 1
subclass of: Restriction
  author of change: Marinus Vonhof
  date of change: 2018-05-03
  author at start life: Marinus Vonhof
  date of start life: 2013-02-05
  on class: Compartiment
  on property: has as part (inverse)
  max qualified cardinality: 1
subclass of: Restriction
  author of change: Marinus Vonhof
  date of change: 2018-12-12
  author at start life: Marinus Vonhof
  date of start life: 2011-12-15
  validity context: 5t 11t 14t
  comment: Temporeel kenmerk, met kenmerk Inwinning
  on class: Pompcapaciteit
  on property: has as aspect
  min qualified cardinality: 0
subclass of: Restriction
  author of change: Marinus Vonhof
  date of change: 2019-03-20
  author at start life: Marinus Vonhof
  date of start life: 2016-04-24
  on class: Service mechanisch
  on property: has as input (inverse)
  max qualified cardinality: 1
subclass of: Restriction
  author at start life: Finy Teitsma (Oranjewoud)
  date of start life: 2006-02-25
  on class: Pompfabrikaat
  on property: has as aspect
  max qualified cardinality: 1
subclass of: Restriction
  author at start life: Marinus Vonhof
  date of start life: 2013-02-05
  on class: Frequentie-omvormer
  on property: has as part
  max qualified cardinality: 1
subclass of: Restriction
  author at start life: Marinus Vonhof
  date of start life: 2014-04-29
  on class: Bijzondere putconstructie
  on property: has as part (inverse)
  max qualified cardinality: 1
subclass of: Restriction
  author at start life: Marinus Vonhof
  date of start life: 2018-12-06
  on class: Motorvermogen
  on property: has as aspect
  max qualified cardinality: 1
subclass of: Restriction
  on property: heeft Technologie
  has value: DoorMiddelVanDrukverschil
subclass of: Restriction
  on property: heeft Technologie
  has value: Mechanisch
subclass of: Restriction
  on property: heeft Functie
  has value: VerplaatsenVanWater
subclass of: Restriction
  on class: Overstortbemaling
  on property: has as part (inverse)
  max qualified cardinality: 1

Aanslagniveau bovenstrooms
author of change: Marinus Vonhof
date of change: 2018-05-03
definition: Aanslagniveau aan de inlaatzijde van de pomp(en)
author at start life: Marinus Vonhof
date of start life: 2013-02-05
units of measurements: m
alternative label: Aanslagniveau stroomopwaarts
comment: [is aspect]
scope note: Collection of facts HYD
scope note: Collection of facts RGM
type: Class
subclass of: Aanslagniveau
subclass of: Restriction
  author of change: Marinus Vonhof
  date of change: 2017-08-31
  author at start life: Marinus Vonhof
  date of start life: 2011-12-15
  on class: Pomp
  on property: has as aspect (inverse)
  max qualified cardinality: 1
subclass of: Restriction
  on property: has as value
  all values from: decimal

Toepassing
author of change: Marinus Vonhof
date of change: 2021-01-09
definition: Proces waarin iets gebruikt wordt, waarom
author at start life: Nic Roest (Idoro)
date of start life: 2008-03-11
validity context: 6d
comment: Onderscheidend kenmerk
comment: [is aspect]
scope note: Collection of facts TOP
type: Class
subclass of: Onderscheidend kenmerk

Fysiek object
label: Physical object @en
author of change: Eric van Gorkom
date of change: 2021-10-01
definition: [Gellish] That is a distribution of matter or energy in time and space that satisfies the laws of physics. All kinds of physical objects are subtypes of this class. It is the top of the hierarchical network of specializations of kinds of physical objects. @en
definition: [NEN 2660] Een object dat bestaat of kan bestaan binnen de fysieke 4D ruimte-tijd. Het vormt een manifestatie en een afbakening van materie en/of energie, en is (in)direct waarneembaar door de zintuigen.
author at start life: Marinus Vonhof
date of start life: 2013-09-03
validity context: *f
scope note: Collection of facts TOP
type: Class
subclass of: Restriction
  author of change: Marinus Vonhof
  date of change: 2017-05-31
  date of change: 2023-01-16
  author at start life: Marinus Vonhof
  date of start life: 2015-07-27
  on class: Rioleringsbeheerder
  on property: has as input (inverse)
  max qualified cardinality: 1
subclass of: Restriction
  author at start life: Marinus Vonhof
  date of start life: 2013-09-28
  validity context: 14t 15t
  on class: Begindatum
  on property: has as aspect
  max qualified cardinality: 1
subclass of: Restriction
  author at start life: Marinus Vonhof
  date of start life: 2013-09-28
  on class: Einddatum
  on property: has as aspect
  max qualified cardinality: 1
subclass of: Restriction
  author at start life: Marinus Vonhof
  date of start life: 2017-05-31
  on class: Eigenaar
  on property: has as input (inverse)
  max qualified cardinality: 1
subclass of: Restriction
  author at start life: Marinus Vonhof
  date of start life: 2021-08-06
  on class: Fabrikant
  on property: has as output (inverse)
  max qualified cardinality: 1
subclass of: Restriction
  author at start life: Marinus Vonhof
  date of start life: 2021-08-06
  on class: Leverancier
  on property: has as output (inverse)
  max qualified cardinality: 1
subclass of: Restriction
  author at start life: Marinus Vonhof
  date of start life: 2023-01-16
  on class: Gegevensbeheerder
  on property: has as input (inverse)
  max qualified cardinality: 1
subclass of: Restriction
  on property: has as part
  all values from: Class
    union of: Ruimte
    union of: Fysiek object
disjoint with: Ruimte

Inlaat
author of change: JohanPost
date of change: 2021-10-01
definition: Een fysieke constructie met een of meerdere aftakkingen bestemd voor het aansluiten van aansluitleidingen op het riool.
definition: [NEN 3300:1996] Punt waar aanvoer van afvalwater in een rioolstelsel mogelijk is
author at start life: Marinus Vonhof
date of start life: 2019-05-15
comment: 20151014: NEN3300-definitie aangepast
alternative label: Inlaatconstructie
alternative label: Spruitstuk
scope note: Collection of facts MDS
scope note: Collection of facts LDR
scope note: Collection of facts REV
scope note: Collection of facts MTR
type: Class
subclass of: Hulpstuk
subclass of: Restriction
  author at start life: Marinus Vonhof
  date of start life: 2013-02-05
  on class: Omtreklocatie
  on property: has as aspect
  max qualified cardinality: 1
subclass of: Restriction
  author at start life: Marinus Vonhof
  date of start life: 2018-10-27
  on class: NLCS_DRAINAGE_INLAAT
  on property: is represented by
  max qualified cardinality: 1
subclass of: Restriction
  author at start life: Marinus Vonhof
  date of start life: 2018-10-27
  on class: NLCS_GWA_HULPSTUK_INLAAT
  on property: is represented by
  max qualified cardinality: 1
subclass of: Restriction
  author at start life: Marinus Vonhof
  date of start life: 2018-10-27
  on class: NLCS_HWA_HULPSTUK_INLAAT
  on property: is represented by
  max qualified cardinality: 1
subclass of: Restriction
  author at start life: Marinus Vonhof
  date of start life: 2018-10-27
  on class: NLCS_ITR_HULPSTUK_INLAAT
  on property: is represented by
  max qualified cardinality: 1
subclass of: Restriction
  author at start life: Marinus Vonhof
  date of start life: 2018-10-27
  on class: NLCS_PERSLEIDING_HULPSTUK_INLAAT
  on property: is represented by
  max qualified cardinality: 1
subclass of: Restriction
  author at start life: Marinus Vonhof
  date of start life: 2018-10-27
  on class: NLCS_SWA_HULPSTUK_INLAAT
  on property: is represented by
  max qualified cardinality: 1
subclass of: Restriction
  author at start life: Marinus Vonhof
  date of start life: 2018-10-27
  on class: NLCS_VACUUMLEIDING_HULPSTUK_INLAAT
  on property: is represented by
  max qualified cardinality: 1
subclass of: Restriction
  author at start life: Marinus Vonhof
  date of start life: 2018-10-27
  on class: NLCS_VWA_HULPSTUK_INLAAT
  on property: is represented by
  max qualified cardinality: 1
subclass of: Restriction
  author at start life: Marinus Vonhof
  date of start life: 2022-10-02
  on class: Aansluiting
  on property: has as part (inverse)
  max qualified cardinality: 1
subclass of: Restriction
  author at start life: Wouter van Riel
  date of start life: 2021-09-23
  on class: Zadel
  on property: has as part
  max qualified cardinality: 1
subclass of: Restriction
  on property: heeft Functie
  has value: VerbindenAansluitleidingMetRioolputOfRioolleiding
subclass of: Restriction
  on class: Sym_Inlaat
  on property: is represented by
  max qualified cardinality: 1

Vrijverval rioolstelsel
label: Name of sewer system @en
author of change: Marinus Vonhof
author of change: Johan Post
author of change: Eric van Gorkom
author of change: Wouter van Riel
date of change: 2026-05-01
date of change: 2024-04-22
date of change: 2026-07-17
date of change: 2024-05-13
definition: Een rioolstelsel waarbij het transport door middel van de zwaartekracht plaatsvindt
definition: [EN13508-2+A1] The name of the sewer system, or a sewer system reference as specified by the employing authority @en
definition: [NEN-EN 752:2008] systeem van aansluitleidingen of een buitenriolering waarin het afvalwater door de zwaartekracht wordt getransporteerd en waar de leiding is ontworpen om onder normale omstandigheden deels gevuld te zijn [EN 1085:2007, definitie 2260]
notation: AAP
notation: CAP
notation: GAP
notation: JAP
author at start life: Finy Teitsma (Oranjewoud)
date of start life: 2006-02-17
validity context: *f
comment: 20151014: NEN3300-definitie aangepast
alternative label: Stelsel onder vrij verval
scope note: Collection of facts TOP
type: Class
subclass of: Rioolstelsel
subclass of: Restriction
  author of change: Marinus Vonhof
  date of change: 2016-04-22
  author at start life: Marinus Vonhof
  date of start life: 2014-03-15
  comment: 20160415: Inverse = optioneel, niet elke specialisatie zit in vv stelsel
  on class: Aansluiting
  on property: has as part
  min qualified cardinality: 1
subclass of: Restriction
  author at start life: Johan Post
  date of start life: 2026-05-01
  on class: Vrijverval transportleiding
  on property: has as part
  min qualified cardinality: 0
subclass of: Restriction
  author at start life: Marinus Vonhof
  date of start life: 2016-04-22
  on class: Afvalwatersysteem
  on property: has as part (inverse)
  qualified cardinality: 1
subclass of: Restriction
  author at start life: Marinus Vonhof
  date of start life: 2023-01-13
  on class: Doorspoelput
  on property: has as part
  min qualified cardinality: 0
subclass of: Restriction
  author at start life: Marinus Vonhof
  date of start life: 2024-05-16
  on class: Overnamepunt
  on property: has as part
  max qualified cardinality: 1
subclass of: Restriction
  on property: heeft Functie
  has value: TijdelijkeBergingVanAfvalwater
subclass of: Restriction
  on property: heeft Technologie
  has value: TransportDoorDeZwaartekracht

Registratief gebied
author of change: Marinus Vonhof
date of change: 2015-10-30
author at start life: Marinus Vonhof
author at start life: Nic Roest (Idoro)
date of start life: 2007-11-29
validity context: 1f 3f 5d 10f 11d 12f 14f
comment: [VervallenLink http://definities.geostandaarden.nl/concepten/imgeo/doc/begrip/RegistratiefGebied]
see also: [IMGeo:1.0/2007] Op basis van wet- en regelgeving afgebakend gebied dat als eenheid geldt van politiek/bestuurlijke verantwoordelijkheid of voor bedrijfsvoering.
see also: [NEN 3610:2010] Op basis van wet- of regelgeving afgebakend gebied dat als eenheid geldt van politiek/bestuurlijke verantwoordelijkheid of voor bedrijfsvoering.
alternative label: Registratieve ruimte
scope note: Collection of facts BAS
scope note: Collection of facts DMO
type: Class
subclass of: Gebied
subclass of: Restriction
  author of change: Marinus Vonhof
  date of change: 2020-02-17
  author at start life: Marinus Vonhof
  date of start life: 2019-05-15
  on class: Aansluiting
  on property: has as part
  min qualified cardinality: 0
subclass of: Restriction
  author at start life: Marinus Vonhof
  date of start life: 2018-12-12
  on class: Bouwwerk
  on property: has as part
  min qualified cardinality: 0
subclass of: Restriction
  author at start life: Marinus Vonhof
  date of start life: 2018-12-12
  on class: Leiding
  on property: has as part
  min qualified cardinality: 0
subclass of: Restriction
  author at start life: Marinus Vonhof
  date of start life: 2018-12-12
  on class: Put
  on property: has as part
  min qualified cardinality: 0
subclass of: Restriction
  author at start life: Marinus Vonhof
  date of start life: 2019-05-15
  on class: Stelsel
  on property: has as part
  min qualified cardinality: 0

Standpijp
author of change: Marinus Vonhof
date of change: 2025-01-16
date of change: 2022-09-30
date of change: 2019-03-20
definition: [NEN 3300:1996] Het verticale deel van een aansluitleiding dat is geplaatst in de inlaat van een riool
author at start life: Marinus Vonhof
date of start life: 2018-03-20
see also: [NPR 3218] Een loodrecht verticaal geplaatse buis om hoogteverschil tussen aansluitleiding en riool te overbruggen
alternative label: Standleiding
scope note: Collection of facts MDS
scope note: Collection of facts LDR
type: Class
subclass of: Aansluitleiding
subclass of: Restriction
  author of change: Marinus Vonhof
  date of change: 2021-08-05
  author at start life: Marinus Vonhof
  date of start life: 2018-04-05
  on class: Aansluiting
  on property: has as part (inverse)
  max qualified cardinality: 1
subclass of: Restriction
  on property: heeft Functie
  has value: OverbruggenHoogteverschil
subclass of: Restriction
  on property: heeft Uitvoering
  has value: VerticaalDeelAansluitendOpInlaat

Ontlastput
author of change: Marinus Vonhof
author of change: Johan Post
date of change: 2025-01-16
date of change: 2021-08-06
date of change: 2026-05-11
definition: Een put (meestal bij de regenpijp) voor de tijdelijke opslag van afvalwater, als de buitenriolering niet in staat om het afvalwater af te voeren,
author at start life: Marinus Vonhof
date of start life: 2018-12-06
validity context: 3d
scope note: Collection of facts BAS
type: Class
subclass of: Put
subclass of: Restriction
  author of change: Marinus Vonhof
  date of change: 2021-08-05
  author at start life: Marinus Vonhof
  date of start life: 2018-12-06
  on class: Aansluiting
  on property: has as part (inverse)
  max qualified cardinality: 1
subclass of: Restriction
  on property: heeft Doel
  has value: OntlastenBuitenriolering
subclass of: Restriction
  on property: heeft Functie
  has value: TijdelijkeOpslagAfvalwaterPerceel
subclass of: Restriction
  on class: Rooster
  on property: has as part
  max qualified cardinality: 1

Flexibel zettingsstuk
author of change: Marinus Vonhof
date of change: 2025-01-16
date of change: 2021-08-05
definition: Gebruikt in aansluitleidingen. Verschilt van een pendelstuk omdat het niet in axiale richting schuift.
author at start life: Marinus Vonhof
date of start life: 2020-04-17
validity context: 10d
scope note: Collection of facts BAS
type: Class
subclass of: Constructieonderdeel
subclass of: Restriction
  author of change: Marinus Vonhof
  date of change: 2021-08-06
  author at start life: Marinus Vonhof
  date of start life: 2021-08-05
  on class: Aansluiting
  on property: has as part (inverse)
  max qualified cardinality: 1
subclass of: Restriction
  author at start life: Marinus Vonhof
  date of start life: 2021-08-06
  on class: Hulpstukoriëntatie
  on property: has as aspect
  max qualified cardinality: 1
subclass of: Restriction
  on property: heeft Functie
  has value: OpvangenHorizontaleVerschuiving

Ondergrond
author at start life: Marinus Vonhof
date of start life: 2013-10-05
validity context: 1d 3d 5d 10d 11d 12d 14d 16d
comment: De ruimte 'ondergrond' bevat leiding/put, via ondergrond verwijzen naar grondsoort enz
alternative label: Bodem
scope note: Collection of facts TOP
type: Class
subclass of: Ruimte
subclass of: Restriction
  author of change: Marinus Vonhof
  date of change: 2014-07-11
  author at start life: Nic Roest (Idoro)
  date of start life: 2007-11-29
  on class: Grondsoort
  on property: has as aspect
  max qualified cardinality: 1
subclass of: Restriction
  author at start life: Marinus Vonhof
  date of start life: 2018-09-03
  on class: Bouwwerk
  on property: has as part
  min qualified cardinality: 0
subclass of: Restriction
  author at start life: Marinus Vonhof
  date of start life: 2018-09-03
  on class: Kabel
  on property: has as part
  min qualified cardinality: 0
subclass of: Restriction
  author at start life: Marinus Vonhof
  date of start life: 2018-09-03
  on class: Leiding
  on property: has as part
  min qualified cardinality: 0
subclass of: Restriction
  author at start life: Marinus Vonhof
  date of start life: 2018-09-03
  on class: Put
  on property: has as part
  min qualified cardinality: 0
subclass of: Restriction
  author at start life: Marinus Vonhof
  date of start life: 2019-05-15
  on class: Aansluiting
  on property: has as part
  min qualified cardinality: 0

Straat
author of change: Marinus Vonhof
author of change: Johan Post
date of change: 2025-01-16
date of change: 2018-12-05
date of change: 2026-04-30
date of change: 2024-11-26
definition: [IMBOR] Deze wegverbinding is al dan niet een openbare weg.
author at start life: Marinus Vonhof
date of start life: 2013-03-26
comment: Ruimte Straat bevat leiding,put, op die manier koppelen aan leiding enz
alternative label: Openbare weg
scope note: Collection of facts TOP
type: Class
subclass of: Bovengrond
subclass of: Restriction
  author of change: Marinus Vonhof
  date of change: 2015-10-31
  author at start life: Marinus Vonhof
  date of start life: 2013-03-26
  on class: Verhardingstype
  on property: has as aspect
  max qualified cardinality: 1
subclass of: Restriction
  author of change: Marinus Vonhof
  date of change: 2017-08-31
  author at start life: Marinus Vonhof
  date of start life: 2013-03-26
  on class: Straatnaam
  on property: has as aspect
  qualified cardinality: 1
subclass of: Restriction
  author of change: Marinus Vonhof
  date of change: 2018-12-05
  author at start life: Marinus Vonhof
  date of start life: 2018-09-03
  on class: Bouwwerk
  on property: has as part
  min qualified cardinality: 0
subclass of: Restriction
  author of change: Marinus Vonhof
  date of change: 2018-12-05
  author at start life: Marinus Vonhof
  date of start life: 2018-09-03
  on class: Kabel
  on property: has as part
  min qualified cardinality: 0
subclass of: Restriction
  author of change: Marinus Vonhof
  date of change: 2018-12-11
  author at start life: Marinus Vonhof
  date of start life: 2013-10-05
  on class: Type bebouwing
  on property: has as aspect
  max qualified cardinality: 1
subclass of: Restriction
  author at start life: Marinus Vonhof
  date of start life: 2013-03-26
  on class: Wegtype
  on property: has as aspect
  max qualified cardinality: 1
subclass of: Restriction
  author at start life: Marinus Vonhof
  date of start life: 2019-05-15
  on class: Aansluiting
  on property: has as part
  min qualified cardinality: 0

Goot
author of change: Marinus Vonhof
author of change: Johan Post
author of change: Eric van Gorkom
date of change: 2021-10-01
date of change: 2022-12-24
date of change: 2023-01-10
definition: Aansluitend aan of in de 'verharding' aangebrachte verharde, open afvoer voor hemelwater / Aanvoer afstromend hemelwater vanaf de verharding middels een aansluitend aan de verharding aangebrachte verharde open afvoer
author at start life: Finy Teitsma (Oranjewoud)
date of start life: 2007-10-23
validity context: 1d
alternative label: Lijnafwatering
scope note: Collection of facts MDS
scope note: Collection of facts REV
scope note: Collection of facts HYD
type: Class
subclass of: Open leiding
subclass of: Restriction
  author of change: Marinus Vonhof
  date of change: 2016-04-13
  author at start life: Finy Teitsma (Oranjewoud)
  date of start life: 2007-10-24
  on class: Hemelwaterstelsel
  on property: has as part (inverse)
  max qualified cardinality: 1
subclass of: Restriction
  author of change: Marinus Vonhof
  date of change: 2019-04-30
  author at start life: Finy Teitsma (Oranjewoud)
  date of start life: 2007-10-24
  on class: Oppervlaktewatersysteem
  on property: has as part (inverse)
  max qualified cardinality: 1
subclass of: Restriction
  author of change: Marinus Vonhof
  date of change: 2019-04-30
  author at start life: Marinus Vonhof
  date of start life: 2014-04-30
  on class: Gemengd rioolstelsel
  on property: has as part (inverse)
  max qualified cardinality: 1
subclass of: Restriction
  author at start life: Marinus Vonhof
  date of start life: 2018-10-27
  on class: NLCS_HWA_GOOT
  on property: is represented by
  max qualified cardinality: 1
subclass of: Restriction
  author at start life: Marinus Vonhof
  date of start life: 2019-05-15
  on class: Aansluiting
  on property: has as part (inverse)
  max qualified cardinality: 1
subclass of: Restriction
  author at start life: Marinus Vonhof
  date of start life: 2019-10-08
  on class: Sym_Goot
  on property: is represented by
  max qualified cardinality: 1
subclass of: Restriction
  on property: heeft Uitvoering
  has value: OpenEnAansluitendAanVerharding
subclass of: Restriction
  on property: heeft Uitvoering
  has value: OpeningAanDeBovenzijde
subclass of: Restriction
  on property: heeft Functie
  has value: OpvangEnAfvoerHemelwater
subclass of: Restriction
  on class: Infiltratiestelsel
  on property: has as part (inverse)
  max qualified cardinality: 1

Slangsifon
author of change: Marinus Vonhof
date of change: 2020-05-26
definition: Gebruikt in aansluitleidingen om deze (aan één zijde) stankvrij te maken. Vaak (altijd?) gecombineerd met een ontstoppingsstuk.
author at start life: Marinus Vonhof
date of start life: 2020-04-17
scope note: Collection of facts REV
scope note: Collection of facts BAS
type: Class
subclass of: Stankafsluiter
subclass of: Restriction
  author at start life: Marinus Vonhof
  date of start life: 2021-08-05
  on class: Aansluiting
  on property: has as part (inverse)
  max qualified cardinality: 1
subclass of: Restriction
  on property: heeft Uitvoering
  has value: StankAfsluitenMetWater

Ontstoppingsstuk
author of change: Johan Post
date of change: 2021-10-01
definition: Een hulpstuk waarin een met een deksel afsluitbare opening is aangebracht bestemd voor het ontstoppen van een leiding. / Variant: Hulpstuk bestemd voor het inspecteren van, ontstoppen van en/of het bieden van toegang tot de aangesloten leidingen
definition: [NEN 3300:1996] Hulpstuk waarin een met een deksel afsluitbare opening is aangebracht en bedoeld voor inspectie en onderhoud in geval van verstopping
definition: [NEN-EN 752:2008] niet-mantoegankelijk hulpstuk met kleine middellijn op een aansluitleiding of riool voor reiniging of inspectie
author at start life: Finy Teitsma (Oranjewoud)
date of start life: 2006-05-23
comment: 20151014: NEN3300-definitie aangepast
scope note: Collection of facts MDS
type: Class
subclass of: Hulpstuk
subclass of: Restriction
  author at start life: Marinus Vonhof
  date of start life: 2013-09-29
  on class: Deksel
  on property: has as part
  qualified cardinality: 1
subclass of: Restriction
  author at start life: Marinus Vonhof
  date of start life: 2018-10-27
  on class: NLCS_GWA_HULPSTUK_ONTSTOPPINGSSTUK
  on property: is represented by
  max qualified cardinality: 1
subclass of: Restriction
  author at start life: Marinus Vonhof
  date of start life: 2018-10-27
  on class: NLCS_HWA_HULPSTUK_ONTSTOPPINGSSTUK
  on property: is represented by
  max qualified cardinality: 1
subclass of: Restriction
  author at start life: Marinus Vonhof
  date of start life: 2018-10-27
  on class: NLCS_ITR_HULPSTUK_ONTSTOPPINGSSTUK
  on property: is represented by
  max qualified cardinality: 1
subclass of: Restriction
  author at start life: Marinus Vonhof
  date of start life: 2018-10-27
  on class: NLCS_PERSLEIDING_HULPSTUK_ONTSTOPPINGSSTUK
  on property: is represented by
  max qualified cardinality: 1
subclass of: Restriction
  author at start life: Marinus Vonhof
  date of start life: 2018-10-27
  on class: NLCS_SWA_HULPSTUK_ONTSTOPPINGSSTUK
  on property: is represented by
  max qualified cardinality: 1
subclass of: Restriction
  author at start life: Marinus Vonhof
  date of start life: 2018-10-27
  on class: NLCS_VACUUMLEIDING_HULPSTUK_ONTSTOPPINGSSTUK
  on property: is represented by
  max qualified cardinality: 1
subclass of: Restriction
  author at start life: Marinus Vonhof
  date of start life: 2018-10-27
  on class: NLCS_VWA_HULPSTUK_ONTSTOPPINGSSTUK
  on property: is represented by
  max qualified cardinality: 1
subclass of: Restriction
  author at start life: Marinus Vonhof
  date of start life: 2022-10-02
  on class: Aansluiting
  on property: has as part (inverse)
  max qualified cardinality: 1
subclass of: Restriction
  on property: heeft Doel
  has value: Ontstoppen
subclass of: Restriction
  on property: heeft Functie
  has value: ToegangGevenTotAansluitleiding
subclass of: Restriction
  on class: Sym_Ontstoppingsstuk
  on property: is represented by
  max qualified cardinality: 1

Verbindingsstuk
author of change: Marinus Vonhof
author of change: Johan Post
date of change: 2018-10-17
date of change: 2024-05-02
definition: Een hulpstuk bestemd voor het verbinden van leidingen.
author at start life: Marinus Vonhof
author at start life: Finy Teitsma (Oranjewoud)
date of start life: 2006-11-29
scope note: Collection of facts MDS
scope note: Collection of facts LDR
scope note: Collection of facts REV
scope note: Collection of facts PLI
scope note: Collection of facts HYD
type: Class
subclass of: Hulpstuk
subclass of: Restriction
  author at start life: Marinus Vonhof
  date of start life: 2022-10-02
  on class: Transportleiding
  on property: has as part (inverse)
  max qualified cardinality: 1
subclass of: Restriction
  on property: heeft Functie
  has value: VerbindenVanLeidingen
subclass of: Restriction
  on class: Aansluiting
  on property: has as part (inverse)
  max qualified cardinality: 1

Maaiveldoriëntatie
author of change: Marinus Vonhof
date of change: 2018-12-05
definition: Een topologisch element dat het punt (vertex) op het maaiveld beschrijft
author at start life: Marinus Vonhof
date of start life: 2012-04-22
scope note: Collection of facts TOP
type: Class
subclass of: Vertex
subclass of: Restriction
  author of change: Marinus Vonhof
  date of change: 2017-08-21
  author at start life: Marinus Vonhof
  date of start life: 2017-08-19
  on class: Bouwwerkoriëntatie
  on property: is connected to
  max qualified cardinality: 1
subclass of: Restriction
  author of change: Marinus Vonhof
  date of change: 2017-12-12
  author at start life: Marinus Vonhof
  date of start life: 2015-11-07
  validity context: 5t 11t
  on class: Putoriëntatie
  on property: is connected to
  max qualified cardinality: 1
subclass of: Restriction
  author of change: Marinus Vonhof
  date of change: 2018-12-12
  author at start life: Marinus Vonhof
  date of start life: 2012-04-22
  comment: Temporeel kenmerk, met kenmerk Inwinning
  on class: Maaiveldhoogte
  on property: has as aspect
  min qualified cardinality: 1
subclass of: Restriction
  author of change: Marinus Vonhof
  date of change: 2020-04-18
  author at start life: Marinus Vonhof
  date of start life: 2018-12-12
  comment: Temporeel kenmerk, met kenmerk Inwinning
  on class: Punt
  on property: has as aspect
  max qualified cardinality: 1
subclass of: Restriction
  author at start life: Marinus Vonhof
  date of start life: 2017-05-30
  on class: Hulpstukoriëntatie
  on property: is connected to
  max qualified cardinality: 1

Collection of facts TOP
author of change: Wouter van Riel
date of change: 2021-11-19
definition: Bevat algemene supertypes
author at start life: Marinus Vonhof
date of start life: 2020-12-14
scope note: Collection of facts BAS
type: Class
subclass of: Feitencollectie
subclass of: Restriction
  author of change: Marinus Vonhof
  date of change: 2021-02-17
  author at start life: Marinus Vonhof
  date of start life: 2021-01-28
  on class: Deelmodel Basis
  on property: has as part (inverse)
  qualified cardinality: 1
subclass of: Restriction
  author of change: Marinus Vonhof
  date of change: 2021-09-17
  author at start life: Marinus Vonhof
  date of start life: 2021-01-28
  on class: Deelmodel MdsProj
  on property: has as part (inverse)
  qualified cardinality: 1
subclass of: Restriction
  author of change: Marinus Vonhof
  date of change: 2021-09-17
  author at start life: Marinus Vonhof
  date of start life: 2021-01-28
  on class: Deelmodel RibHeen
  on property: has as part (inverse)
  qualified cardinality: 1
subclass of: Restriction
  author at start life: Marinus Vonhof
  date of start life: 2021-01-28
  on class: Deelmodel Dataset
  on property: has as part (inverse)
  qualified cardinality: 1
subclass of: Restriction
  author at start life: Marinus Vonhof
  date of start life: 2021-01-28
  on class: Deelmodel Gemalen
  on property: has as part (inverse)
  qualified cardinality: 1
subclass of: Restriction
  author at start life: Marinus Vonhof
  date of start life: 2021-01-28
  on class: Deelmodel Hyd
  on property: has as part (inverse)
  qualified cardinality: 1
subclass of: Restriction
  author at start life: Marinus Vonhof
  date of start life: 2021-01-28
  on class: Deelmodel HydX
  on property: has as part (inverse)
  qualified cardinality: 1
subclass of: Restriction
  author at start life: Marinus Vonhof
  date of start life: 2021-01-28
  on class: Deelmodel Kengetallen
  on property: has as part (inverse)
  qualified cardinality: 1
subclass of: Restriction
  author at start life: Marinus Vonhof
  date of start life: 2021-01-28
  on class: Deelmodel Maatregelen
  on property: has as part (inverse)
  qualified cardinality: 1
subclass of: Restriction
  author at start life: Marinus Vonhof
  date of start life: 2021-01-28
  on class: Deelmodel MdsPlan
  on property: has as part (inverse)
  qualified cardinality: 1
subclass of: Restriction
  author at start life: Marinus Vonhof
  date of start life: 2021-01-28
  on class: Deelmodel RibTerug
  on property: has as part (inverse)
  qualified cardinality: 1
subclass of: Restriction
  author at start life: Marinus Vonhof
  date of start life: 2021-01-28
  on class: Deelmodel Totaal
  on property: has as part (inverse)
  qualified cardinality: 1
subclass of: Restriction
  author at start life: Marinus Vonhof
  date of start life: 2021-04-07
  on class: Deelmodel Persleidingen
  on property: has as part (inverse)
  qualified cardinality: 1
subclass of: Restriction
  author at start life: Marinus Vonhof
  date of start life: 2024-10-31
  on class: Deelmodel IMBOR-SW
  on property: has as part (inverse)
  qualified cardinality: 1

Aansluitingszijde (coll)
comment: [is coll]
scope note: Collection of facts BAS
type: Class
subclass of: Verzameling soorten
subclass of: Class
  one of: AansluitingAanVoorkant
  one of: AansluitingAanZijkant
  one of: AansluitingAanAchterkant

Aansluitingszijde
definition: De zijde waarop de aansluiting zich bevindt
author at start life: Marinus Vonhof
date of start life: 2021-08-05
comment: [is aspect]
scope note: Collection of facts BAS
type: Class
subclass of: Kenmerk
subclass of: Restriction
  author of change: Marinus Vonhof
  date of change: 2021-08-06
  author at start life: Marinus Vonhof
  date of start life: 2021-08-05
  on class: Kolk
  on property: has as aspect (inverse)
  max qualified cardinality: 1
subclass of: Restriction
  author at start life: Johan Post
  date of start life: 2026-05-04
  on class: Spuikolk
  on property: has as aspect (inverse)
  max qualified cardinality: 1
subclass of: Restriction
  on property: has as reference (qualification)
  all values from: Aansluitingszijde (coll)

Kolk
author of change: Marinus Vonhof
date of change: 2019-04-04
definition: Een reservoir bestemd voor de opvang van hemelwater afkomstig van erop aangesloten oppervlakken, het laten bezinken van in dit water meegevoerde bezinkbare stoffen en de afvoer van dit water naar een rioolstelsel of naar de ondergrond
definition: [NEN 3300:1996] ingegraven bak voor de opvang van neerslag afkomstig van erop aangesloten oppervlakken, voor het laten bezinken van in dit water meegevoerde bezinkbare stoffen en voor de afvoer van dit water naar de riolering
notation: EAA
author at start life: Nic Roest (Idoro)
date of start life: 2006-03-23
validity context: 5d 11d 13d 15d
see also: Vervallen link: https://imgeo.geostandaarden.nl/def/imgeo-object/put/kolk-niet-bgt
see also: [IMGeo:1.0/2007] Open hemelwater afvoer, aangesloten op het transportnet van hemelwater.
alternative label: Afvoerput
scope note: Collection of facts TOP
type: Class
subclass of: Put
subclass of: Restriction
  author of change: Marinus Vonhof
  date of change: 2021-08-06
  author at start life: Finy Teitsma (Oranjewoud)
  date of start life: 2007-11-30
  on class: Kolkaansluiting
  on property: has as part (inverse)
  qualified cardinality: 1
subclass of: Restriction
  author of change: Marinus Vonhof
  date of change: 2013-10-18
  author at start life: Marinus Vonhof
  date of start life: 2013-07-19
  on class: Reinigen en inspecteren kolk
  on property: has as output (inverse)
  qualified cardinality: 1
subclass of: Restriction
  author of change: Marinus Vonhof
  date of change: 2019-04-04
  author at start life: Marinus Vonhof
  date of start life: 2014-04-29
  on class: Reinigen en inspecteren kolk
  on property: has as input (inverse)
  qualified cardinality: 1
subclass of: Restriction
  author of change: Marinus Vonhof
  date of change: 2021-08-06
  author at start life: Marinus Vonhof
  date of start life: 2020-04-18
  on class: Verwachte type reiniging
  on property: has as aspect
  max qualified cardinality: 1
subclass of: Restriction
  author of change: Marinus Vonhof
  date of change: 2021-08-06
  author at start life: Marinus Vonhof
  date of start life: 2020-04-18
  on class: Deksel
  on property: has as part
  qualified cardinality: 1
subclass of: Restriction
  author of change: Marinus Vonhof
  date of change: 2021-08-06
  author at start life: Marinus Vonhof
  date of start life: 2020-05-26
  on class: Stankscherm
  on property: has as part
  max qualified cardinality: 1
subclass of: Restriction
  author of change: Marinus Vonhof
  date of change: 2021-08-06
  author at start life: Marinus Vonhof
  date of start life: 2021-08-05
  on class: Aansluitingszijde
  on property: has as aspect
  max qualified cardinality: 1
subclass of: Restriction
  author at start life: Marinus Vonhof
  date of start life: 2018-10-27
  on class: NLCS_GWA_KOLK
  on property: is represented by
  max qualified cardinality: 1
subclass of: Restriction
  author at start life: Marinus Vonhof
  date of start life: 2018-10-27
  on class: NLCS_HWA_KOLK
  on property: is represented by
  max qualified cardinality: 1
subclass of: Restriction
  author at start life: Marinus Vonhof
  date of start life: 2018-10-27
  on class: NLCS_ITR_KOLK
  on property: is represented by
  max qualified cardinality: 1
subclass of: Restriction
  author at start life: Marinus Vonhof
  date of start life: 2018-10-27
  on class: NLCS_SWA_KOLK
  on property: is represented by
  max qualified cardinality: 1
subclass of: Restriction
  author at start life: Marinus Vonhof
  date of start life: 2018-11-10
  on class: Sym_Kolk
  on property: is represented by
  max qualified cardinality: 1
subclass of: Restriction
  author at start life: Marinus Vonhof
  date of start life: 2020-04-18
  on class: Uitklimvoorziening
  on property: has as part
  max qualified cardinality: 1
subclass of: Restriction
  author at start life: Marinus Vonhof
  date of start life: 2026-07-24
  on class: Infiltratievoorziening
  on property: has as part (inverse)
  max qualified cardinality: 1
subclass of: Restriction
  on property: heeft Functie
  has value: BezinkenStoffen
subclass of: Restriction
  on property: heeft Functie
  has value: OpvangVanAfstromendHemelwater
subclass of: Restriction
  on class: Faunarooster
  on property: has as part
  max qualified cardinality: 1

Spuikolk
definition: Een bovengrondse uitstroomvoorziening die hemelwater vanuit een ondergrondse leiding aan het maaiveld aanbiedt.
notation: EAA
author at start life: Johan Post
date of start life: 2026-05-04
alternative label: Hemelwaterbrievenbus
scope note: Collection of facts TOP
type: Class
subclass of: Put
subclass of: Restriction
  author of change: Marinus Vonhof
  date of change: 2021-08-06
  author at start life: Finy Teitsma (Oranjewoud)
  date of start life: 2007-11-30
  on class: Perceelaansluiting
  on property: has as part (inverse)
  qualified cardinality: 1
subclass of: Restriction
  author of change: Marinus Vonhof
  date of change: 2021-08-06
  author at start life: Marinus Vonhof
  date of start life: 2020-04-18
  on class: Deksel
  on property: has as part
  max qualified cardinality: 1
subclass of: Restriction
  author of change: Marinus Vonhof
  date of change: 2021-08-06
  author at start life: Marinus Vonhof
  date of start life: 2021-08-05
  on class: Aansluitingszijde
  on property: has as aspect
  max qualified cardinality: 1
subclass of: Restriction
  author at start life: Marinus Vonhof
  date of start life: 2020-04-18
  on class: Uitklimvoorziening
  on property: has as part
  max qualified cardinality: 1
subclass of: Restriction
  on property: heeft Functie
  has value: AfvoerenHemelwaterNaarDeBovengrond
subclass of: Restriction
  on class: Faunarooster
  on property: has as part
  max qualified cardinality: 1

Aansluitleiding
label: Drain (EN) @en
author of change: Marinus Vonhof
date of change: 2019-03-20
definition: Een leiding voor de aanvoer van afvalwater.
definition: [EN 16323:2014] pipeline, usually underground, designed to carry wastewater from a source to a sewer @en
definition: [NEN 3300:1996] Leiding tussen een gebouw of een kolk en een knooppunt of leiding
definition: [NEN-EN 752:2008] gewoonlijk ondergrondse leiding die afvalwater van een gebouw of een kolk naar een riool voert [EN 1085:2007, definitie 2250]
author at start life: Finy Teitsma (Oranjewoud)
date of start life: 2006-02-20
validity context: 5d 11d 13d 14f 15d
comment: 20151014: NEN3300-definitie aangepast
scope note: Collection of facts TOP
type: Class
subclass of: Leiding
subclass of: Restriction
  on property: heeft Functie
  has value: AanvoerVanAfvalwater

Leiding
author of change: Johan Post
author of change: Eric van Gorkom
author of change: Wouter van Riel
date of change: 2024-05-01
date of change: 2026-05-01
date of change: 2021-11-23
date of change: 2024-04-23
date of change: 2026-05-13
date of change: 2026-04-30
definition: Een geheel van geleiders welke voorzien zijn van 1 ommanteling en bestemd is voor transport van materie
author at start life: Finy Teitsma (Oranjewoud)
date of start life: 2006-02-24
validity context: *f
see also: [IMKL:1.1/2008] Holle leiding voor het doorstromen van gassen, vloeistoffen of capsules, bestemd om hetzij gas, een vloeistof of capsules te transporteren, hetzij een vloeistof als intermediair te gebruiken voor het transport van warmte of een opgeloste of verpulverde stof.
see also: [NEN 3610:2010] (Ongeldig) Buis of kabel bestemd voor de voortgeleiding van energie of materie.
alternative label: Buis
alternative label: Pijp
scope note: Collection of facts TOP
type: Class
subclass of: Fysiek object
subclass of: Restriction
  author of change: Marinus Vonhof
  author of change: Johan Post
  date of change: 2018-12-05
  date of change: 2026-04-30
  author at start life: Marinus Vonhof
  date of start life: 2018-09-03
  on class: Bovengrond
  on property: has as part (inverse)
  max qualified cardinality: 1
subclass of: Restriction
  author of change: Marinus Vonhof
  date of change: 2015-06-01
  author at start life: Finy Teitsma (Oranjewoud)
  date of start life: 2006-02-25
  validity context: *t
  on class: Materiaal leiding
  on property: has as aspect
  max qualified cardinality: 1
subclass of: Restriction
  author of change: Marinus Vonhof
  date of change: 2015-08-24
  author at start life: Finy Teitsma (Oranjewoud)
  date of start life: 2006-02-25
  validity context: *t
  on class: Lengte leiding
  on property: has as aspect
  max qualified cardinality: 1
subclass of: Restriction
  author of change: Marinus Vonhof
  date of change: 2015-10-31
  author at start life: Finy Teitsma (Oranjewoud)
  date of start life: 2006-02-25
  validity context: *t
  on class: Vorm leiding
  on property: has as aspect
  max qualified cardinality: 1
subclass of: Restriction
  author of change: Marinus Vonhof
  date of change: 2018-05-03
  author at start life: Finy Teitsma (Oranjewoud)
  date of start life: 2006-02-25
  on class: Fundering
  on property: has as part
  max qualified cardinality: 1
subclass of: Restriction
  author of change: Marinus Vonhof
  date of change: 2018-12-05
  author at start life: Finy Teitsma (Oranjewoud)
  date of start life: 2006-02-25
  on class: Verbindingstype
  on property: has as aspect
  max qualified cardinality: 1
subclass of: Restriction
  author of change: Marinus Vonhof
  date of change: 2019-09-02
  author at start life: Finy Teitsma (Oranjewoud)
  date of start life: 2006-02-25
  on class: Wanddikte
  on property: has as aspect
  max qualified cardinality: 1
subclass of: Restriction
  author of change: Marinus Vonhof
  date of change: 2014-12-03
  author at start life: Marinus Vonhof
  date of start life: 2011-12-15
  validity context: *t
  on class: Hoogte leiding
  on property: has as aspect
  max qualified cardinality: 1
subclass of: Restriction
  author of change: Marinus Vonhof
  date of change: 2015-04-20
  author at start life: Marinus Vonhof
  date of start life: 2014-12-03
  on class: Risicogebied
  on property: has as part (inverse)
  max qualified cardinality: 1
subclass of: Restriction
  author of change: Marinus Vonhof
  date of change: 2015-05-29
  author at start life: Marinus Vonhof
  date of start life: 2011-12-15
  validity context: *t
  on class: Breedte leiding
  on property: has as aspect
  max qualified cardinality: 1
subclass of: Restriction
  author of change: Marinus Vonhof
  date of change: 2015-06-01
  author at start life: Marinus Vonhof
  date of start life: 2011-12-15
  on class: Wandruwheid
  on property: has as aspect
  max qualified cardinality: 1
subclass of: Restriction
  author of change: Marinus Vonhof
  date of change: 2015-09-20
  author at start life: Marinus Vonhof
  date of start life: 2013-10-01
  on class: Diameter leiding
  on property: has as aspect
  max qualified cardinality: 1
subclass of: Restriction
  author of change: Marinus Vonhof
  date of change: 2021-08-06
  date of change: 2026-07-23
  author at start life: Marinus Vonhof
  date of start life: 2018-12-12
  on class: Revisietekening
  on property: is represented by
  min qualified cardinality: 0
subclass of: Restriction
  author at start life: Finy Teitsma (Oranjewoud)
  date of start life: 2006-02-25
  on property: has as aspect
  some values from: Lengte leiding
subclass of: Restriction
  author at start life: Finy Teitsma (Oranjewoud)
  date of start life: 2006-02-25
  on property: has as aspect
  some values from: Materiaal leiding
subclass of: Restriction
  author at start life: Finy Teitsma (Oranjewoud)
  date of start life: 2006-02-25
  on property: has as aspect
  some values from: Vorm leiding
subclass of: Restriction
  author at start life: Finy Teitsma (Oranjewoud)
  date of start life: 2007-10-24
  on class: Toegankelijk
  on property: has as aspect
  max qualified cardinality: 1
subclass of: Restriction
  author at start life: Johan Post
  date of start life: 2026-05-01
  on class: Meetinstrument
  on property: has as part
  min qualified cardinality: 0
subclass of: Restriction
  author at start life: Johan Post
  date of start life: 2026-05-13
  on class: Inwinning
  on property: has as aspect
  max qualified cardinality: 1
subclass of: Restriction
  author at start life: Marinus Vonhof
  date of start life: 2011-12-15
  on property: has as aspect
  some values from: Breedte leiding
subclass of: Restriction
  author at start life: Marinus Vonhof
  date of start life: 2011-12-15
  on property: has as aspect
  some values from: Hoogte leiding
subclass of: Restriction
  author at start life: Marinus Vonhof
  date of start life: 2012-04-22
  validity context: *t
  on class: Leidingoriëntatie
  on property: has as aspect
  max qualified cardinality: 1
subclass of: Restriction
  author at start life: Marinus Vonhof
  date of start life: 2013-02-05
  on class: Wandruwheid binnenboven
  on property: has as aspect
  max qualified cardinality: 1
subclass of: Restriction
  author at start life: Marinus Vonhof
  date of start life: 2013-02-05
  on class: Wandruwheid binnenonder
  on property: has as aspect
  max qualified cardinality: 1
subclass of: Restriction
  author at start life: Marinus Vonhof
  date of start life: 2013-10-01
  on property: has as aspect
  some values from: Diameter leiding
subclass of: Restriction
  author at start life: Marinus Vonhof
  date of start life: 2014-12-02
  on class: Status functioneren
  on property: has as aspect
  max qualified cardinality: 1

Aansluitpunt
definition: Een topologisch element (knooppunt) met de aansluitlocatie tussen leidingen, putten en open water. Een aansluitpunt kan ook de koppeling vormen tussen een leiding en een hydraulisch element (zoals een klep), het is dan het knooppunt tussen twee verbindingen.
author at start life: Marinus Vonhof
date of start life: 2017-12-12
scope note: Collection of facts TOP
type: Class
subclass of: Knooppunt
subclass of: Restriction
  author at start life: Finy Teitsma (Oranjewoud)
  date of start life: 2006-02-25
  on class: Invoer
  on property: has as aspect
  max qualified cardinality: 1
subclass of: Restriction
  author at start life: Marinus Vonhof
  date of start life: 2013-10-04
  on class: Aansluitput
  on property: has as aspect (inverse)
  max qualified cardinality: 1
subclass of: Restriction
  on property: heeft Functie
  has value: AanvoerVanAfvalwater

Knooppunt
label: Node @en
author of change: Marinus Vonhof
author of change: Wouter van Riel
date of change: 2024-04-22
date of change: 2022-10-01
date of change: 2020-11-24
definition: De knoop binnen de netwerkdefinitie, waar verbindingen bij elkaar komen
definition: [NEN 3300:1996] Begin- of eindpunt van 1 of meer leidingen, meestal gevormd door een fysieke constructie
author at start life: Marinus Vonhof
date of start life: 2013-09-03
see also: [GFO/RIO2] Begin- of eindpunt van 1 of meer leidingen, meestal gevormd door een fysieke constructie
alternative label: Knoop
scope note: Collection of facts TOP
type: Class
subclass of: Vertex
subclass of: Restriction
  author of change: Marinus Vonhof
  date of change: 2022-10-01
  author at start life: Marinus Vonhof
  date of start life: 2011-12-02
  on class: Beginpunt leiding
  on property: is connected to
  min qualified cardinality: 0
subclass of: Restriction
  author of change: Marinus Vonhof
  date of change: 2022-10-01
  author at start life: Marinus Vonhof
  date of start life: 2011-12-02
  on class: Eindpunt leiding
  on property: is connected to
  min qualified cardinality: 0
subclass of: Restriction
  author of change: Marinus Vonhof
  date of change: 2022-10-01
  author at start life: Marinus Vonhof
  date of start life: 2017-12-12
  on class: Beginpunt onderdeel
  on property: is connected to
  min qualified cardinality: 0
subclass of: Restriction
  author of change: Marinus Vonhof
  date of change: 2022-10-01
  author at start life: Marinus Vonhof
  date of start life: 2017-12-12
  on class: Eindpunt onderdeel
  on property: is connected to
  min qualified cardinality: 0
subclass of: Restriction
  author at start life: Wouter van Riel
  date of start life: 2022-05-04
  on class: Punt
  on property: has as aspect
  max qualified cardinality: 1

Invoer
author of change: Johan Post
date of change: 2022-11-25
date of change: 2026-05-01
definition: Hoeveelheid afvalwater die per tijdseenheid in een knooppunt wordt geloosd. Deze kan variëren in de tijd
author at start life: Nic Roest (Idoro)
date of start life: 2006-02-21
units of measurements: m3/h
comment: [is aspect]
scope note: Collection of facts HYD
type: Class
subclass of: Capaciteit
subclass of: Restriction
  author of change: Marinus Vonhof
  date of change: 2018-05-03
  author at start life: Finy Teitsma (Oranjewoud)
  date of start life: 2006-02-25
  on class: Rioolput
  on property: has as aspect (inverse)
  max qualified cardinality: 1
subclass of: Restriction
  author at start life: Finy Teitsma (Oranjewoud)
  date of start life: 2006-02-25
  on class: Aansluitpunt
  on property: has as aspect (inverse)
  max qualified cardinality: 1
subclass of: Restriction
  on property: has as value
  all values from: decimal

Aansluitput
author of change: Eric van Gorkom
date of change: 2022-09-27
definition: Put welke deel uitmaakt van een aansluiting
author at start life: Marinus Vonhof
date of start life: 2013-10-04
validity context: 12d 14f 15d
scope note: Collection of facts BAS
type: Class
subclass of: Put
subclass of: Restriction
  author at start life: Marinus Vonhof
  date of start life: 2013-10-04
  on class: Aansluitpunt
  on property: has as aspect
  max qualified cardinality: 1
subclass of: Restriction
  on property: heeft Functie
  has value: AansluitleidingenAansluiten

Put
author of change: Johan Post
author of change: Eric van Gorkom
date of change: 2022-09-27
date of change: 2024-05-01
date of change: 2026-05-01
date of change: 2024-05-13
date of change: 2026-04-30
date of change: 20262-05-13
author at start life: Marinus Vonhof
date of start life: 2013-07-18
validity context: *f
see also: Vervallen link: https://imgeo.geostandaarden.nl/def/imgeo-object/put
see also: [IMGeo:1.0/2007] Gegraven of geboorde kokervormige diepte waarin zich (vloei)stoffen bevinden.
scope note: Collection of facts TOP
type: Class
subclass of: Fysiek object
subclass of: Restriction
  author of change: Johan Post
  date of change: 2018-12-05
  date of change: 2026-04-30
  author at start life: Marinus Vonhof
  date of start life: 2018-09-03
  on class: Bovengrond
  on property: has as part (inverse)
  max qualified cardinality: 1
subclass of: Restriction
  author of change: Marinus Vonhof
  date of change: 2014-08-01
  author at start life: Finy Teitsma (Oranjewoud)
  date of start life: 2006-02-25
  validity context: *t
  on class: Breedte put
  on property: has as aspect
  max qualified cardinality: 1
subclass of: Restriction
  author of change: Marinus Vonhof
  date of change: 2014-08-01
  author at start life: Finy Teitsma (Oranjewoud)
  date of start life: 2006-02-25
  validity context: *t
  on class: Hoogte put
  on property: has as aspect
  max qualified cardinality: 1
subclass of: Restriction
  author of change: Marinus Vonhof
  date of change: 2014-08-01
  author at start life: Finy Teitsma (Oranjewoud)
  date of start life: 2006-02-25
  validity context: *t
  on class: Lengte put
  on property: has as aspect
  max qualified cardinality: 1
subclass of: Restriction
  author of change: Marinus Vonhof
  date of change: 2015-06-01
  author at start life: Finy Teitsma (Oranjewoud)
  date of start life: 2007-10-24
  validity context: 5t 10t 12t 14t
  on class: Materiaal put
  on property: has as aspect
  max qualified cardinality: 1
subclass of: Restriction
  author of change: Marinus Vonhof
  date of change: 2021-08-06
  author at start life: Finy Teitsma (Oranjewoud)
  date of start life: 2006-02-25
  validity context: *t
  on class: Vorm put
  on property: has as aspect
  max qualified cardinality: 1
subclass of: Restriction
  author of change: Marinus Vonhof
  date of change: 2015-04-20
  author at start life: Marinus Vonhof
  date of start life: 2014-12-03
  on class: Risicogebied
  on property: has as part (inverse)
  max qualified cardinality: 1
subclass of: Restriction
  author of change: Marinus Vonhof
  date of change: 2015-08-24
  author at start life: Marinus Vonhof
  date of start life: 2013-10-01
  on class: Diameter put
  on property: has as aspect
  max qualified cardinality: 1
subclass of: Restriction
  author of change: Marinus Vonhof
  date of change: 2018-11-11
  author at start life: Marinus Vonhof
  date of start life: 2018-10-27
  on class: NLCS_PUT
  on property: is represented by
  max qualified cardinality: 1
subclass of: Restriction
  author of change: Marinus Vonhof
  date of change: 2021-08-06
  date of change: 2026-07-23
  author at start life: Marinus Vonhof
  date of start life: 2018-12-12
  on class: Revisietekening
  on property: is represented by
  min qualified cardinality: 0
subclass of: Restriction
  author at start life: Finy Teitsma (Oranjewoud)
  date of start life: 2006-02-25
  on property: has as aspect
  some values from: Breedte put
subclass of: Restriction
  author at start life: Finy Teitsma (Oranjewoud)
  date of start life: 2006-02-25
  on property: has as aspect
  some values from: Hoogte put
subclass of: Restriction
  author at start life: Finy Teitsma (Oranjewoud)
  date of start life: 2006-02-25
  on property: has as aspect
  some values from: Lengte put
subclass of: Restriction
  author at start life: Finy Teitsma (Oranjewoud)
  date of start life: 2006-02-25
  on property: has as aspect
  some values from: Vorm put
subclass of: Restriction
  author at start life: Finy Teitsma (Oranjewoud)
  date of start life: 2007-10-24
  on property: has as aspect
  some values from: Materiaal put
subclass of: Restriction
  author at start life: Johan Post
  date of start life: 2026-05-01
  on class: Meetinstrument
  on property: has as part
  min qualified cardinality: 0
subclass of: Restriction
  author at start life: Johan Post
  date of start life: 2026-05-13
  on class: Inwinning
  on property: has as aspect
  max qualified cardinality: 1
subclass of: Restriction
  author at start life: Marinus Vonhof
  date of start life: 2012-04-22
  validity context: *t
  on class: Putoriëntatie
  on property: has as aspect
  max qualified cardinality: 1
subclass of: Restriction
  author at start life: Marinus Vonhof
  date of start life: 2013-10-01
  on property: has as aspect
  some values from: Diameter put
subclass of: Restriction
  author at start life: Marinus Vonhof
  date of start life: 2014-12-02
  on class: Status functioneren
  on property: has as aspect
  max qualified cardinality: 1
subclass of: Restriction
  author at start life: Marinus Vonhof
  date of start life: 2015-10-21
  on class: Wanddikte
  on property: has as aspect
  max qualified cardinality: 1
subclass of: Restriction
  author at start life: Marinus Vonhof
  date of start life: 2018-09-03
  on class: Ondergrond
  on property: has as part (inverse)
  max qualified cardinality: 1
subclass of: Restriction
  author at start life: Marinus Vonhof
  date of start life: 2018-12-12
  on class: Registratief gebied
  on property: has as part (inverse)
  max qualified cardinality: 1
subclass of: Restriction
  author at start life: Marinus Vonhof
  date of start life: 2019-05-15
  on class: Afwateringsgebied
  on property: has as part (inverse)
  max qualified cardinality: 1
subclass of: Restriction
  author at start life: Marinus Vonhof
  date of start life: 2020-04-17
  on class: WIBON thema
  on property: has as aspect
  max qualified cardinality: 1
subclass of: Restriction
  author at start life: Marinus Vonhof
  date of start life: 2020-05-28
  on class: Adresgegevens
  on property: has as aspect
  max qualified cardinality: 1
subclass of: Restriction
  on property: heeft Uitvoering
  has value: GegravenOfGeboordeKokervormigeDiepte
subclass of: Restriction
  on class: Stellaag
  on property: has as part
  max qualified cardinality: 1

Aansluitvergunning
definition: [NEN 3300:1996] Vergunning die wordt afgegeven door de beheerder van een zuiveringstechnisch werk voor de aansluiting op dat werk
author at start life: Marinus Vonhof
date of start life: 2022-09-30
validity context: *d
scope note: Collection of facts BAS
type: Class
subclass of: NEN 3300 Term

Inwinning
author of change: Johan Post
date of change: 2022-11-25
date of change: 2024-05-02
definition: Informatie over het verzamelen van gegevens
author at start life: Marinus Vonhof
date of start life: 2015-10-29
comment: Kenmerken van kenmerk
alternative label: Inwinning-informatie
comment: [is aspect]
scope note: Collection of facts TOP
type: Class
subclass of: Kenmerk
subclass of: Restriction
  author of change: Marinus Vonhof
  date of change: 2015-11-03
  author at start life: Marinus Vonhof
  date of start life: 2013-03-29
  on class: Lengte leiding
  on property: has as aspect (inverse)
  max qualified cardinality: 1
subclass of: Restriction
  author of change: Marinus Vonhof
  date of change: 2017-05-17
  author at start life: Marinus Vonhof
  date of start life: 2015-10-29
  on class: B.o.b. beginpunt leiding
  on property: has as aspect (inverse)
  max qualified cardinality: 1
subclass of: Restriction
  author of change: Marinus Vonhof
  date of change: 2017-05-17
  author at start life: Marinus Vonhof
  date of start life: 2015-10-30
  on class: Putdekselniveau
  on property: has as aspect (inverse)
  max qualified cardinality: 1
subclass of: Restriction
  author of change: Marinus Vonhof
  date of change: 2017-05-17
  author at start life: Marinus Vonhof
  date of start life: 2015-10-30
  on class: Vorm put
  on property: has as aspect (inverse)
  max qualified cardinality: 1
subclass of: Restriction
  author of change: Marinus Vonhof
  date of change: 2017-05-17
  author at start life: Marinus Vonhof
  date of start life: 2015-11-06
  on class: Vorm compartiment
  on property: has as aspect (inverse)
  max qualified cardinality: 1
subclass of: Restriction
  author of change: Marinus Vonhof
  date of change: 2019-04-25
  author at start life: Marinus Vonhof
  date of start life: 2015-10-29
  on class: Datum inwinning
  on property: has as aspect
  max qualified cardinality: 1
subclass of: Restriction
  author of change: Marinus Vonhof
  date of change: 2019-04-25
  author at start life: Marinus Vonhof
  date of start life: 2015-10-29
  on class: Wijze van inwinning
  on property: has as aspect
  max qualified cardinality: 1
subclass of: Restriction
  author of change: Marinus Vonhof
  date of change: 2019-04-25
  author at start life: Marinus Vonhof
  date of start life: 2015-11-03
  on class: Capaciteit
  on property: has as aspect (inverse)
  max qualified cardinality: 1
subclass of: Restriction
  author at start life: Marinus Vonhof
  date of start life: 2015-10-29
  on class: B.o.b. eindpunt leiding
  on property: has as aspect (inverse)
  max qualified cardinality: 1
subclass of: Restriction
  author at start life: Marinus Vonhof
  date of start life: 2015-10-30
  on class: Drempelniveau
  on property: has as aspect (inverse)
  max qualified cardinality: 1
subclass of: Restriction
  author at start life: Marinus Vonhof
  date of start life: 2015-10-30
  on class: Vorm leiding
  on property: has as aspect (inverse)
  max qualified cardinality: 1
subclass of: Restriction
  author at start life: Marinus Vonhof
  date of start life: 2015-11-03
  on class: Niveau buitenwater
  on property: has as aspect (inverse)
  max qualified cardinality: 1
subclass of: Restriction
  author at start life: Marinus Vonhof
  date of start life: 2015-11-07
  on class: Maaiveldhoogte
  on property: has as aspect (inverse)
  max qualified cardinality: 1
subclass of: Restriction
  author at start life: Marinus Vonhof
  date of start life: 2016-11-09
  on class: Geometrie
  on property: has as aspect (inverse)
  max qualified cardinality: 1
subclass of: Restriction
  author at start life: Marinus Vonhof
  date of start life: 2018-12-06
  on class: Waterpeil
  on property: has as aspect (inverse)
  max qualified cardinality: 1
subclass of: Restriction
  author at start life: Marinus Vonhof
  date of start life: 2021-05-14
  on class: Afvoer DWA-situatie
  on property: has as aspect (inverse)
  min qualified cardinality: 0
subclass of: Restriction
  author at start life: Marinus Vonhof
  date of start life: 2021-05-14
  on class: Afvoer HWA-situatie
  on property: has as aspect (inverse)
  min qualified cardinality: 0
subclass of: Restriction
  author at start life: Marinus Vonhof
  date of start life: 2023-01-10
  on class: Status functioneren
  on property: has as aspect (inverse)
  max qualified cardinality: 1
subclass of: Restriction
  author at start life: Marinus Vonhof
  date of start life: 2024-05-16
  on class: Breedte leiding
  on property: has as aspect (inverse)
  max qualified cardinality: 1
subclass of: Restriction
  author at start life: Marinus Vonhof
  date of start life: 2024-05-16
  on class: Diameter leiding
  on property: has as aspect (inverse)
  max qualified cardinality: 1
subclass of: Restriction
  author at start life: Marinus Vonhof
  date of start life: 2024-05-16
  on class: Drempelbreedte
  on property: has as aspect (inverse)
  max qualified cardinality: 1
subclass of: Restriction
  author at start life: Marinus Vonhof
  date of start life: 2024-05-16
  on class: Hoogte leiding
  on property: has as aspect (inverse)
  max qualified cardinality: 1
subclass of: Restriction
  author at start life: Marinus Vonhof
  date of start life: 2026-07-26
  on class: Bergend oppervlak
  on property: has as aspect (inverse)
  max qualified cardinality: 1
subclass of: Restriction
  author at start life: Marinus Vonhof
  date of start life: 2026-07-26
  on class: Bergend vermogen
  on property: has as aspect (inverse)
  max qualified cardinality: 1
subclass of: Restriction
  author at start life: Marinus Vonhof
  date of start life: 2026-07-26
  on class: Doorlaatbaarheid
  on property: has as aspect (inverse)
  max qualified cardinality: 1
subclass of: Restriction
  author at start life: Marinus Vonhof
  date of start life: 2026-07-26
  on class: Porositeit
  on property: has as aspect (inverse)
  max qualified cardinality: 1
subclass of: Restriction
  author at start life: Marinus Vonhof
  date of start life: 2026-07-26
  on class: Retentiewaarde
  on property: has as aspect (inverse)
  max qualified cardinality: 1
subclass of: Restriction
  on class: Aantal woningen
  on property: has as aspect (inverse)
  max qualified cardinality: 1
subclass of: Restriction
  on class: Afvoerend oppervlak
  on property: has as aspect (inverse)
  max qualified cardinality: 1
subclass of: Restriction
  on class: Leiding
  on property: has as aspect (inverse)
  max qualified cardinality: 1

Collection of facts DMO
author of change: Wouter van Riel
date of change: 2021-11-19
definition: Model voor afvoerscenario's en kengetallen, bevat het schematiche afvoernetwerk. Is aanvullend op feitencollectie TOP.
author at start life: Marinus Vonhof
date of start life: 2020-12-15
scope note: Collection of facts BAS
type: Class
subclass of: Feitencollectie
subclass of: Restriction
  author at start life: Marinus Vonhof
  date of start life: 2021-01-28
  on class: Deelmodel Kengetallen
  on property: has as part (inverse)
  qualified cardinality: 1
subclass of: Restriction
  author at start life: Marinus Vonhof
  date of start life: 2022-10-03
  on class: Deelmodel Dataset
  on property: has as part (inverse)
  qualified cardinality: 1
subclass of: Restriction
  author at start life: Marinus Vonhof
  date of start life: 2022-10-03
  on class: Deelmodel Totaal
  on property: has as part (inverse)
  qualified cardinality: 1

Gemeente
author of change: Marinus Vonhof
date of change: 2025-01-16
date of change: 2020-04-18
definition: [IMBOR] De bestuurslaag onder de Nederlandse provincie bestaande uit een verzameling woonkernen met het bijbehorende gebied.
author at start life: Marinus Vonhof
date of start life: 2014-11-29
see also: [IRIS-RIOKEN:2012] Een van de Nederlandse gemeenten. Het gebied van een zelfstandig onderdeel van de staat, onder bestuur van een raad, een burgemeester en wethouders.
see also: [Saniwijzer] Kleinste eenheid van openbaar bestuur, bestuurd door een gemeenteraad en B en W (bron definitie: Van Dale)
scope note: Collection of facts BAS
scope note: Collection of facts PLI
scope note: Collection of facts DMO
type: Class
subclass of: Levensvorm
subclass of: Restriction
  author of change: Marinus Vonhof
  date of change: 2015-10-26
  author at start life: Marinus Vonhof
  date of start life: 2014-11-30
  on class: Gemeentelijk gebied
  on property: is connected to
  qualified cardinality: 1

Aantal woningen
author of change: Marinus Vonhof
date of change: 2021-05-10
definition: Het aantal aangesloten wooneenheden
author at start life: Marinus Vonhof
date of start life: 2011-12-15
units of measurements: pcs
validity context: 15d
comment: [is aspect]
scope note: Collection of facts MDS
scope note: Collection of facts HYD
type: Class
subclass of: Kenmerk
subclass of: Restriction
  author of change: Johan Post
  date of change: 2022-11-25
  on class: Inwinning
  on property: has as aspect
  max qualified cardinality: 1
subclass of: Restriction
  author of change: Marinus Vonhof
  date of change: 2016-04-24
  author at start life: Marinus Vonhof
  date of start life: 2015-03-01
  on class: Hemelwaterriool
  on property: has as aspect (inverse)
  max qualified cardinality: 1
subclass of: Restriction
  author of change: Marinus Vonhof
  date of change: 2016-04-24
  author at start life: Marinus Vonhof
  date of start life: 2015-03-01
  on class: Vuilwaterriool
  on property: has as aspect (inverse)
  max qualified cardinality: 1
subclass of: Restriction
  author of change: Marinus Vonhof
  date of change: 2018-05-03
  author at start life: Marinus Vonhof
  date of start life: 2011-12-15
  on class: Rioolput
  on property: has as aspect (inverse)
  max qualified cardinality: 1
subclass of: Restriction
  author of change: Marinus Vonhof
  date of change: 2021-03-10
  author at start life: Marinus Vonhof
  date of start life: 2011-12-15
  on class: Gemengd riool
  on property: has as aspect (inverse)
  max qualified cardinality: 1
subclass of: Restriction
  author at start life: Marinus Vonhof
  date of start life: 2017-08-31
  on class: Compartiment
  on property: has as aspect (inverse)
  max qualified cardinality: 1
subclass of: Restriction
  on property: has as value
  all values from: Aantal woningen (datatype)

Hemelwaterriool
author of change: Johan Post
date of change: 2026-05-18
definition: [NEN 3300:1996] (Regenwaterriool) Riool alleen bestemd voor de inzameling en het transport van neerslag
author at start life: Marinus Vonhof
date of start life: 2012-04-29
alternative label: Regenwaterriool
alternative label: Rwa-riool
scope note: Collection of facts MDS
scope note: Collection of facts REV
scope note: Collection of facts HYD
type: Class
subclass of: Vrijverval rioolleiding
subclass of: Restriction
  author of change: Marinus Vonhof
  date of change: 2014-04-30
  author at start life: Finy Teitsma (Oranjewoud)
  date of start life: 2007-10-24
  on class: Hemelwaterstelsel
  on property: has as part (inverse)
  max qualified cardinality: 1
subclass of: Restriction
  author of change: Marinus Vonhof
  date of change: 2016-04-24
  author at start life: Marinus Vonhof
  date of start life: 2015-03-01
  on class: Aantal woningen
  on property: has as aspect
  max qualified cardinality: 1
subclass of: Restriction
  author of change: Marinus Vonhof
  date of change: 2018-11-10
  author at start life: Marinus Vonhof
  date of start life: 2018-11-07
  on class: Sym_Hemelwaterriool
  on property: is represented by
  max qualified cardinality: 1
subclass of: Restriction
  author of change: Marinus Vonhof
  date of change: 2022-10-02
  author at start life: Marinus Vonhof
  date of start life: 2017-08-31
  on class: Afvoerend oppervlak
  on property: has as aspect
  max qualified cardinality: 12
subclass of: Restriction
  author at start life: Marinus Vonhof
  date of start life: 2017-08-31
  on class: Lateraal afvoerend oppervlak
  on property: has as aspect
  max qualified cardinality: 1
subclass of: Restriction
  author at start life: Marinus Vonhof
  date of start life: 2017-08-31
  on class: Lateraal debiet HWA
  on property: has as aspect
  max qualified cardinality: 1
subclass of: Restriction
  author at start life: Marinus Vonhof
  date of start life: 2018-10-27
  on class: NLCS_HWA
  on property: is represented by
  max qualified cardinality: 1
subclass of: Restriction
  author at start life: Marinus Vonhof
  date of start life: 2020-05-26
  on class: Gemengd rioolstelsel
  on property: has as part (inverse)
  max qualified cardinality: 1
subclass of: Restriction
  author at start life: Marinus Vonhof
  date of start life: 2026-07-16
  on class: Infiltratiestelsel
  on property: has as part (inverse)
  max qualified cardinality: 1
subclass of: Restriction
  author at start life: Marinus Vonhof
  date of start life: 2026-07-24
  on class: Infiltratievoorziening
  on property: has as part (inverse)
  max qualified cardinality: 1
subclass of: Restriction
  author at start life: Marinus Vonhof
  date of start life: 2026-08-04
  on class: Vuilwaterstelsel
  on property: has as part (inverse)
  max qualified cardinality: 1
subclass of: Restriction
  author at start life: Wouter van Riel
  date of start life: 2022-09-26
  on class: Drainage/infiltratie transportstelsel
  on property: has as part (inverse)
  max qualified cardinality: 1
subclass of: Restriction
  on property: heeft Functie
  has value: InzamelingVanHemelwater
subclass of: Restriction
  on property: heeft Functie
  has value: TransportVanHemelwater
subclass of: Restriction
  on class: Drainagestelsel
  on property: has as part (inverse)
  max qualified cardinality: 1

Vuilwaterriool
author of change: Marinus Vonhof
date of change: 2021-08-05
definition: [NEN 3300:1996] Dwa-riool is synoniem van vuilwaterriool
definition: [NEN 3300:1996] riool alleen bestemd voor de inzameling en het transport van huishoudelijk- en bedrijfsafvalwater, niet zijnde neerslag
author at start life: Marinus Vonhof
date of start life: 2012-04-29
alternative label: Dwa-riool
scope note: Collection of facts MDS
scope note: Collection of facts REV
scope note: Collection of facts HYD
type: Class
subclass of: Vrijverval rioolleiding
subclass of: Restriction
  author of change: Marinus Vonhof
  date of change: 2016-04-24
  author at start life: Marinus Vonhof
  date of start life: 2015-03-01
  on class: Aantal woningen
  on property: has as aspect
  max qualified cardinality: 1
subclass of: Restriction
  author at start life: Marinus Vonhof
  date of start life: 2015-03-01
  on class: Aantal i.e. bedrijven
  on property: has as aspect
  max qualified cardinality: 1
subclass of: Restriction
  author at start life: Marinus Vonhof
  date of start life: 2015-03-01
  on class: Aantal i.e. recreatie
  on property: has as aspect
  max qualified cardinality: 1
subclass of: Restriction
  author at start life: Marinus Vonhof
  date of start life: 2017-08-31
  on class: Lateraal debiet DWA
  on property: has as aspect
  max qualified cardinality: 1
subclass of: Restriction
  author at start life: Marinus Vonhof
  date of start life: 2018-10-27
  on class: NLCS_VWA
  on property: is represented by
  max qualified cardinality: 1
subclass of: Restriction
  author at start life: Marinus Vonhof
  date of start life: 2018-11-07
  on class: Sym Vuilwaterriool
  on property: is represented by
  max qualified cardinality: 1
subclass of: Restriction
  author at start life: Marinus Vonhof
  date of start life: 2020-05-26
  on class: Gemengd rioolstelsel
  on property: has as part (inverse)
  max qualified cardinality: 1
subclass of: Restriction
  author at start life: Marinus Vonhof
  date of start life: 2020-05-26
  on class: Vuilwaterstelsel
  on property: has as part (inverse)
  max qualified cardinality: 1
subclass of: Restriction
  on property: heeft Functie
  has value: InzamelingVanVuilwater
subclass of: Restriction
  on property: heeft Functie
  has value: TransportVanVuilwater

Rioolput
author of change: Marinus Vonhof
author of change: Johan Post
author of change: Wouter van Riel
date of change: 2016-08-26
date of change: 2026-05-01
date of change: 2022-12-19
date of change: 2024-04-22
definition: Een put met een verwijderbare deksel, dat toegang geeft tot de aangesloten rioolleidingen
definition: [EN13508-2+A1] The node reference of the manhole or inspection chamber as specified by the employing authority. @en
definition: [NEN 3300:1996] constructie toegang gevend tot het rioolstelsel
notation: CAA
notation: JAA
author at start life: Marinus Vonhof
date of start life: 2013-03-31
validity context: *f
alternative label: Node reference @en
scope note: Collection of facts MLD
scope note: Collection of facts TOP
type: Class
subclass of: Put
subclass of: Restriction
  author of change: Finy Teitsma (Oranjewoud)
  date of change: 2006-04-20
  author at start life: Finy Teitsma (Oranjewoud)
  date of start life: 2006-02-25
  on class: Fundering
  on property: has as part
  max qualified cardinality: 1
subclass of: Restriction
  author at start life: Marinus Vonhof
  date of start life: 2026-08-20
  on class: Vuilvangrooster
  on property: has as part
  max qualified cardinality: 1
subclass of: Restriction
  author of change: Marinus Vonhof
  date of change: 2018-05-03
  author at start life: Finy Teitsma (Oranjewoud)
  date of start life: 2006-02-25
  on class: Breedte toegang
  on property: has as aspect
  max qualified cardinality: 1
subclass of: Restriction
  author of change: Marinus Vonhof
  date of change: 2018-05-03
  author at start life: Finy Teitsma (Oranjewoud)
  date of start life: 2006-02-25
  on class: Invoer
  on property: has as aspect
  max qualified cardinality: 1
subclass of: Restriction
  author of change: Marinus Vonhof
  date of change: 2018-05-03
  author at start life: Finy Teitsma (Oranjewoud)
  date of start life: 2006-02-25
  on class: Lengte toegang
  on property: has as aspect
  max qualified cardinality: 1
subclass of: Restriction
  author of change: Marinus Vonhof
  date of change: 2015-08-26
  author at start life: Marinus Vonhof
  date of start life: 2013-07-19
  validity context: *t
  comment: Relatie (kardinaliteit) uitgeschakeld voor CFK's (SHACL-syntax) (20260403) (20260824)
  on class: Visueel inspecteren rioolput
  on property: has as output (inverse)
  qualified cardinality: 1
subclass of: Restriction
  author of change: Marinus Vonhof
  date of change: 2017-03-06
  author at start life: Marinus Vonhof
  date of start life: 2014-04-29
  validity context: *t
  on class: Vrijverval rioolleiding
  on property: is connected to
  min qualified cardinality: 1
subclass of: Restriction
  author of change: Marinus Vonhof
  date of change: 2018-05-03
  date of change: 2022-10-02
  author at start life: Marinus Vonhof
  date of start life: 2014-12-02
  on class: Afvoerend oppervlak
  on property: has as aspect
  max qualified cardinality: 12
subclass of: Restriction
  author of change: Marinus Vonhof
  date of change: 2018-05-03
  author at start life: Marinus Vonhof
  date of start life: 2011-12-15
  validity context: 5t 11t 14t
  on class: Bergend oppervlak
  on property: has as aspect
  max qualified cardinality: 1
subclass of: Restriction
  author of change: Marinus Vonhof
  date of change: 2018-05-03
  author at start life: Marinus Vonhof
  date of start life: 2011-12-15
  validity context: 5t 11t 14t
  on class: Maaiveldschematisering
  on property: has as aspect
  max qualified cardinality: 1
subclass of: Restriction
  author of change: Marinus Vonhof
  date of change: 2018-05-03
  author at start life: Marinus Vonhof
  date of start life: 2011-12-15
  on class: Aantal woningen
  on property: has as aspect
  max qualified cardinality: 1
subclass of: Restriction
  author of change: Marinus Vonhof
  date of change: 2018-05-03
  author at start life: Marinus Vonhof
  date of start life: 2011-12-15
  on class: Aantal i.e. bedrijven
  on property: has as aspect
  max qualified cardinality: 1
subclass of: Restriction
  author of change: Marinus Vonhof
  date of change: 2018-05-03
  author at start life: Marinus Vonhof
  date of start life: 2011-12-15
  on class: Continue lozing
  on property: has as aspect
  max qualified cardinality: 1
subclass of: Restriction
  author of change: Marinus Vonhof
  date of change: 2018-05-03
  author at start life: Marinus Vonhof
  date of start life: 2014-12-01
  on class: Aantal i.e. recreatie
  on property: has as aspect
  max qualified cardinality: 1
subclass of: Restriction
  author of change: Marinus Vonhof
  date of change: 2018-05-03
  author at start life: Marinus Vonhof
  date of start life: 2017-08-31
  on class: Lateraal afvoerend oppervlak
  on property: has as aspect
  max qualified cardinality: 1
subclass of: Restriction
  author of change: Marinus Vonhof
  date of change: 2018-05-03
  author at start life: Marinus Vonhof
  date of start life: 2017-08-31
  on class: Lateraal debiet
  on property: has as aspect
  max qualified cardinality: 2
subclass of: Restriction
  author of change: Marinus Vonhof
  date of change: 2019-04-04
  author at start life: Marinus Vonhof
  date of start life: 2014-08-29
  on class: Visueel inspecteren rioolput
  on property: has as input (inverse)
  qualified cardinality: 1
subclass of: Restriction
  author of change: Marinus Vonhof
  date of change: 2019-04-04
  author at start life: Marinus Vonhof
  date of start life: 2014-12-23
  on class: Reinigen rioolput
  on property: has as input (inverse)
  qualified cardinality: 1
subclass of: Restriction
  author of change: Marinus Vonhof
  date of change: 2020-04-17
  author at start life: Marinus Vonhof
  date of start life: 2013-02-05
  on class: Rioolafsluiter
  on property: has as part
  min qualified cardinality: 0
subclass of: Restriction
  author of change: Wouter van Riel
  date of change: 2024-04-22
  author at start life: Marinus Vonhof
  date of start life: 2011-12-02
  on class: Putdeksel
  on property: has as part
  min qualified cardinality: 0
subclass of: Restriction
  author of change: Wouter van Riel
  date of change: 2024-04-22
  author at start life: Marinus Vonhof
  date of start life: 2013-02-05
  validity context: *t
  on class: Putschacht
  on property: has as part
  qualified cardinality: 1
subclass of: Restriction
  author at start life: Finy Teitsma (Oranjewoud)
  date of start life: 2006-02-25
  on property: has as aspect
  some values from: Breedte toegang
subclass of: Restriction
  author at start life: Johan Post
  date of start life: 2026-05-01
  on class: Lining
  on property: has as part
  max qualified cardinality: 1

Gemengd riool
author of change: Marinus Vonhof
date of change: 2019-03-20
definition: Vrijverval rioolleiding ontworpen om zowel verontreinigd afvalwater als afgestroomd hemelwater binnen een stelsel te transporteren
author at start life: Marinus Vonhof
date of start life: 2013-10-02
scope note: Collection of facts MDS
scope note: Collection of facts REV
scope note: Collection of facts HYD
type: Class
subclass of: Vrijverval rioolleiding
subclass of: Restriction
  author of change: Marinus Vonhof
  date of change: 2014-12-01
  author at start life: Marinus Vonhof
  date of start life: 2011-12-15
  on class: Aantal i.e. bedrijven
  on property: has as aspect
  max qualified cardinality: 1
subclass of: Restriction
  author of change: Marinus Vonhof
  date of change: 2021-03-10
  author at start life: Marinus Vonhof
  date of start life: 2011-12-15
  on class: Aantal woningen
  on property: has as aspect
  max qualified cardinality: 1
subclass of: Restriction
  author of change: Marinus Vonhof
  date of change: 2022-10-02
  author at start life: Marinus Vonhof
  date of start life: 2017-08-31
  on class: Afvoerend oppervlak
  on property: has as aspect
  max qualified cardinality: 12
subclass of: Restriction
  author at start life: Marinus Vonhof
  date of start life: 2014-12-01
  on class: Aantal i.e. recreatie
  on property: has as aspect
  max qualified cardinality: 1
subclass of: Restriction
  author at start life: Marinus Vonhof
  date of start life: 2017-08-31
  on class: Lateraal afvoerend oppervlak
  on property: has as aspect
  max qualified cardinality: 1
subclass of: Restriction
  author at start life: Marinus Vonhof
  date of start life: 2017-08-31
  on class: Lateraal debiet
  on property: has as aspect
  max qualified cardinality: 2
subclass of: Restriction
  author at start life: Marinus Vonhof
  date of start life: 2018-10-27
  on class: NLCS_GWA
  on property: is represented by
  max qualified cardinality: 1
subclass of: Restriction
  author at start life: Marinus Vonhof
  date of start life: 2018-11-07
  on class: Sym_GemengdRiool
  on property: is represented by
  max qualified cardinality: 1
subclass of: Restriction
  author at start life: Marinus Vonhof
  date of start life: 2020-05-26
  validity context: *t
  on class: Gemengd rioolstelsel
  on property: has as part (inverse)
  qualified cardinality: 1
subclass of: Restriction
  author at start life: Marinus Vonhof
  date of start life: 2026-08-04
  on class: Vuilwaterstelsel
  on property: has as part (inverse)
  max qualified cardinality: 1
subclass of: Restriction
  on property: heeft Functie
  has value: InzamelingVanHemelwater
subclass of: Restriction
  on property: heeft Functie
  has value: InzamelingVanVuilwater
subclass of: Restriction
  on property: heeft Functie
  has value: TransportVanHemelwater
subclass of: Restriction
  on property: heeft Functie
  has value: TransportVanVuilwater

Compartiment
author of change: Marinus Vonhof
author of change: Wouter van Riel
date of change: 2025-01-16
date of change: 2019-05-15
date of change: 2024-04-22
definition: Een ruimtelijk deel van een constructie
definition: [IMBOR] Een onderdeel van een Overstortput, Bijzondere putconstructie, Stuwput, Septictank, Bergingsvijver of Gemaal.
notation: CMP
author at start life: Marinus Vonhof
date of start life: 2011-12-15
validity context: 1d
comment: 2 of meer
scope note: Collection of facts BAS
scope note: Collection of facts HYD
scope note: Collection of facts RGM
type: Class
subclass of: Ruimte
subclass of: Restriction
  author of change: Marinus Vonhof
  date of change: 2015-07-28
  author at start life: Marinus Vonhof
  date of start life: 2011-12-15
  on class: Lengte compartiment
  on property: has as aspect
  max qualified cardinality: 1
subclass of: Restriction
  author of change: Marinus Vonhof
  date of change: 2015-07-28
  author at start life: Marinus Vonhof
  date of start life: 2014-04-29
  on class: Overstortput
  on property: has as part (inverse)
  qualified cardinality: 1
subclass of: Restriction
  author of change: Marinus Vonhof
  date of change: 2016-04-22
  author at start life: Marinus Vonhof
  date of start life: 2014-04-29
  on class: Stuwput
  on property: has as part (inverse)
  qualified cardinality: 1
subclass of: Restriction
  author of change: Marinus Vonhof
  date of change: 2018-05-03
  date of change: 2022-10-02
  author at start life: Marinus Vonhof
  date of start life: 2014-12-02
  on class: Afvoerend oppervlak
  on property: has as aspect
  max qualified cardinality: 12
subclass of: Restriction
  author of change: Marinus Vonhof
  date of change: 2018-05-03
  author at start life: Marinus Vonhof
  date of start life: 2012-04-22
  validity context: 5t 11t
  on class: Compartimentoriëntatie
  on property: has as aspect
  max qualified cardinality: 1
subclass of: Restriction
  author of change: Marinus Vonhof
  date of change: 2018-05-03
  author at start life: Marinus Vonhof
  date of start life: 2013-02-05
  on class: Pomp
  on property: has as part
  min qualified cardinality: 0
subclass of: Restriction
  author of change: Marinus Vonhof
  date of change: 2018-05-03
  author at start life: Marinus Vonhof
  date of start life: 2014-04-29
  on class: Bijzondere putconstructie
  on property: has as part (inverse)
  max qualified cardinality: 1
subclass of: Restriction
  author of change: Marinus Vonhof
  date of change: 2018-05-03
  author at start life: Marinus Vonhof
  date of start life: 2016-04-24
  on class: Gemaal
  on property: has as part (inverse)
  max qualified cardinality: 1
subclass of: Restriction
  author of change: Marinus Vonhof
  date of change: 2018-05-03
  author at start life: Marinus Vonhof
  date of start life: 2017-08-19
  on class: Reservoir
  on property: has as part (inverse)
  qualified cardinality: 1
subclass of: Restriction
  author of change: Wouter van Riel
  date of change: 2024-04-22
  author at start life: Marinus Vonhof
  date of start life: 2011-12-15
  validity context: 5t 11t
  on class: Breedte compartiment
  on property: has as aspect
  max qualified cardinality: 1
subclass of: Restriction
  author of change: Wouter van Riel
  date of change: 2024-04-22
  author at start life: Marinus Vonhof
  date of start life: 2015-11-06
  validity context: 5t 11t
  on class: Vorm compartiment
  on property: has as aspect
  max qualified cardinality: 1
subclass of: Restriction
  author at start life: Marinus Vonhof
  date of start life: 2017-08-31
  on class: Aantal woningen
  on property: has as aspect
  max qualified cardinality: 1
subclass of: Restriction
  author at start life: Marinus Vonhof
  date of start life: 2017-08-31
  on class: Aantal i.e. bedrijven
  on property: has as aspect
  max qualified cardinality: 1
subclass of: Restriction
  author at start life: Marinus Vonhof
  date of start life: 2017-08-31
  on class: Aantal i.e. recreatie
  on property: has as aspect
  max qualified cardinality: 1
subclass of: Restriction
  author at start life: Marinus Vonhof
  date of start life: 2017-08-31
  on class: Lateraal afvoerend oppervlak
  on property: has as aspect
  max qualified cardinality: 1
subclass of: Restriction
  author at start life: Marinus Vonhof
  date of start life: 2017-08-31
  on class: Lateraal debiet
  on property: has as aspect
  max qualified cardinality: 2
subclass of: Restriction
  author at start life: Marinus Vonhof
  date of start life: 2024-05-16
  on class: Pompput
  on property: has as part (inverse)
  qualified cardinality: 1
subclass of: Restriction
  author at start life: Marinus Vonhof
  date of start life: 2024-05-16
  on class: Pompunit
  on property: has as part (inverse)
  qualified cardinality: 1
subclass of: Restriction
  author at start life: Wouter van Riel
  date of start life: 2024-04-22
  on class: Hoogte compartiment
  on property: has as aspect
  max qualified cardinality: 1

Aantal i.e.
definition: [NEN 3300:1996] berekeningseenheid om de hoeveelheid vervuiling in afvalwater per inwoner per dag aan te geven
author at start life: Marinus Vonhof
date of start life: 2016-04-24
units of measurements: pcs
validity context: 15d
see also: [IRIS-RIOKEN:2012] Maat voor de belasting van het afvalwater met organische bestanddelen die een inwoner gemiddeld per dag produceert. Ook het afvalwater van bedrijven wordt in deze maat uitgedrukt.
alternative label: Aantal inwonerequivalenten
comment: [is aspect]
scope note: Collection of facts BAS
scope note: Collection of facts HYD
scope note: Collection of facts DMO
type: Class
subclass of: Kenmerk
subclass of: Restriction
  on property: has as value
  all values from: integer

Aantal i.e. bedrijven
author of change: Marinus Vonhof
date of change: 2020-11-25
definition: Aantal inwonerequivalenten afkomstig van bedrijven
author at start life: Marinus Vonhof
date of start life: 2014-11-30
units of measurements: pcs
comment: [is aspect]
scope note: Collection of facts BAS
scope note: Collection of facts HYD
type: Class
subclass of: Aantal i.e.
subclass of: Restriction
  author of change: Marinus Vonhof
  date of change: 2014-12-01
  author at start life: Marinus Vonhof
  date of start life: 2011-12-15
  on class: Gemengd riool
  on property: has as aspect (inverse)
  max qualified cardinality: 1
subclass of: Restriction
  author of change: Marinus Vonhof
  date of change: 2017-12-08
  author at start life: Marinus Vonhof
  date of start life: 2014-11-30
  on class: Bedrijfslocatie
  on property: has as aspect (inverse)
  max qualified cardinality: 1
subclass of: Restriction
  author of change: Marinus Vonhof
  date of change: 2018-05-03
  author at start life: Marinus Vonhof
  date of start life: 2011-12-15
  on class: Rioolput
  on property: has as aspect (inverse)
  max qualified cardinality: 1
subclass of: Restriction
  author at start life: Marinus Vonhof
  date of start life: 2015-03-01
  on class: Vuilwaterriool
  on property: has as aspect (inverse)
  max qualified cardinality: 1
subclass of: Restriction
  author at start life: Marinus Vonhof
  date of start life: 2017-08-31
  on class: Compartiment
  on property: has as aspect (inverse)
  max qualified cardinality: 1
subclass of: Restriction
  on property: has as value
  all values from: integer

Bedrijfslocatie
author of change: Marinus Vonhof
date of change: 2017-12-07
author at start life: Marinus Vonhof
date of start life: 2014-11-30
scope note: Collection of facts RRB
scope note: Collection of facts LDR
scope note: Collection of facts BAS
scope note: Collection of facts DMO
type: Class
subclass of: Perceel
subclass of: Restriction
  author of change: Marinus Vonhof
  date of change: 2017-12-08
  author at start life: Marinus Vonhof
  date of start life: 2014-11-30
  on class: Aantal i.e. bedrijven
  on property: has as aspect
  max qualified cardinality: 1

Collection of facts DEL
definition: Collectie met (voorlopig) vervallen concepten
author at start life: Marinus Vonhof
date of start life: 2024-01-21
scope note: Collection of facts BAS
type: Class
subclass of: Feitencollectie

Aantal i.e. per woning
author of change: Marinus Vonhof
date of change: 2017-12-07
definition: Gemiddeld aantal inwonerequivalenten per woning
author at start life: Marinus Vonhof
date of start life: 2015-03-01
units of measurements: pcs
comment: [is aspect]
scope note: Collection of facts BAS
scope note: Collection of facts HYD
type: Class
subclass of: Aantal i.e.
subclass of: Restriction
  on property: has as value
  all values from: integer

Aantal i.e. recreatie
author of change: Marinus Vonhof
date of change: 2020-11-25
definition: Aantal inwonerequivalenten afkomstig van recreatie
author at start life: Marinus Vonhof
date of start life: 2014-12-01
units of measurements: pcs
comment: [is aspect]
scope note: Collection of facts BAS
scope note: Collection of facts HYD
type: Class
subclass of: Aantal i.e.
subclass of: Restriction
  author of change: Marinus Vonhof
  date of change: 2018-05-03
  author at start life: Marinus Vonhof
  date of start life: 2014-12-01
  on class: Rioolput
  on property: has as aspect (inverse)
  max qualified cardinality: 1
subclass of: Restriction
  author at start life: Marinus Vonhof
  date of start life: 2014-12-01
  on class: Gemengd riool
  on property: has as aspect (inverse)
  max qualified cardinality: 1
subclass of: Restriction
  author at start life: Marinus Vonhof
  date of start life: 2015-03-01
  on class: Vuilwaterriool
  on property: has as aspect (inverse)
  max qualified cardinality: 1
subclass of: Restriction
  author at start life: Marinus Vonhof
  date of start life: 2017-08-31
  on class: Compartiment
  on property: has as aspect (inverse)
  max qualified cardinality: 1
subclass of: Restriction
  on property: has as value
  all values from: integer

Aantasting
definition: [NEN 3300:1996] Een wijziging van de structuur van de buiswand als gevolg van (bio)chemische of mechanische processen
author at start life: Marinus Vonhof
date of start life: 2022-09-30
validity context: *d
scope note: Collection of facts BAS
type: Class
subclass of: NEN 3300 Term

Elektriciteitskast
author of change: Marinus Vonhof
author of change: Johan Post
date of change: 2025-01-16
date of change: 2024-05-01
date of change: 2026-05-18
definition: Een voedingskast die de aanvoer van elektriciteit naar een installatie regelt.
definition: [IMBOR] Kast ten behoeve van de regeling van het transport van elektriciteit.
author at start life: Marinus Vonhof
date of start life: 2016-04-20
validity context: 1d 3d 10d 12d 14f
scope note: Collection of facts MDS
scope note: Collection of facts MTR
scope note: Collection of facts RGM
type: Class
subclass of: Apparatuur
subclass of: Restriction
  author of change: Marinus Vonhof
  date of change: 2018-05-03
  author at start life: Finy Teitsma (Oranjewoud)
  date of start life: 2006-02-25
  on class: Breedte kast
  on property: has as aspect
  max qualified cardinality: 1
subclass of: Restriction
  author of change: Marinus Vonhof
  date of change: 2018-05-03
  author at start life: Marinus Vonhof
  date of start life: 2014-08-01
  on class: Keuring elektrisch
  on property: has as input (inverse)
  max qualified cardinality: 1
subclass of: Restriction
  author of change: Marinus Vonhof
  date of change: 2018-12-05
  author at start life: Marinus Vonhof
  date of start life: 2014-08-01
  comment: Identificatie bij de gemeente
  on class: Adresgegevens
  on property: has as aspect
  max qualified cardinality: 1
subclass of: Restriction
  author of change: Wouter van Riel
  date of change: 2021-11-19
  author at start life: Marinus Vonhof
  date of start life: 2018-05-03
  on class: Slot
  on property: has as part
  min qualified cardinality: 0
subclass of: Restriction
  author at start life: Finy Teitsma (Oranjewoud)
  date of start life: 2006-02-25
  on class: Hoogte kast
  on property: has as aspect
  max qualified cardinality: 1
subclass of: Restriction
  author at start life: Finy Teitsma (Oranjewoud)
  date of start life: 2006-02-25
  on class: Lengte kast
  on property: has as aspect
  max qualified cardinality: 1
subclass of: Restriction
  author at start life: Finy Teitsma (Oranjewoud)
  date of start life: 2006-02-25
  on property: has as aspect
  some values from: Breedte kast
subclass of: Restriction
  author at start life: Finy Teitsma (Oranjewoud)
  date of start life: 2006-02-25
  on property: has as aspect
  some values from: Hoogte kast
subclass of: Restriction
  author at start life: Johan Post
  date of start life: 2026-05-18
  on class: Pompunit
  on property: has as part (inverse)
  max qualified cardinality: 1
subclass of: Restriction
  author at start life: Johan Post
  date of start life: 2026-05-18
  on class: Gemaal
  on property: has as part (inverse)
  qualified cardinality: 1
subclass of: Restriction
  author at start life: Marinus Vonhof
  date of start life: 2014-08-01
  on class: Datacommunicatie
  on property: has as aspect
  max qualified cardinality: 1
subclass of: Restriction
  author at start life: Marinus Vonhof
  date of start life: 2015-07-28
  on class: Kabel
  on property: is connected to
  max qualified cardinality: 1
subclass of: Restriction
  author at start life: Marinus Vonhof
  date of start life: 2015-07-28
  on class: Meetinstrument
  on property: is connected to
  max qualified cardinality: 1
subclass of: Restriction
  author at start life: Marinus Vonhof
  date of start life: 2018-05-03
  on class: Sokkel
  on property: has as part
  qualified cardinality: 1
subclass of: Restriction
  author at start life: Marinus Vonhof
  date of start life: 2020-04-17
  on class: Meetinrichting
  on property: has as part (inverse)
  max qualified cardinality: 1
subclass of: Restriction
  on property: heeft Structuur
  has value: BevatElektrischeComponenten
subclass of: Restriction
  on property: heeft Functie
  has value: VanStroomVoorzien
subclass of: Restriction
  on class: Afsluiteraandrijving
  on property: is connected to
  max qualified cardinality: 1

Absoluut rioolstelsel
author of change: Johan Post
date of change: 2021-10-01
definition: [NEN 3300:1996] een gemengd rioolstelsel zonder overstort, eventueel voorzien van een nooduitlaat
author at start life: Marinus Vonhof
date of start life: 2012-04-29
scope note: Collection of facts MDS
scope note: Collection of facts REV
scope note: Collection of facts HYD
scope note: Collection of facts DMO
type: Class
subclass of: Gemengd rioolstelsel
subclass of: Restriction
  on property: heeft Doel
  has value: VerminderenVuilbelastingVanOppervlaktewater
subclass of: Restriction
  on class: Sym_AbsoluutRioolstelsel
  on property: is represented by
  max qualified cardinality: 1

Gemengd rioolstelsel
author of change: Marinus Vonhof
author of change: Johan Post
author of change: Eric van Gorkom
date of change: 2024-05-16
date of change: 2021-10-01
date of change: 2024-05-13
definition: Een vrijverval rioolstelsel bestemd voor de inzameling, het transport en de tijdelijke berging van afvalwater.
definition: [NEN 3300:1996] Rioolstelsel, waarbij afvalwater door 1 leidingstelsel wordt getransporteerd
definition: [NEN-EN 752:2008] riolering ontworpen om zowel verontreinigd afvalwater als afgestroomd hemelwater in 1 leidingstelsel te transporteren [EN 1085:2007, definitie 2110]
author at start life: Finy Teitsma (Oranjewoud)
date of start life: 2007-10-23
comment: 20151014: NEN3300-definitie aangepast
alternative label: GWA stelsel
alternative label: Gemengd stelsel
scope note: Collection of facts TOP
type: Class
subclass of: Vrijverval rioolstelsel
subclass of: Restriction
  author of change: Marinus Vonhof
  date of change: 2016-04-22
  author at start life: Finy Teitsma (Oranjewoud)
  date of start life: 2007-10-24
  validity context: 5t 11t
  on class: Lozingspunt
  on property: has as part
  min qualified cardinality: 1
subclass of: Restriction
  author of change: Marinus Vonhof
  date of change: 2016-04-24
  author at start life: Finy Teitsma (Oranjewoud)
  date of start life: 2007-10-23
  on class: Bezinkbassin
  on property: has as part
  min qualified cardinality: 0
subclass of: Restriction
  author of change: Marinus Vonhof
  date of change: 2016-04-30
  author at start life: Finy Teitsma (Oranjewoud)
  date of start life: 2007-10-24
  on class: Kolkaansluiting
  on property: has as part
  min qualified cardinality: 0
subclass of: Restriction
  author of change: Marinus Vonhof
  date of change: 2016-04-24
  author at start life: Marinus Vonhof
  date of start life: 2013-10-01
  on class: Bergbezinkbassin
  on property: has as part
  min qualified cardinality: 0
subclass of: Restriction
  author of change: Marinus Vonhof
  date of change: 2016-04-24
  author at start life: Marinus Vonhof
  date of start life: 2014-04-30
  on class: Bergingsbassin
  on property: has as part
  min qualified cardinality: 0
subclass of: Restriction
  author of change: Marinus Vonhof
  date of change: 2016-04-24
  author at start life: Marinus Vonhof
  date of start life: 2016-04-22
  on class: Bergingsvijver
  on property: has as part
  min qualified cardinality: 0
subclass of: Restriction
  author of change: Marinus Vonhof
  date of change: 2019-04-30
  author at start life: Marinus Vonhof
  date of start life: 2014-04-30
  on class: Goot
  on property: has as part
  min qualified cardinality: 0
subclass of: Restriction
  author at start life: Marinus Vonhof
  date of start life: 2016-04-22
  on class: Septictank
  on property: has as part
  min qualified cardinality: 0
subclass of: Restriction
  author at start life: Marinus Vonhof
  date of start life: 2020-05-26
  validity context: *t
  on class: Gemengd riool
  on property: has as part
  min qualified cardinality: 1
subclass of: Restriction
  author at start life: Marinus Vonhof
  date of start life: 2020-05-26
  on class: Hemelwaterriool
  on property: has as part
  min qualified cardinality: 0
subclass of: Restriction
  author at start life: Marinus Vonhof
  date of start life: 2020-05-26
  on class: Rioolgemaal
  on property: has as part
  min qualified cardinality: 0
subclass of: Restriction
  author at start life: Marinus Vonhof
  date of start life: 2020-05-26
  on class: Vuilwaterriool
  on property: has as part
  min qualified cardinality: 0
subclass of: Restriction
  author at start life: Marinus Vonhof
  date of start life: 2022-10-03
  comment: 20160415: Inverse = optioneel, niet elke specialisatie zit in vv stelsel
  on class: Onderbemaling
  on property: has as part
  min qualified cardinality: 0
subclass of: Restriction
  author at start life: Marinus Vonhof
  date of start life: 2022-10-03
  on class: Gestuwd rioolstelsel
  on property: has as part
  min qualified cardinality: 0
subclass of: Restriction
  author at start life: Marinus Vonhof
  date of start life: 2024-05-16
  on class: Externe overstortput
  on property: has as part
  min qualified cardinality: 0
subclass of: Restriction
  on property: heeft Functie
  has value: InzamelingVanHemelwaterEnVuilwater
subclass of: Restriction
  on property: heeft Functie
  has value: TijdelijkeBergingVanHemelwaterEnVuilwater
subclass of: Restriction
  on property: heeft Functie
  has value: TransportVanHemelwaterEnVuilwater
subclass of: Restriction
  on class: Sym_GemengdStelsel
  on property: is represented by
  max qualified cardinality: 1

Sym_AbsoluutRioolstelsel
author at start life: Johan Post
date of start life: 2021-10-01
scope note: Collection of facts NLCS
type: Class
subclass of: Geo-symbool
subclass of: Restriction
  author at start life: Marinus Vonhof
  date of start life: 2018-11-07
  on class: Absoluut rioolstelsel
  on property: is represented by (inverse)
  max qualified cardinality: 1

Levensvorm
author of change: Marinus Vonhof
date of change: 2016-04-24
definition: Iets dat in staat is tot leven
author at start life: Marinus Vonhof
date of start life: 2014-11-29
validity context: *f 15d
scope note: Collection of facts TOP
type: Class

Waterschap
author of change: Marinus Vonhof
date of change: 2025-01-16
date of change: 2016-08-25
definition: [IMBOR] Een regionaal overheidsorgaan dat bestuurlijk verantwoordelijk is voor de waterhuishouding in een gebied.
author at start life: Marinus Vonhof
date of start life: 2014-11-30
validity context: 1d
see also: Vervallen link: https://imgeo.geostandaarden.nl/def/imgeo-object/waterschap
scope note: Collection of facts MLD
scope note: Collection of facts BAS
scope note: Collection of facts PLI
scope note: Collection of facts DMO
type: Class
subclass of: Levensvorm

Adresgegevens
author of change: Marinus Vonhof
author of change: Johan Post
date of change: 2018-12-05
date of change: 2026-05-01
author at start life: Marinus Vonhof
date of start life: 2013-03-29
validity context: 5d 11d 15d 16d
comment: BAG / StUF-berichten - ADR Adres
see also: [NEN 5826:2002] de verzameling van gegevens voor de aanduiding van een individuele woon- of bedrijfseenheid dan wel de aanduiding van een bestemming
alternative label: Adres-informatie
comment: [is aspect]
scope note: Collection of facts TOP
type: Class
subclass of: Kenmerk
subclass of: Restriction
  author of change: Marinus Vonhof
  date of change: 2017-12-07
  author at start life: Marinus Vonhof
  date of start life: 2013-03-29
  on class: Perceel
  on property: has as aspect (inverse)
  max qualified cardinality: 1
subclass of: Restriction
  author of change: Marinus Vonhof
  date of change: 2018-12-05
  author at start life: Marinus Vonhof
  date of start life: 2014-08-01
  on class: EAN Code
  on property: has as aspect
  max qualified cardinality: 1
subclass of: Restriction
  author of change: Marinus Vonhof
  date of change: 2018-12-05
  author at start life: Marinus Vonhof
  date of start life: 2014-08-01
  on class: Elektriciteitskast
  on property: has as aspect (inverse)
  max qualified cardinality: 1
subclass of: Restriction
  author at start life: Eric van Gorkom
  date of start life: 2021-11-23
  on class: Gebouw
  on property: has as aspect (inverse)
  max qualified cardinality: 1
subclass of: Restriction
  author at start life: Eric van Gorkom
  date of start life: 2021-11-23
  on class: Gemaal
  on property: has as aspect (inverse)
  max qualified cardinality: 1
subclass of: Restriction
  author at start life: Eric van Gorkom
  date of start life: 2021-11-23
  on class: Kunstwerk
  on property: has as aspect (inverse)
  max qualified cardinality: 1
subclass of: Restriction
  author at start life: Eric van Gorkom
  date of start life: 2021-11-23
  on class: RWZI
  on property: has as aspect (inverse)
  max qualified cardinality: 1
subclass of: Restriction
  author at start life: Marinus Vonhof
  date of start life: 2014-08-01
  on class: Telecomadres
  on property: has as aspect
  max qualified cardinality: 1
subclass of: Restriction
  author at start life: Marinus Vonhof
  date of start life: 2018-12-05
  on class: BAG Code
  on property: has as aspect
  max qualified cardinality: 1
subclass of: Restriction
  author at start life: Marinus Vonhof
  date of start life: 2019-05-15
  on class: Perceelaansluitpunt
  on property: has as aspect (inverse)
  max qualified cardinality: 1
subclass of: Restriction
  author at start life: Marinus Vonhof
  date of start life: 2020-05-28
  on class: BGT Code
  on property: has as aspect
  max qualified cardinality: 1
subclass of: Restriction
  author at start life: Marinus Vonhof
  date of start life: 2020-05-28
  on class: Put
  on property: has as aspect (inverse)
  max qualified cardinality: 1
subclass of: Restriction
  on class: Gebouwaansluitpunt
  on property: has as aspect (inverse)
  max qualified cardinality: 1
subclass of: Restriction
  on class: Overnamepunt
  on property: has as aspect (inverse)
  max qualified cardinality: 1

Perceel
author of change: Johan Post
date of change: 2026-05-01
date of change: 2021-09-22
author at start life: Marinus Vonhof
date of start life: 2016-10-07
scope note: Collection of facts MLD
scope note: Collection of facts RRB
scope note: Collection of facts LDR
scope note: Collection of facts BAS
scope note: Collection of facts DMO
type: Class
subclass of: Ruimte
subclass of: Restriction
  author of change: Marinus Vonhof
  date of change: 2017-12-07
  author at start life: Marinus Vonhof
  date of start life: 2013-03-29
  on class: Adresgegevens
  on property: has as aspect
  max qualified cardinality: 1
subclass of: Restriction
  author at start life: Marinus Vonhof
  date of start life: 2017-12-07
  on class: Perceelaansluitpunt
  on property: has as part
  max qualified cardinality: 1
subclass of: Restriction
  on class: Gebouwaansluitpunt
  on property: has as part
  min qualified cardinality: 0

EAN Code
author of change: Marinus Vonhof
date of change: 2018-12-05
definition: Aansluiting identificatie code (eancode), op electriciteitsnet en gasnet
author at start life: Marinus Vonhof
date of start life: 2014-08-01
comment: Identificatie bij energieleverancier
see also: [DIV model] Identificatie van het object bij netwerkbedrijf elektriciteit
comment: [is aspect]
scope note: Collection of facts MDS
scope note: Collection of facts RGM
type: Class
subclass of: Unieke identificatie
subclass of: Restriction
  author of change: Marinus Vonhof
  date of change: 2018-12-05
  author at start life: Marinus Vonhof
  date of start life: 2014-08-01
  on class: Adresgegevens
  on property: has as aspect (inverse)
  max qualified cardinality: 1

Gebouw
author of change: Marinus Vonhof
author of change: Eric van Gorkom
date of change: 2025-01-16
date of change: 2024-05-13
date of change: 2021-12-24
definition: [IMBOR] Overdekte en geheel of gedeeltelijk met wanden omsloten constructief zelfstandige eenheid bedoeld voor het in een afgeschermde omgeving onderbrengen van mensen, dieren of voorwerpen of voor de productie van goederen.
author at start life: Nic Roest (Idoro)
date of start life: 2007-11-29
validity context: *d
see also: [NEN 3610:2010] Vrijstaande, overdekte en geheel of gedeeltelijke met wanden omsloten toegankelijke ruimte, die direct of indirect met de grond is verbonden.
scope note: Collection of facts TOP
type: Class
subclass of: Bouwwerk
subclass of: Restriction
  author of change: Marinus Vonhof
  date of change: 2019-03-14
  author at start life: Marinus Vonhof
  date of start life: 2016-04-24
  on class: Bouwkundig onderhoud
  on property: has as input (inverse)
  qualified cardinality: 1
subclass of: Restriction
  author at start life: Eric van Gorkom
  date of start life: 2021-11-23
  on class: Adresgegevens
  on property: has as aspect
  max qualified cardinality: 1
subclass of: Restriction
  on property: heeft Uitvoering
  has value: Vrijstaand Overdekt OmslotenEnToegankelijk
subclass of: Restriction
  on class: Slot
  on property: has as part
  min qualified cardinality: 0

Gemaal
label: Pumping station @en
author of change: Johan Post
author of change: Eric van Gorkom
date of change: 2021-11-23
date of change: 2026-05-18
definition: Een constructie ten behoeve van het verplaatsen van water
definition: [EN 16323:2014] buildings, structures and equipment used to transfer wastewater through a rising main or otherwise to raise the wastewater @en
author at start life: Marinus Vonhof
date of start life: 2014-03-18
validity context: *f
scope note: Collection of facts TOP
type: Class
subclass of: Bouwwerk
subclass of: Restriction
  author of change: Marinus Vonhof
  date of change: 2017-08-19
  author at start life: Finy Teitsma (Oranjewoud)
  date of start life: 2006-02-25
  comment: per definitie
  on class: Pomp
  on property: has as part
  min qualified cardinality: 1
subclass of: Restriction
  author of change: Marinus Vonhof
  date of change: 2019-07-11
  author at start life: Finy Teitsma (Oranjewoud)
  date of start life: 2006-02-25
  on class: Pompschakeling
  on property: has as aspect
  max qualified cardinality: 1
subclass of: Restriction
  author of change: Marinus Vonhof
  date of change: 2016-04-13
  author at start life: Marinus Vonhof
  date of start life: 2013-02-05
  on class: Veiligheidsrooster
  on property: has as part
  min qualified cardinality: 0
subclass of: Restriction
  author of change: Marinus Vonhof
  date of change: 2018-05-03
  author at start life: Marinus Vonhof
  date of start life: 2016-04-24
  comment: per definitie
  on class: Compartiment
  on property: has as part
  min qualified cardinality: 0
subclass of: Restriction
  author of change: Marinus Vonhof
  date of change: 2018-05-03
  author at start life: Marinus Vonhof
  date of start life: 2016-04-24
  on class: Service elektrisch
  on property: has as input (inverse)
  max qualified cardinality: 1
subclass of: Restriction
  author of change: Marinus Vonhof
  date of change: 2018-12-12
  author at start life: Marinus Vonhof
  date of start life: 2018-12-06
  comment: Temporeel kenmerk, met kenmerk Inwinning
  on class: Capaciteit gemaal
  on property: has as aspect
  min qualified cardinality: 1
subclass of: Restriction
  author of change: Marinus Vonhof
  date of change: 2019-03-20
  author at start life: Marinus Vonhof
  date of start life: 2016-04-24
  on class: Service mechanisch
  on property: has as input (inverse)
  max qualified cardinality: 1
subclass of: Restriction
  author at start life: Eric van Gorkom
  date of start life: 2021-11-23
  on class: Adresgegevens
  on property: has as aspect
  max qualified cardinality: 1
subclass of: Restriction
  author at start life: Johan Post
  date of start life: 2026-05-18
  on class: Elektriciteitskast
  on property: has as part
  max qualified cardinality: 1
subclass of: Restriction
  author at start life: Marinus Vonhof
  date of start life: 2015-07-28
  on class: Hijsinrichting
  on property: has as part
  min qualified cardinality: 0
subclass of: Restriction
  author at start life: Marinus Vonhof
  date of start life: 2015-07-28
  on class: Inspecteren gemaal
  on property: has as input (inverse)
  qualified cardinality: 1
subclass of: Restriction
  author at start life: Marinus Vonhof
  date of start life: 2018-05-03
  on class: Waterslagvoorziening
  on property: has as part
  max qualified cardinality: 1
subclass of: Restriction
  author at start life: Marinus Vonhof
  date of start life: 2020-04-18
  on class: Ontwerpcapaciteit gemaal
  on property: has as aspect
  qualified cardinality: 1
subclass of: Restriction
  author at start life: Marinus Vonhof
  date of start life: 2026-07-17
  on class: Keerklep
  on property: has as part
  min qualified cardinality: 0
subclass of: Restriction
  author at start life: Marinus Vonhof
  date of start life: 2026-08-04
  on class: Communicatie-unit
  on property: has as part
  max qualified cardinality: 1
subclass of: Restriction
  author at start life: Marinus Vonhof
  date of start life: 2026-08-04
  on class: Slingergoot
  on property: has as part
  max qualified cardinality: 1
subclass of: Restriction
  on property: heeft Functie
  has value: VerpompenVanWater

Kunstwerk
author of change: Marinus Vonhof
author of change: Eric van Gorkom
date of change: 2025-01-16
date of change: 2021-11-23
definition: [Omgevingswet] Een civieltechnische constructie voor de infrastructuur van wegen, water, spoorbanen, waterkeringen en/of leidingen, waarvoor andere materialen dan aarde en zand zijn gebruikt
author at start life: Marinus Vonhof
date of start life: 2012-04-29
validity context: *f
comment: [VervallenLink http://definities.geostandaarden.nl/concepten/imgeo/doc/begrip/Kunstwerk]
see also: [IMGeo:1.0/2007] Civieltechnisch werk voor de infrastructuur van wegen, water, spoorbanen, waterkeringen en/of leidingen en niet bedoeld voor permanent menselijk verblijf.
see also: [NEN 3610:2010] Civieltechnisch werk voor de infrastructuur van wegen, water, spoorbanen, waterkeringen en/of leidingen en niet bedoeld voor permanent menselijk verblijf.
scope note: Collection of facts BAS
type: Class
subclass of: Bouwwerk
subclass of: Restriction
  author at start life: Eric van Gorkom
  date of start life: 2021-11-23
  on class: Adresgegevens
  on property: has as aspect
  max qualified cardinality: 1
subclass of: Restriction
  on property: heeft Uitvoering
  has value: CivieltechnischeConstructie
subclass of: Restriction
  on property: heeft Toepassing
  has value: InfrastructuurVanWegEnWater

RWZI
author of change: Marinus Vonhof
author of change: Eric van Gorkom
date of change: 2021-11-23
date of change: 2021-11-30
definition: [NEN 3300:1996] Het totaal van de grond, gebouwen en apparatuur voor de zuivering van afvalwater
author at start life: Marinus Vonhof
date of start life: 2014-11-28
validity context: 1d
see also: [IRIS-RIOKEN:2012] Rioolwaterzuiveringinrichting. Het totaal van grond, bouwwerken en installaties ten behoeve van het zuiveren van afvalwater.
alternative label: AWZI
scope note: Collection of facts BAS
scope note: Collection of facts DMO
type: Class
subclass of: Bouwwerk
subclass of: Restriction
  author of change: Marinus Vonhof
  date of change: 2015-05-27
  author at start life: Marinus Vonhof
  date of start life: 2014-12-11
  on class: Lozingspunt
  on property: is connected to
  min qualified cardinality: 1
subclass of: Restriction
  author at start life: Eric van Gorkom
  date of start life: 2021-11-23
  on class: Adresgegevens
  on property: has as aspect
  max qualified cardinality: 1
subclass of: Restriction
  author at start life: Marinus Vonhof
  date of start life: 2015-06-02
  on class: Zuiveringseenheid
  on property: has as part (inverse)
  qualified cardinality: 1
subclass of: Restriction
  author at start life: Marinus Vonhof
  date of start life: 2015-07-23
  on class: Code
  on property: has as aspect
  max qualified cardinality: 1
subclass of: Restriction
  author at start life: Marinus Vonhof
  date of start life: 2018-10-27
  on class: NLCS_AWZI
  on property: is represented by
  max qualified cardinality: 1
subclass of: Restriction
  author at start life: Marinus Vonhof
  date of start life: 2018-11-07
  on class: Sym_RWZI
  on property: is represented by
  max qualified cardinality: 1
subclass of: Restriction
  on property: heeft Functie
  has value: ZuiverenAfvalwater

Telecomadres
author of change: Eric van Gorkom
date of change: 2024-05-13
author at start life: Marinus Vonhof
date of start life: 2014-08-01
comment: Telefoonnummer/IP-adres
see also: [DIV model] Identificatie van het object bij de telecommunicatieaanbieder
comment: [is aspect]
scope note: Collection of facts MDS
scope note: Collection of facts RGM
type: Class
subclass of: Unieke identificatie
subclass of: Restriction
  author at start life: Marinus Vonhof
  date of start life: 2014-08-01
  on class: Adresgegevens
  on property: has as aspect (inverse)
  max qualified cardinality: 1

BAG Code
author of change: Marinus Vonhof
date of change: 2020-05-28
definition: Code binnen de Basisregistratie Adressen en Gebouwen (bevat gemeentelijke basisgegevens van alle adressen en gebouwen in een gemeente)
author at start life: Marinus Vonhof
date of start life: 2014-08-01
see also: [DIV model] Identificatie van het object binnen de basisregistratie
alternative label: BAG-identificatie
comment: [is aspect]
scope note: Collection of facts MDS
scope note: Collection of facts RGM
type: Class
subclass of: Unieke identificatie
subclass of: Restriction
  author at start life: Marinus Vonhof
  date of start life: 2018-12-05
  on class: Adresgegevens
  on property: has as aspect (inverse)
  max qualified cardinality: 1

Perceelaansluitpunt
author of change: Marinus Vonhof
author of change: Johan Post
date of change: 2021-08-05
date of change: 2026-05-01
definition: Het punt dat de grens tussen de beheerverantwoordelijkheden van gemeente en de eigenaar van de terrein- en of gebouwriolering markeert
author at start life: Finy Teitsma (Oranjewoud)
date of start life: 2006-02-20
scope note: Collection of facts BAS
scope note: Collection of facts DMO
type: Class
subclass of: Aansluitpunt
subclass of: Restriction
  author of change: Marinus Vonhof
  date of change: 2019-05-15
  author at start life: Finy Teitsma (Oranjewoud)
  date of start life: 2007-11-30
  on class: Perceelaansluiting
  on property: has as part (inverse)
  qualified cardinality: 1
subclass of: Restriction
  author of change: Marinus Vonhof
  date of change: 2016-04-25
  author at start life: Nic Roest (Idoro)
  date of start life: 2007-11-29
  on class: Beerput
  on property: is connected to
  max qualified cardinality: 1
subclass of: Restriction
  author of change: Marinus Vonhof
  date of change: 2016-04-25
  author at start life: Nic Roest (Idoro)
  date of start life: 2007-11-29
  on class: Helofytenfilter
  on property: is connected to
  max qualified cardinality: 1
subclass of: Restriction
  author of change: Marinus Vonhof
  date of change: 2016-04-25
  author at start life: Nic Roest (Idoro)
  date of start life: 2007-11-29
  on class: IBA
  on property: is connected to
  max qualified cardinality: 1
subclass of: Restriction
  author at start life: Finy Teitsma (Oranjewoud)
  date of start life: 2007-11-30
  on class: Perceelaansluitleiding
  on property: is connected to
  qualified cardinality: 1
subclass of: Restriction
  author at start life: Marinus Vonhof
  date of start life: 2013-02-05
  on class: Lozingsvergunninghouder
  on property: has as aspect
  max qualified cardinality: 1
subclass of: Restriction
  author at start life: Marinus Vonhof
  date of start life: 2013-02-05
  on class: Lozingsvergunningnummer
  on property: has as aspect
  max qualified cardinality: 1
subclass of: Restriction
  author at start life: Marinus Vonhof
  date of start life: 2017-12-07
  on class: Perceel
  on property: has as part (inverse)
  max qualified cardinality: 1
subclass of: Restriction
  author at start life: Marinus Vonhof
  date of start life: 2019-05-15
  on class: Adresgegevens
  on property: has as aspect
  max qualified cardinality: 1
subclass of: Restriction
  author at start life: Marinus Vonhof
  date of start life: 2020-04-18
  on class: Lozingseisen
  on property: has as aspect
  max qualified cardinality: 1

BGT Code
definition: Code binnen de Basisregistratie Grootschalige Topografie. De code kan informatie bevatten over het soort object en de locatie. De BGT-code van een gebouw bevat vaak de BAG-code.
author at start life: Marinus Vonhof
date of start life: 2020-05-28
alternative label: Identificatie geovoorziening
comment: [is aspect]
scope note: Collection of facts BAS
type: Class
subclass of: Unieke identificatie
subclass of: Restriction
  author at start life: Marinus Vonhof
  date of start life: 2020-05-28
  on class: Adresgegevens
  on property: has as aspect (inverse)
  max qualified cardinality: 1

Gebouwaansluitpunt
definition: [NTR 3216:2012] Buiten het gebouw gelegen overgang van de gebouwriolering op de buitenriolering, gelegen op een afstand van maximaal 0,5 m vanaf het Gebouw of zoveel korter dan een zettingsconstructie in de buitenriolering vereist.
author at start life: Johan Post
date of start life: 2026-05-01
alternative label: gebouwaansluiting
scope note: Collection of facts BAS
scope note: Collection of facts DMO
type: Class
subclass of: Aansluitpunt
subclass of: Restriction
  author of change: Marinus Vonhof
  date of change: 2016-04-25
  author at start life: Nic Roest (Idoro)
  date of start life: 2007-11-29
  on class: Beerput
  on property: is connected to
  max qualified cardinality: 1
subclass of: Restriction
  author of change: Marinus Vonhof
  date of change: 2016-04-25
  author at start life: Nic Roest (Idoro)
  date of start life: 2007-11-29
  on class: Helofytenfilter
  on property: is connected to
  max qualified cardinality: 1
subclass of: Restriction
  author of change: Marinus Vonhof
  date of change: 2016-04-25
  author at start life: Nic Roest (Idoro)
  date of start life: 2007-11-29
  on class: IBA
  on property: is connected to
  max qualified cardinality: 1
subclass of: Restriction
  author at start life: Finy Teitsma (Oranjewoud)
  date of start life: 2007-11-30
  on class: Perceelaansluitleiding
  on property: is connected to
  qualified cardinality: 1
subclass of: Restriction
  author at start life: Marinus Vonhof
  date of start life: 2013-02-05
  on class: Lozingsvergunninghouder
  on property: has as aspect
  max qualified cardinality: 1
subclass of: Restriction
  author at start life: Marinus Vonhof
  date of start life: 2013-02-05
  on class: Lozingsvergunningnummer
  on property: has as aspect
  max qualified cardinality: 1
subclass of: Restriction
  author at start life: Marinus Vonhof
  date of start life: 2017-12-07
  on class: Perceel
  on property: has as part (inverse)
  max qualified cardinality: 1
subclass of: Restriction
  author at start life: Marinus Vonhof
  date of start life: 2019-05-15
  on class: Adresgegevens
  on property: has as aspect
  max qualified cardinality: 1
subclass of: Restriction
  author at start life: Marinus Vonhof
  date of start life: 2020-04-18
  on class: Lozingseisen
  on property: has as aspect
  max qualified cardinality: 1
subclass of: Restriction
  on class: Perceelaansluiting
  on property: has as part (inverse)
  max qualified cardinality: 1

Overnamepunt
author of change: Marinus Vonhof
author of change: Johan Post
date of change: 2026-07-15
date of change: 2024-10-21
date of change: 2024-04-27
date of change: 2024-05-14
definition: [NEN 3300:1996] locatie waar de overdracht plaatsvindt van het water uit de riolering aan de beheerder van de afvalwaterzuiveringinrichting
author at start life: Marinus Vonhof
date of start life: 2012-04-29
see also: [IRIS-RIOKEN:2012] Het punt waar de verantwoording over het afvalwater overgaat van een gemeente/bedrijf op het waterschap of omgekeerd van het waterschap naar een gemeente
alternative label: Afgiftepunt
alternative label: Inprikpunt
alternative label: Overdrachtspunt
scope note: Collection of facts BAS
scope note: Collection of facts DMO
type: Class
subclass of: Aansluitpunt
subclass of: Extra objecttype (rol)
subclass of: Restriction
  author of change: Marinus Vonhof
  date of change: 2015-03-01
  author at start life: Marinus Vonhof
  date of start life: 2014-10-14
  on class: Transportstelsel
  on property: has as part (inverse)
  max qualified cardinality: 1
subclass of: Restriction
  author of change: Marinus Vonhof
  date of change: 2024-05-16
  author at start life: Marinus Vonhof
  date of start life: 2015-03-01
  on class: Vrijverval rioolstelsel
  on property: has as part (inverse)
  max qualified cardinality: 1
subclass of: Restriction
  author at start life: Marinus Vonhof
  date of start life: 2018-11-07
  on class: Sym_Overnamepunt
  on property: is represented by
  max qualified cardinality: 1
subclass of: Restriction
  author at start life: Marinus Vonhof
  date of start life: 2024-05-16
  on class: Mechanisch rioolstelsel
  on property: has as part (inverse)
  max qualified cardinality: 1
subclass of: Restriction
  author at start life: Marinus Vonhof
  date of start life: 2026-07-14
  on class: Riooleindgemaal
  on property: has as part (inverse)
  max qualified cardinality: 1
subclass of: Restriction
  on class: Adresgegevens
  on property: has as aspect
  max qualified cardinality: 1
subclass of: Restriction
  on class: Afnameverplichting
  on property: has as aspect
  max qualified cardinality: 1
subclass of: Restriction
  on class: Lozingseisen
  on property: has as aspect
  max qualified cardinality: 1
subclass of: Restriction
  on class: Lozingsvergunninghouder
  on property: has as aspect
  max qualified cardinality: 1
subclass of: Restriction
  on class: Lozingsvergunningnummer
  on property: has as aspect
  max qualified cardinality: 1
subclass of: Restriction
  on class: Organisatie afname
  on property: has as aspect
  max qualified cardinality: 1
subclass of: Restriction
  on class: Rioleringsgebied
  on property: has as part (inverse)
  max qualified cardinality: 1
subclass of: Restriction
  on class: Transportleiding
  on property: has as part (inverse)
  max qualified cardinality: 1

Afdekking
author of change: Eric van Gorkom
date of change: 2022-09-27
author at start life: Marinus Vonhof
date of start life: 2016-04-15
validity context: 5d 10d 11d 12f 13d 14f
scope note: Collection of facts TOP
type: Class
subclass of: Constructieonderdeel
subclass of: Restriction
  author of change: Marinus Vonhof
  date of change: 2015-10-31
  author at start life: Finy Teitsma (Oranjewoud)
  date of start life: 2006-02-25
  on class: Breedte afdekking
  on property: has as aspect
  max qualified cardinality: 1
subclass of: Restriction
  author of change: Marinus Vonhof
  date of change: 2021-08-05
  author at start life: Finy Teitsma (Oranjewoud)
  date of start life: 2006-02-25
  on class: Vorm afdekking
  on property: has as aspect
  max qualified cardinality: 1
subclass of: Restriction
  author of change: Marinus Vonhof
  date of change: 2015-10-31
  author at start life: Marinus Vonhof
  date of start life: 2014-08-01
  on class: Hoogte afdekking
  on property: has as aspect
  max qualified cardinality: 1
subclass of: Restriction
  author of change: Marinus Vonhof
  date of change: 2015-10-31
  author at start life: Marinus Vonhof
  date of start life: 2014-11-16
  on class: Lengte afdekking
  on property: has as aspect
  max qualified cardinality: 1
subclass of: Restriction
  author of change: Marinus Vonhof
  date of change: 2017-03-28
  author at start life: Marinus Vonhof
  date of start life: 2013-10-01
  on class: Diameter afdekking
  on property: has as aspect
  max qualified cardinality: 1
subclass of: Restriction
  author of change: Marinus Vonhof
  date of change: 2021-08-06
  author at start life: Marinus Vonhof
  date of start life: 2013-10-26
  validity context: 12t 14t
  on class: Dekseloriëntatie
  on property: has as aspect
  max qualified cardinality: 1
subclass of: Restriction
  author of change: Wouter van Riel
  date of change: 2021-11-19
  author at start life: Marinus Vonhof
  date of start life: 2018-05-03
  on class: Slot
  on property: has as part
  min qualified cardinality: 0
subclass of: Restriction
  author at start life: Finy Teitsma (Oranjewoud)
  date of start life: 2006-02-25
  on property: has as aspect
  some values from: Breedte afdekking
subclass of: Restriction
  author at start life: Finy Teitsma (Oranjewoud)
  date of start life: 2006-02-25
  on property: has as aspect
  some values from: Materiaal afdekking
subclass of: Restriction
  author at start life: Finy Teitsma (Oranjewoud)
  date of start life: 2006-02-25
  on property: has as aspect
  some values from: Vorm afdekking
subclass of: Restriction
  author at start life: Marinus Vonhof
  date of start life: 2013-10-01
  on property: has as aspect
  some values from: Diameter afdekking
subclass of: Restriction
  validity context: 12t 14t
  on class: Materiaal afdekking
  on property: has as aspect
  max qualified cardinality: 1
subclass of: Restriction
  on property: heeft Functie
  has value: Afdekken

Constructieonderdeel
author of change: Marinus Vonhof
author of change: Johan Post
date of change: 2025-01-16
date of change: 2015-10-22
date of change: 2024-05-01
definition: [IMBOR] Een onderdeel van een objecttype dat als zelfstandig objecttype beheerd kan worden.
author at start life: Marinus Vonhof
date of start life: 2013-09-28
validity context: *f 15d
scope note: Collection of facts TOP
type: Class
subclass of: Fysiek object
subclass of: Restriction
  on property: heeft Toepassing
  has value: DeelVanEenOpZichzelfStaandeConstructie
subclass of: Restriction
  on class: Theoretische levensduur
  on property: has as aspect
  max qualified cardinality: 1

Breedte afdekking
label: Breadth of cover @en
author of change: Marinus Vonhof
date of change: 2016-04-20
date of change: 2026-07-16
definition: [EN13508-2+A1] The breadth of the cover in millimetres (Not used for circular access) @en
notation: CCR
notation: JCR
author at start life: Nic Roest (Idoro)
date of start life: 2006-03-23
units of measurements: mm
comment: Intrinsiek aspect
comment: [is aspect]
scope note: Collection of facts MDS
scope note: Collection of facts EN
scope note: Collection of facts RRB
scope note: Collection of facts REV
type: Class
subclass of: Breedte
subclass of: Restriction
  author of change: Marinus Vonhof
  date of change: 2015-10-31
  author at start life: Finy Teitsma (Oranjewoud)
  date of start life: 2006-02-25
  on class: Afdekking
  on property: has as aspect (inverse)
  max qualified cardinality: 1
subclass of: Restriction
  author at start life: Marinus Vonhof
  date of start life: 2020-04-20
  on class: Visueel inspecteren rioolput
  on property: has as output (inverse)
  max qualified cardinality: 1
subclass of: Restriction
  on property: has as value
  all values from: integer

Vorm afdekking
label: Shape of cover @en
author of change: Marinus Vonhof
date of change: 2021-08-05
date of change: 2026-07-16
definition: [EN13508-2+A1] The shape of the cover @en
notation: CCO
notation: JCO
author at start life: Nic Roest (Idoro)
date of start life: 2006-03-23
comment: Intrinsiek aspect
comment: [is aspect]
scope note: Collection of facts MDS
scope note: Collection of facts REV
type: Class
subclass of: Vorm
subclass of: Restriction
  author of change: Marinus Vonhof
  date of change: 2021-08-05
  author at start life: Finy Teitsma (Oranjewoud)
  date of start life: 2006-02-25
  on class: Afdekking
  on property: has as aspect (inverse)
  max qualified cardinality: 1
subclass of: Restriction
  on property: has as reference (qualification)
  all values from: Vorm deksel (coll)

Hoogte afdekking
author of change: Marinus Vonhof
date of change: 2022-10-03
date of change: 2026-07-16
author at start life: Marinus Vonhof
date of start life: 2014-08-01
units of measurements: mm
validity context: 10d
comment: Intrinsiek aspect
alternative label: Dikte deksel
comment: [is aspect]
scope note: Collection of facts MDS
type: Class
subclass of: Hoogte
subclass of: Restriction
  author of change: Marinus Vonhof
  date of change: 2015-10-31
  author at start life: Marinus Vonhof
  date of start life: 2014-08-01
  on class: Afdekking
  on property: has as aspect (inverse)
  max qualified cardinality: 1
subclass of: Restriction
  on property: has as value
  all values from: integer

Lengte afdekking
label: Width of cover @en
author of change: Marinus Vonhof
author of change: Nic Roest (Idoro)
date of change: 2026-07-16
date of change: 2006-11-23
definition: [EN13508-2+A1] The width (or diameter if circular) of the cover in millimetres @en
notation: CCQ
notation: JCQ
author at start life: Nic Roest (Idoro)
date of start life: 2006-03-23
units of measurements: mm
comment: Intrinsiek aspect
comment: [is aspect]
scope note: Collection of facts MDS
scope note: Collection of facts EN
scope note: Collection of facts RRB
scope note: Collection of facts REV
type: Class
subclass of: Lengte
subclass of: Restriction
  author of change: Marinus Vonhof
  date of change: 2015-10-31
  author at start life: Marinus Vonhof
  date of start life: 2014-11-16
  on class: Afdekking
  on property: has as aspect (inverse)
  max qualified cardinality: 1
subclass of: Restriction
  author at start life: Marinus Vonhof
  date of start life: 2020-04-20
  on class: Visueel inspecteren rioolput
  on property: has as output (inverse)
  max qualified cardinality: 1
subclass of: Restriction
  on property: has as value
  all values from: integer

Diameter afdekking
author of change: Marinus Vonhof
date of change: 2026-07-16
date of change: 2021-08-10
definition: De diameter van de afdekking (deksel, luik)
author at start life: Marinus Vonhof
date of start life: 2013-10-01
units of measurements: mm
comment: Intrinsiek aspect
comment: [is aspect]
scope note: Collection of facts MDS
type: Class
subclass of: Diameter
subclass of: Restriction
  author of change: Marinus Vonhof
  date of change: 2017-03-28
  author at start life: Marinus Vonhof
  date of start life: 2013-10-01
  on class: Afdekking
  on property: has as aspect (inverse)
  max qualified cardinality: 1
subclass of: Restriction
  on property: has as value
  all values from: integer

Dekseloriëntatie
author of change: Marinus Vonhof
date of change: 2018-12-05
definition: Een topologisch element dat het zwaartepunt (vertex) van de bovenkant deksel beschrijft
author at start life: Marinus Vonhof
date of start life: 2013-10-26
scope note: Collection of facts MDS
scope note: Collection of facts EN
scope note: Collection of facts RRB
scope note: Collection of facts REV
type: Class
subclass of: Representatie fysiek object
subclass of: Restriction
  author of change: Marinus Vonhof
  date of change: 2020-04-18
  author at start life: Marinus Vonhof
  date of start life: 2016-11-09
  comment: Temporeel kenmerk, met kenmerk Inwinning
  on class: Punt
  on property: has as aspect
  max qualified cardinality: 1
subclass of: Restriction
  author of change: Marinus Vonhof
  date of change: 2021-08-06
  author at start life: Marinus Vonhof
  date of start life: 2013-10-26
  on class: Afdekking
  on property: has as aspect (inverse)
  max qualified cardinality: 1
subclass of: Restriction
  author at start life: Marinus Vonhof
  date of start life: 2018-12-12
  comment: Temporeel kenmerk, met kenmerk Inwinning
  on class: Putdekselniveau
  on property: has as aspect
  min qualified cardinality: 1

Slot
author of change: Marinus Vonhof
author of change: Eric van Gorkom
date of change: 2025-01-16
date of change: 2024-05-13
definition: [IMBOR] Een mechanisme of onderdeel ten behoeven van het (af)sluiten van een object of voorwerp.
author at start life: Wouter van Riel
date of start life: 2021-11-19
validity context: 10d
scope note: Collection of facts RRB
scope note: Collection of facts BAS
scope note: Collection of facts RGM
type: Class
subclass of: Constructieonderdeel
subclass of: Restriction
  author at start life: Wouter van Riel
  date of start life: 2021-11-19
  on class: Afdekking
  on property: has as part (inverse)
  max qualified cardinality: 1
subclass of: Restriction
  author at start life: Wouter van Riel
  date of start life: 2021-11-19
  on class: Elektriciteitskast
  on property: has as part (inverse)
  max qualified cardinality: 1
subclass of: Restriction
  author at start life: Wouter van Riel
  date of start life: 2021-11-19
  on class: Sleutelnummer
  on property: has as aspect
  max qualified cardinality: 1
subclass of: Restriction
  on property: heeft Functie
  has value: ToegangBelemmeren
subclass of: Restriction
  on class: Gebouw
  on property: has as part (inverse)
  min qualified cardinality: 0

Materiaal afdekking
label: Material of cover @en
author of change: Marinus Vonhof
author of change: Eric van Gorkom
date of change: 2016-04-23
date of change: 2022-09-27
definition: [EN13508-2+A1] The material in accordance with Table C.4 @en
notation: CCP
notation: JCP
author at start life: Marinus Vonhof
date of start life: 2014-09-16
comment: Intrinsiek aspect
comment: [is aspect]
scope note: Collection of facts TOP
type: Class
subclass of: Materiaal
subclass of: Restriction
  author of change: Marinus Vonhof
  date of change: 2015-02-22
  author at start life: Finy Teitsma (Oranjewoud)
  date of start life: 2006-02-25
  on class: Afdekking
  on property: has as aspect (inverse)
  max qualified cardinality: 1
subclass of: Restriction
  author at start life: Marinus Vonhof
  date of start life: 2020-04-20
  on class: Visueel inspecteren rioolput
  on property: has as output (inverse)
  max qualified cardinality: 1
subclass of: Restriction
  on property: has as reference (qualification)
  all values from: Materiaal deksel (coll)

Afdekplaat
author of change: Marinus Vonhof
date of change: 2025-01-16
date of change: 2026-07-23
definition: Een onderdeel dat openingen (gedeeltelijk) afdekt, bijvoorbeeld de onderbak van een inspectieput.
definition: [IMBOR] Een onderdeel dat bepaalde openingen afdekt, bijvoorbeeld goten aan de oppervlakte, kabelgeulen, etc.
author at start life: Marinus Vonhof
date of start life: 2018-12-05
alternative label: Dekplaat
scope note: Collection of facts REV
scope note: Collection of facts BAS
type: Class
subclass of: Afdekking
subclass of: Restriction
  on property: heeft Uitvoering
  has value: VormVanEenPlaat
subclass of: Restriction
  on class: Rioolput
  on property: has as part (inverse)
  max qualified cardinality: 1

Repareren
author of change: Marinus Vonhof
date of change: 2020-10-28
definition: [NEN 3300:1996] herstel van het oorspronkelijke functioneren, waarbij een beperkte toestandswijziging wordt doorgevoerd
definition: [NEN-EN 752:2008] herstellen van plaatselijke schade
author at start life: Marinus Vonhof
date of start life: 2013-03-26
validity context: 6d
scope note: Collection of facts BAS
scope note: Collection of facts PLI
scope note: Collection of facts MTR
type: Class
subclass of: Maatregel
subclass of: Restriction
  on property: heeft Functie
  has value: DoorvoerenBeperkteToestandswijziging

Vrijverval rioolleiding
author of change: Johan Post
author of change: Eric van Gorkom
author of change: Wouter van Riel
date of change: 2021-11-23
date of change: 2024-04-23
date of change: 2024-10-21
definition: Een gesloten rioolleiding waarin het afvalwater door de zwaartekracht wordt getransporteerd.
definition: [NEN 3300:1996] riool waardoor afvalwater door middel van de zwaartekracht wordt getransporteerd
definition: [NEN-EN 752:2008] leiding of andere constructie, gewoonlijk ondergronds, die afvalwater vanuit meer één dan lozingspunt transporteert [EN 1085:2007, definitie 2270]
notation: AAA
notation: GAA
author at start life: Finy Teitsma (Oranjewoud)
date of start life: 2006-11-29
validity context: *f 13d
see also: [IMKL:1.1/2008] Riool waardoor afvalwater door de zwaartekracht wordt getransporteerd (uit NEN 3300, Buitenriolering).
see also: [NEN 3398:2004] verzameling buizen tussen twee putten
alternative label: Inzamelleiding
alternative label: Vrijvervalriool
scope note: Collection of facts TOP
type: Class
subclass of: Rioolleiding
subclass of: Restriction
  author of change: Marinus Vonhof
  date of change: 2018-09-03
  author at start life: Finy Teitsma (Oranjewoud)
  date of start life: 2006-02-25
  on class: Lining
  on property: has as part
  max qualified cardinality: 1
subclass of: Restriction
  author of change: Marinus Vonhof
  date of change: 2019-05-15
  author at start life: Finy Teitsma (Oranjewoud)
  date of start life: 2006-07-12
  on class: Inlaat leiding
  on property: has as part
  min qualified cardinality: 0
subclass of: Restriction
  author of change: Marinus Vonhof
  date of change: 2015-10-20
  author at start life: Marinus Vonhof
  date of start life: 2012-08-15
  validity context: *t
  comment: Relatie (kardinaliteit) uitgeschakeld voor CFK's (SHACL-syntax) (20260403) (20260824)
  on class: Visueel inspecteren vrijverval leiding
  on property: has as output (inverse)
  qualified cardinality: 1
subclass of: Restriction
  author of change: Marinus Vonhof
  date of change: 2017-03-06
  author at start life: Marinus Vonhof
  date of start life: 2014-04-29
  validity context: *t
  on class: Rioolput
  on property: is connected to
  min qualified cardinality: 1
subclass of: Restriction
  author of change: Marinus Vonhof
  date of change: 2017-03-06
  author at start life: Marinus Vonhof
  date of start life: 2014-04-29
  on class: Rioolput
  on property: is connected to
  max qualified cardinality: 2
subclass of: Restriction
  author of change: Marinus Vonhof
  date of change: 2018-04-06
  author at start life: Marinus Vonhof
  date of start life: 2014-08-29
  on class: Visueel inspecteren vrijverval leiding
  on property: has as input (inverse)
  qualified cardinality: 1
subclass of: Restriction
  author of change: Marinus Vonhof
  date of change: 2019-04-04
  author at start life: Marinus Vonhof
  date of start life: 2014-12-23
  validity context: 2t
  on class: Reinigen vrijverval leiding
  on property: has as input (inverse)
  qualified cardinality: 1
subclass of: Restriction
  author of change: Marinus Vonhof
  date of change: 2016-04-15
  author at start life: Nic Roest (Idoro)
  date of start life: 2007-11-29
  validity context: 1t 10t 12t
  on class: Vrijverval rioolstelsel
  on property: has as part (inverse)
  qualified cardinality: 1
subclass of: Restriction
  author at start life: Marinus Vonhof
  date of start life: 2014-12-23
  validity context: *t
  comment: Relatie (kardinaliteit) uitgeschakeld voor CFK's (SHACL-syntax) (20260403) (20260824)
  on class: Reinigen vrijverval leiding
  on property: has as output (inverse)
  qualified cardinality: 1
subclass of: Restriction
  author at start life: Marinus Vonhof
  date of start life: 2019-03-14
  on class: Boorkern nemen
  on property: has as input (inverse)
  max qualified cardinality: 1
subclass of: Restriction
  author at start life: Marinus Vonhof
  date of start life: 2019-05-15
  on class: Profiel leiding
  on property: has as aspect
  max qualified cardinality: 1
subclass of: Restriction
  author at start life: Marinus Vonhof
  date of start life: 2023-01-13
  on class: Ketting
  on property: has as part
  max qualified cardinality: 1
subclass of: Restriction
  on property: heeft Structuur
  has value: Gesloten
subclass of: Restriction
  on property: heeft Technologie
  has value: TransportDoorDeZwaartekracht
subclass of: Restriction
  on class: Continue lozing
  on property: has as aspect
  max qualified cardinality: 1

Andere reparatie bij aansluiting
label: Other repair of connection @en
author of change: Marinus Vonhof
date of change: 2025-01-16
notation: G
author at start life: Marinus Vonhof
date of start life: 2018-12-13
scope note: Collection of facts EN
scope note: Collection of facts BAS
scope note: Collection of facts MTR
type: Class
subclass of: Reparatie
subclass of: Restriction
  on property: heeft Uitvoering
  has value: AansluitingGerepareerd

Mechanisme
author of change: Marinus Vonhof
date of change: 2021-01-09
definition: Bij activiteit: waarmee
author at start life: Marinus Vonhof
date of start life: 2014-04-29
validity context: 6d
comment: Onderscheidend kenmerk
comment: [is aspect]
scope note: Collection of facts TOP
type: Class
subclass of: Onderscheidend kenmerk

Vorm drempel (coll)
comment: [is coll]
scope note: Collection of facts BAS
type: Class
subclass of: Verzameling soorten

Informatiedrager
author of change: Marinus Vonhof
date of change: 2013-12-01
definition: [Gellish] Is a medium intended or actually carrying physical objects from that properties information can be deducted. Typically paper that carries ink, magnetic fields on a disk or tape, electrically or optically modulated substances of electricity or light. @en
author at start life: Marinus Vonhof
date of start life: 2013-09-28
validity context: 10d 11d 12d 13d 14d 15d
scope note: Collection of facts TOP
type: Class

Basisrioleringsplan
author of change: Marinus Vonhof
date of change: 2024-05-16
date of change: 2018-12-12
definition: [NEN 3300:1996] Voor een vergunningaanvraag opgesteld document (tekening + toelichting en berekeningen) met de huidige situatie van de riolering en de uit te voeren verbeteringsmaatregelen
definition: [Omgevingswet] Een plan waarin op gedetailleerde wijze wordt aangegeven hoe de inzameling en afvoer van afvalwater en neerslag binnen een gebied dient te gebeuren
author at start life: Marinus Vonhof
date of start life: 2014-11-29
comment: Het Basisrioleringsplan is vervangen door het Systeemoverzicht Stedelijk Water, het Basisrioleringsplan wordt daar onderdeel van
see also: [IRIS-RIOKEN:2012] Een plan waarin op gedetailleerde wijze wordt aangegeven hoe de inzameling en afvoer van afvalwater en neerslag binnen een gebied dient te gebeuren. Het BRP is de basis voor het GRP.
alternative label: BRP
scope note: Collection of facts BAS
scope note: Collection of facts DMO
type: Class
subclass of: Rioleringsplan
subclass of: Restriction
  author of change: Marinus Vonhof
  date of change: 2018-12-13
  author at start life: Marinus Vonhof
  date of start life: 2014-11-29
  on class: Planvorming rioleringsbeheer
  on property: has as output (inverse)
  qualified cardinality: 1

Afnameverplichting
definition: De hoeveelheid afvalwater die verplicht afgenomen wordt
author at start life: Marinus Vonhof
date of start life: 2026-07-15
units of measurements: m3/h
comment: [is aspect]
scope note: Collection of facts BAS
scope note: Collection of facts DMO
type: Class
subclass of: Capaciteit
subclass of: Restriction
  on class: Overnamepunt
  on property: has as aspect (inverse)
  max qualified cardinality: 1

Capaciteit
author of change: Marinus Vonhof
date of change: 2025-01-16
date of change: 2015-05-29
definition: [IMBOR] Vermogen tot opslaan of verwerken.
author at start life: Nic Roest (Idoro)
date of start life: 2006-02-21
validity context: 15d
comment: [is aspect]
scope note: Collection of facts TOP
type: Class
subclass of: Kenmerk
subclass of: Restriction
  date of change: 2019-04-25
  author at start life: Marinus Vonhof
  date of start life: 2015-11-03
  on class: Inwinning
  on property: has as aspect
  max qualified cardinality: 1

Afslagniveau
author of change: Marinus Vonhof
date of change: 2018-05-03
definition: [NEN 3300:1996] peil waarop een pomp afslaat.
author at start life: Nic Roest (Idoro)
date of start life: 2006-02-21
units of measurements: m
see also: [IRIS-RIOKEN:2012] Ingesteld laag peil in de pompkelder van rioolgemaal. Als de riolering en de pompkelder tot aan het uitslagpeil is leeggepompt, wordt de bemaling beëindigd.
alternative label: Uitslagpeil
comment: [is aspect]
scope note: Collection of facts MDS
scope note: Collection of facts HYD
scope note: Collection of facts RGM
type: Class
subclass of: Hoogte t.o.v. NAP
subclass of: Restriction
  on property: has as value
  all values from: decimal

Afslagniveau benedenstrooms
author of change: Marinus Vonhof
date of change: 2017-05-30
definition: Afslagniveau aan de uitlaatzijde van de pomp(en)
author at start life: Marinus Vonhof
date of start life: 2013-02-05
units of measurements: m
alternative label: Afslagniveau stroomafwaarts
comment: [is aspect]
scope note: Collection of facts HYD
scope note: Collection of facts RGM
type: Class
subclass of: Afslagniveau
subclass of: Restriction
  author of change: Marinus Vonhof
  date of change: 2016-04-23
  author at start life: Marinus Vonhof
  date of start life: 2013-02-05
  on class: Pomp
  on property: has as aspect (inverse)
  max qualified cardinality: 1
subclass of: Restriction
  on property: has as value
  all values from: decimal

Afslagniveau bovenstrooms
author of change: Marinus Vonhof
date of change: 2018-05-03
definition: Afslagniveau aan de inlaatzijde van de pomp(en)
author at start life: Marinus Vonhof
date of start life: 2013-02-05
units of measurements: m
alternative label: Afslagniveau stroomopwaarts
comment: [is aspect]
scope note: Collection of facts HYD
scope note: Collection of facts RGM
type: Class
subclass of: Afslagniveau
subclass of: Restriction
  author of change: Marinus Vonhof
  date of change: 2017-08-31
  author at start life: Marinus Vonhof
  date of start life: 2011-12-15
  on class: Pomp
  on property: has as aspect (inverse)
  max qualified cardinality: 1
subclass of: Restriction
  on property: has as value
  all values from: decimal

Afsluiteraandrijving
author of change: Marinus Vonhof
author of change: Johan Post
date of change: 2025-01-16
date of change: 2024-05-01
definition: [IMBOR] Een mechaniek om de doorstroming van een afsluiter te regelen, handmatig te bedienen of voorzien van een kleine motor.
author at start life: Marinus Vonhof
date of start life: 2015-02-28
validity context: 10d
scope note: Collection of facts BAS
scope note: Collection of facts PLI
type: Class
subclass of: Constructieonderdeel
subclass of: Restriction
  author of change: Marinus Vonhof
  date of change: 2014-12-03
  author at start life: Marinus Vonhof
  date of start life: 2013-02-05
  validity context: *t
  on class: Mechanische afsluiter
  on property: has as part (inverse)
  qualified cardinality: 1
subclass of: Restriction
  author at start life: Marinus Vonhof
  date of start life: 2018-12-05
  validity context: *t
  on class: Bedieningswijze
  on property: has as aspect
  qualified cardinality: 1
subclass of: Restriction
  on property: heeft Functie
  has value: BedienenAfsluiter
subclass of: Restriction
  on class: Elektriciteitskast
  on property: is connected to
  max qualified cardinality: 1

Mechanische afsluiter
author of change: Marinus Vonhof
author of change: Johan Post
author of change: Wouter van Riel
date of change: 2026-05-21
date of change: 2024-04-22
date of change: 2019-07-11
definition: Een doorlaat met een voorziening om de stroming te regelen
author at start life: Marinus Vonhof
date of start life: 2019-05-15
validity context: 14f
alternative label: Mechanische doorlaat
scope note: Collection of facts MDS
scope note: Collection of facts REV
scope note: Collection of facts PLI
scope note: Collection of facts HYD
scope note: Collection of facts DMO
type: Class
subclass of: Doorlaat
subclass of: Restriction
  author of change: Marinus Vonhof
  date of change: 2014-12-03
  author at start life: Marinus Vonhof
  date of start life: 2013-02-05
  on class: Afsluiteraandrijving
  on property: has as part
  max qualified cardinality: 1
subclass of: Restriction
  author of change: Marinus Vonhof
  date of change: 2016-04-13
  author at start life: Marinus Vonhof
  date of start life: 2013-02-05
  on class: Standmeter
  on property: has as part
  max qualified cardinality: 1
subclass of: Restriction
  author of change: Marinus Vonhof
  date of change: 2019-05-15
  author at start life: Marinus Vonhof
  date of start life: 2013-02-05
  on class: Identificatie telemetriesysteem
  on property: has as aspect
  max qualified cardinality: 1
subclass of: Restriction
  author of change: Marinus Vonhof
  date of change: 2019-05-15
  author at start life: Marinus Vonhof
  date of start life: 2013-02-05
  on class: Niveau benedenstrooms openen
  on property: has as aspect
  max qualified cardinality: 1
subclass of: Restriction
  author of change: Marinus Vonhof
  date of change: 2019-05-15
  author at start life: Marinus Vonhof
  date of start life: 2013-02-05
  on class: Niveau benedenstrooms sluiten
  on property: has as aspect
  max qualified cardinality: 1
subclass of: Restriction
  author of change: Marinus Vonhof
  date of change: 2019-05-15
  author at start life: Marinus Vonhof
  date of start life: 2013-02-05
  on class: Niveau bovenstrooms openen
  on property: has as aspect
  max qualified cardinality: 1
subclass of: Restriction
  author of change: Marinus Vonhof
  date of change: 2019-05-15
  author at start life: Marinus Vonhof
  date of start life: 2013-02-05
  on class: Niveau bovenstrooms sluiten
  on property: has as aspect
  max qualified cardinality: 1
subclass of: Restriction
  author of change: Marinus Vonhof
  date of change: 2019-05-15
  author at start life: Marinus Vonhof
  date of start life: 2013-02-05
  on class: Serienummer
  on property: has as aspect
  max qualified cardinality: 1
subclass of: Restriction
  author of change: Marinus Vonhof
  date of change: 2019-05-15
  author at start life: Marinus Vonhof
  date of start life: 2013-02-05
  on class: Stopcode stroomgroep
  on property: has as aspect
  max qualified cardinality: 1
subclass of: Restriction
  author of change: Marinus Vonhof
  date of change: 2019-05-15
  author at start life: Marinus Vonhof
  date of start life: 2013-03-26
  on class: Service mechanisch
  on property: has as input (inverse)
  max qualified cardinality: 1
subclass of: Restriction
  author of change: Marinus Vonhof
  date of change: 2019-05-16
  author at start life: Marinus Vonhof
  date of start life: 2014-04-29
  on class: Bijzondere putconstructie
  on property: has as part (inverse)
  max qualified cardinality: 1
subclass of: Restriction
  author of change: Marinus Vonhof
  date of change: 2020-04-17
  author at start life: Marinus Vonhof
  date of start life: 2014-12-02
  on class: Transportleiding
  on property: is connected to
  max qualified cardinality: 2
subclass of: Restriction
  author of change: Marinus Vonhof
  date of change: 2019-05-15
  author at start life: Nic Roest (Idoro)
  date of start life: 2007-11-29
  on class: Besturingskast
  on property: is connected to
  max qualified cardinality: 1
subclass of: Restriction
  author at start life: Johan Post
  date of start life: 2026-05-21
  on class: Bufferput
  on property: has as part (inverse)
  max qualified cardinality: 1
subclass of: Restriction
  author at start life: Marinus Vonhof
  date of start life: 2018-12-06
  on class: Standaard afsluiterstand
  on property: has as aspect
  max qualified cardinality: 1
subclass of: Restriction
  author at start life: Marinus Vonhof
  date of start life: 2020-04-17
  on class: Fabricaat
  on property: has as aspect
  max qualified cardinality: 1
subclass of: Restriction
  author at start life: Wouter van Riel
  date of start life: 2022-09-26
  on class: Overstortput
  on property: has as part (inverse)
  max qualified cardinality: 1
subclass of: Restriction
  author at start life: Wouter van Riel
  date of start life: 2024-04-22
  on class: Materiaal afsluiter
  on property: has as aspect
  max qualified cardinality: 1
subclass of: Restriction
  author at start life: Wouter van Riel
  date of start life: 2024-04-23
  on class: Energieverliescoëfficiënt
  on property: has as aspect
  max qualified cardinality: 1
subclass of: Restriction
  on property: heeft Technologie
  has value: Mechanisch

Bedieningswijze
author of change: Marinus Vonhof
date of change: 2025-01-16
date of change: 2024-12-16
definition: [IMBOR] Categorisering van de wijze waarop het object bediend kan worden.
author at start life: Marinus Vonhof
date of start life: 2018-12-10
alternative label: Type bediening
comment: [is aspect]
scope note: Collection of facts BAS
scope note: Collection of facts PLI
type: Class
subclass of: Kenmerk
subclass of: Restriction
  author at start life: Marinus Vonhof
  date of start life: 2018-12-05
  on class: Afsluiteraandrijving
  on property: has as aspect (inverse)
  qualified cardinality: 1
subclass of: Restriction
  on property: has as reference (qualification)
  all values from: Bedieningswijze (coll)

Afsluitstuk (eindkap)
author of change: Marinus Vonhof
date of change: 2017-12-13
definition: Een hulpstuk bestemd voor het afsluiten van een leiding.
author at start life: Finy Teitsma (Oranjewoud)
date of start life: 2006-11-29
alternative label: Eindkap
scope note: Collection of facts MDS
scope note: Collection of facts PLI
scope note: Collection of facts HYD
type: Class
subclass of: Hulpstuk
subclass of: Restriction
  on property: heeft Functie
  has value: AfsluitenVanLeidingen

Hulpstuk
author of change: Marinus Vonhof
author of change: Johan Post
author of change: Wouter van Riel
date of change: 2025-01-16
date of change: 2022-09-30
date of change: 2026-05-18
date of change: 2021-09-24
definition: [NEN 3300:1996] Verzamelnaam voor een constructieonderdeel van de riolering met een speciaal doel, zoals verloopstuk, overgangsstuk, ontstoppingsstuk
author at start life: Marinus Vonhof
date of start life: 2017-12-13
validity context: *f
scope note: Collection of facts MDS
scope note: Collection of facts LDR
scope note: Collection of facts REV
scope note: Collection of facts PLI
scope note: Collection of facts HYD
type: Class
subclass of: Constructieonderdeel
subclass of: Restriction
  author of change: Marinus Vonhof
  date of change: 2017-12-13
  author at start life: Marinus Vonhof
  date of start life: 2013-03-29
  validity context: 5t 10t 11t 14t
  on class: Hulpstukoriëntatie
  on property: has as aspect
  max qualified cardinality: 1
subclass of: Restriction
  author at start life: Johan Post
  date of start life: 2026-05-18
  on class: Lengte hulpstuk
  on property: has as aspect
  max qualified cardinality: 1
subclass of: Restriction
  author at start life: Marinus Vonhof
  date of start life: 2018-10-27
  on class: NLCS_DRAINAGE_HULPSTUK
  on property: is represented by
  max qualified cardinality: 1
subclass of: Restriction
  author at start life: Marinus Vonhof
  date of start life: 2018-10-27
  on class: NLCS_GWA_HULPSTUK
  on property: is represented by
  max qualified cardinality: 1
subclass of: Restriction
  author at start life: Marinus Vonhof
  date of start life: 2018-10-27
  on class: NLCS_HWA_HULPSTUK
  on property: is represented by
  max qualified cardinality: 1
subclass of: Restriction
  author at start life: Marinus Vonhof
  date of start life: 2018-10-27
  on class: NLCS_ITR_HULPSTUK
  on property: is represented by
  max qualified cardinality: 1
subclass of: Restriction
  author at start life: Marinus Vonhof
  date of start life: 2018-10-27
  on class: NLCS_PERSLEIDING_HULPSTUK
  on property: is represented by
  max qualified cardinality: 1
subclass of: Restriction
  author at start life: Marinus Vonhof
  date of start life: 2018-10-27
  on class: NLCS_SWA_HULPSTUK
  on property: is represented by
  max qualified cardinality: 1
subclass of: Restriction
  author at start life: Marinus Vonhof
  date of start life: 2018-10-27
  on class: NLCS_VACUUMLEIDING_HULPSTUK
  on property: is represented by
  max qualified cardinality: 1
subclass of: Restriction
  author at start life: Marinus Vonhof
  date of start life: 2018-10-27
  on class: NLCS_VWA_HULPSTUK
  on property: is represented by
  max qualified cardinality: 1
subclass of: Restriction
  author at start life: Marinus Vonhof
  date of start life: 2021-08-05
  validity context: 5t
  on class: Materiaal hulpstuk
  on property: has as aspect
  max qualified cardinality: 1
subclass of: Restriction
  on property: heeft Toepassing
  has value: OnderdeelVanEenLeiding
subclass of: Restriction
  on class: Breedte hulpstuk
  on property: has as aspect
  max qualified cardinality: 1
subclass of: Restriction
  on class: Hoogte hulpstuk
  on property: has as aspect
  max qualified cardinality: 1
subclass of: Restriction
  on class: Diameter hulpstuk
  on property: has as aspect
  min qualified cardinality: 0

Afstand tot beginpunt
author of change: Marinus Vonhof
date of change: 2025-01-16
definition: [IMBOR] Afstand van de inlaat van de leiding tot het beginpunt.
author at start life: Marinus Vonhof
date of start life: 2013-02-05
units of measurements: m
comment: [is aspect]
scope note: Collection of facts BAS
scope note: Collection of facts PLI
type: Class
subclass of: Afstand
subclass of: Restriction
  author at start life: Marinus Vonhof
  date of start life: 2013-02-05
  on class: Inlaat leiding
  on property: has as aspect (inverse)
  max qualified cardinality: 1
subclass of: Restriction
  on property: has as value
  all values from: decimal

Inlaat leiding
author of change: Marinus Vonhof
author of change: Johan Post
date of change: 2025-01-16
date of change: 2021-10-01
definition: [IMBOR] Een toegangsopening die een leiding toegankelijk maakt voor de door de leiding vervoerde substantie.
author at start life: Marinus Vonhof
date of start life: 2013-02-05
scope note: Collection of facts MDS
scope note: Collection of facts LDR
scope note: Collection of facts REV
scope note: Collection of facts MTR
type: Class
subclass of: Inlaat
subclass of: Restriction
  author of change: Marinus Vonhof
  date of change: 2019-05-15
  author at start life: Finy Teitsma (Oranjewoud)
  date of start life: 2006-07-12
  on class: Vrijverval rioolleiding
  on property: has as part (inverse)
  qualified cardinality: 1
subclass of: Restriction
  author at start life: Marinus Vonhof
  date of start life: 2013-02-05
  on class: Afstand tot beginpunt
  on property: has as aspect
  max qualified cardinality: 1
subclass of: Restriction
  author at start life: Marinus Vonhof
  date of start life: 2013-02-05
  on class: Afstand tot eindpunt
  on property: has as aspect
  max qualified cardinality: 1
subclass of: Restriction
  on property: heeft Uitvoering
  has value: VerbondenMetLeiding
subclass of: Restriction
  on class: Sym_Inlaat
  on property: is represented by
  max qualified cardinality: 1

Afstand tot bovenzijde put
author of change: Marinus Vonhof
date of change: 2025-01-16
definition: [IMBOR] Afstand van de inlaat van de rioolput tot de bovenzijde van de rioolput.
author at start life: Marinus Vonhof
date of start life: 2013-02-05
units of measurements: m
comment: [is aspect]
scope note: Collection of facts BAS
type: Class
subclass of: Afstand
subclass of: Restriction
  author at start life: Marinus Vonhof
  date of start life: 2013-02-05
  on class: Inlaat rioolput
  on property: has as aspect (inverse)
  max qualified cardinality: 1
subclass of: Restriction
  on property: has as value
  all values from: decimal

Inlaat rioolput
author of change: Marinus Vonhof
author of change: Johan Post
date of change: 2025-01-16
date of change: 2021-10-01
definition: [IMBOR] Een toegangsopening die een put toegankelijk maakt voor de door de put geleide substantie.
author at start life: Marinus Vonhof
date of start life: 2013-02-05
scope note: Collection of facts MDS
scope note: Collection of facts LDR
scope note: Collection of facts REV
scope note: Collection of facts MTR
type: Class
subclass of: Inlaat
subclass of: Restriction
  author of change: Marinus Vonhof
  date of change: 2019-05-15
  author at start life: Finy Teitsma (Oranjewoud)
  date of start life: 2006-07-12
  on class: Inspectieput
  on property: has as part (inverse)
  qualified cardinality: 1
subclass of: Restriction
  author at start life: Marinus Vonhof
  date of start life: 2013-02-05
  on class: Afstand tot bovenzijde put
  on property: has as aspect
  max qualified cardinality: 1
subclass of: Restriction
  on property: heeft Uitvoering
  has value: VerbondenMetRioolput
subclass of: Restriction
  on class: Sym_Inlaat
  on property: is represented by
  max qualified cardinality: 1

Afstand tot eindpunt
author of change: Marinus Vonhof
date of change: 2025-01-16
definition: [IMBOR] Afstand van de inlaat van de leiding tot het eindpunt.
author at start life: Marinus Vonhof
date of start life: 2013-02-05
units of measurements: m
comment: [is aspect]
scope note: Collection of facts BAS
type: Class
subclass of: Afstand
subclass of: Restriction
  author at start life: Marinus Vonhof
  date of start life: 2013-02-05
  on class: Inlaat leiding
  on property: has as aspect (inverse)
  max qualified cardinality: 1
subclass of: Restriction
  on property: has as value
  all values from: decimal

Grondslag maatregel (coll)
validity context: 6d
comment: [is coll]
scope note: Collection of facts BAS
scope note: Collection of facts MTR
type: Class
subclass of: Verzameling soorten
subclass of: Class
  one of: Detailbeoordeling
  one of: AfstemmenOpWegbeheer
  one of: VerbeterenSysteem
  one of: VasteFrequentie

Afstroomplaat
definition: verharde plaat rondom een slokop om begroeiing en erosie te voorkomen
author at start life: Johan Post
date of start life: 2026-05-01
scope note: Collection of facts MDS
scope note: Collection of facts REV
type: Class
subclass of: Afdekking
subclass of: Restriction
  on property: heeft Functie
  has value: BeschermenTegenBegroeiing

Afvalwater
label: Wastewater @en
author of change: Marinus Vonhof
author of change: Johan Post
date of change: 2017-09-08
date of change: 2024-04-30
definition: [EN 16323:2014] Water composed of any combination of water discharged from domestic, industrial or commercial premises, surface run-off and accidentally any sewer infiltration water @en
definition: [NEN 3300:1996] Alle water waarvan de houder zich - met het oog op de verwijdering daarvan - ontdoet, voornemens is zich te ontdoen of zich moet ontdoen (Opmerking: hieronder wordt dus ook afvloeiend regenwater begrepen)
definition: [NEN-EN 752:2008] Water dat is samengesteld uit een willekeurige combinatie van water dat uit woningen of uit industriële of commerciële gebouwen wordt geloosd, afstromend hemelwater en water dat onbedoeld in de riolering binnendringt [EN 1085:2007, definitie 1010]
author at start life: Marinus Vonhof
date of start life: 2014-11-29
scope note: Collection of facts BAS
scope note: Collection of facts DMO
type: Class
subclass of: Water

Water
author of change: Marinus Vonhof
date of change: 2017-09-08
author at start life: Marinus Vonhof
date of start life: 2014-11-30
scope note: Collection of facts MDS
scope note: Collection of facts DMO
type: Class
subclass of: Materie

Afvalwatersysteem
label: Wastewater system @en
author of change: Marinus Vonhof
date of change: 2015-05-25
definition: [EN 16323:2014] system providing the functions of collection transport treatment and discharge of wastewater @en
definition: [NEN-EN 752:2008] Systemen die voor inzameling en transport van afvalwater en ander afstromend hemelwater in een stedelijk gebied worden gebruikt
author at start life: Marinus Vonhof
date of start life: 2015-05-25
see also: [GFO/RIO2] Stelsel van (technische) voorzieningen bestemd voor de inzameling, het transport en de tijdelijke berging van afvalwater
alternative label: Rioolsysteem
scope note: Collection of facts BAS
type: Class
subclass of: Systeem
subclass of: Restriction
  author of change: Marinus Vonhof
  date of change: 2014-04-29
  author at start life: Marinus Vonhof
  date of start life: 2013-10-02
  on class: Stedelijk gebied
  on property: has as part (inverse)
  max qualified cardinality: 1
subclass of: Restriction
  author at start life: Marinus Vonhof
  date of start life: 2014-04-29
  on class: RTC-sturing
  on property: has as input (inverse)
  max qualified cardinality: 1
subclass of: Restriction
  author at start life: Marinus Vonhof
  date of start life: 2016-04-15
  on class: Gescheiden systeem
  on property: has as part
  min qualified cardinality: 0
subclass of: Restriction
  author at start life: Marinus Vonhof
  date of start life: 2022-10-04
  on class: Transportstelsel
  on property: has as part
  min qualified cardinality: 0
subclass of: Restriction
  author at start life: Marinus Vonhof
  date of start life: 2022-10-04
  on class: Rioolstelsel
  on property: has as part
  min qualified cardinality: 1
subclass of: Restriction
  on property: heeft Functie
  has value: InzamelingVanAfvalwater
subclass of: Restriction
  on property: heeft Functie
  has value: TransportVanAfvalwater

Systeem
author of change: Marinus Vonhof
date of change: 2015-05-25
date of change: 2022-10-01
definition: De fysieke samenstelling van stelsels en inrichtingen die een functionele eenheid vormen
author at start life: Marinus Vonhof
date of start life: 2013-10-02
validity context: *f 10d 13d 14d 15d
scope note: Collection of facts TOP
type: Class
subclass of: Fysiek object
subclass of: Restriction
  author of change: Marinus Vonhof
  date of change: 2018-05-01
  author at start life: Marinus Vonhof
  date of start life: 2018-04-29
  on class: Verbeteren
  on property: has as input (inverse)
  qualified cardinality: 1
subclass of: Restriction
  author at start life: Marinus Vonhof
  date of start life: 2020-04-20
  on class: Gebiedsoriëntatie
  on property: has as aspect
  max qualified cardinality: 1
subclass of: Restriction
  on property: heeft Uitvoering
  has value: GeheelVanStelsels

Stedelijk gebied
author of change: Marinus Vonhof
date of change: 2025-01-16
date of change: 2020-04-18
definition: [IMBOR] Een urbane regio of stadsgewest: een gebied met een ten opzichte van de omgeving verhoogde urbanisatiegraad.
definition: [Omgevingswet] Dicht bebouwd gebied; het kan gaan om woongebieden en bedrijventerreinen of een mengvorm daarvan
author at start life: Marinus Vonhof
date of start life: 2012-04-29
see also: [Saniwijzer] Steden en dorpen met een hogere adressendichtheid dan 1000 adressen per vierkante kilometer. Kantoren- en industrieterreinen vallen in onze definitie ook onder stedelijk gebied
scope note: Collection of facts BAS
type: Class
subclass of: Gebied
subclass of: Restriction
  author of change: Marinus Vonhof
  date of change: 2013-10-02
  author at start life: Finy Teitsma (Oranjewoud)
  date of start life: 2007-10-23
  on class: Grondwatersysteem
  on property: has as part
  min qualified cardinality: 0
subclass of: Restriction
  author of change: Marinus Vonhof
  date of change: 2014-04-29
  author at start life: Marinus Vonhof
  date of start life: 2013-10-02
  on class: Afvalwatersysteem
  on property: has as part
  min qualified cardinality: 0
subclass of: Restriction
  author at start life: Marinus Vonhof
  date of start life: 2013-10-02
  on class: Oppervlaktewatersysteem
  on property: has as part
  min qualified cardinality: 0

RTC-sturing
label: Real-time-control @en
author of change: Marinus Vonhof
date of change: 2022-09-30
date of change: 2016-04-29
definition: Een geautomatiseerde besturingsmethode van rioolstelsels, pompen, gemalen en stuwen, gebaseerd op het continu waarnemen, vanuit een centrale post
definition: [NEN 3300:1996] Sturing van afvalwaterstromen gebaseerd op het continu waarnemen, registreren en verwerken van (meet)gegevens
author at start life: Finy Teitsma (Oranjewoud)
date of start life: 2007-10-23
scope note: Collection of facts BAS
type: Class
subclass of: Systeem
subclass of: Restriction
  author at start life: Marinus Vonhof
  date of start life: 2014-04-29
  on class: Afvalwatersysteem
  on property: has as input
  max qualified cardinality: 1
subclass of: Restriction
  on property: heeft Toepassing
  has value: Besturen
subclass of: Restriction
  on property: heeft Technologie
  has value: ContinuWaarnemenVanuitEenCentralePost
subclass of: Restriction
  on property: heeft Mechanisme
  has value: Meetinstrument

Gescheiden systeem
author of change: Eric van Gorkom
date of change: 2022-09-27
definition: Een samengesteld vrijverval rioolstelsel waarin het vuilwater en hemelwater gescheiden van elkaar wordt ingezameld en getransporteerd.
definition: [NEN 3300:1996] rioolstelsel, waarbij afvalwater exclusief neerslag door een leidingstelsel wordt getransporteerd en neerslag door een afzonderlijk leidingstelsel rechtstreeks naar oppervlaktewater wordt afgevoerd
definition: [NEN-EN 752:2008] riolering die gewoonlijk bestaat uit twee leidingstelsels, waarbij het ene stelsel afvalwater en het andere afgestroomd hemelwater transporteert [EN1085:2007, definitie 2120]
author at start life: Nic Roest (Idoro)
date of start life: 2007-11-29
alternative label: Gescheiden rioolstelsel
alternative label: Volledig gescheiden stelsel
scope note: Collection of facts BAS
scope note: Collection of facts DMO
type: Class
subclass of: Systeem
subclass of: Restriction
  author of change: Marinus Vonhof
  date of change: 2018-12-13
  author at start life: Finy Teitsma (Oranjewoud)
  date of start life: 2007-11-29
  on class: Hemelwaterstelsel
  on property: has as part
  min qualified cardinality: 1
subclass of: Restriction
  author of change: Marinus Vonhof
  date of change: 2016-04-22
  author at start life: Nic Roest (Idoro)
  date of start life: 2007-11-29
  on class: Vuilwaterstelsel
  on property: has as part
  min qualified cardinality: 1
subclass of: Restriction
  author at start life: Marinus Vonhof
  date of start life: 2016-04-15
  on class: Afvalwatersysteem
  on property: has as part (inverse)
  max qualified cardinality: 1
subclass of: Restriction
  on property: heeft Uitvoering
  has value: Gescheiden
subclass of: Restriction
  on property: heeft Doel
  has value: VerminderenVuilbelastingVanOppervlaktewater
subclass of: Restriction
  on class: Sym_GescheidenSysteem
  on property: is represented by
  max qualified cardinality: 1

Transportstelsel
author of change: Marinus Vonhof
date of change: 2025-01-16
date of change: 2024-05-16
date of change: 2022-10-01
definition: [IMBOR] Voorzieningen voor het transport van afvalwater.
author at start life: Marinus Vonhof
date of start life: 2014-12-02
validity context: *f
scope note: Collection of facts TOP
type: Class
subclass of: Stelsel
subclass of: Restriction
  author of change: Marinus Vonhof
  date of change: 2015-03-01
  author at start life: Marinus Vonhof
  date of start life: 2014-10-14
  on class: Overnamepunt
  on property: has as part
  max qualified cardinality: 1
subclass of: Restriction
  author at start life: Marinus Vonhof
  date of start life: 2018-12-06
  on class: Zuiveringseenheid
  on property: has as part (inverse)
  max qualified cardinality: 1
subclass of: Restriction
  on property: heeft Functie
  has value: TransportVanAfvalwater

Rioolstelsel
label: Sewer system @en
definition: [EN 16323:2014] network of pipelines and ancillary works that conveys wastewater from drains to a treatment plant or other place of disposal @en
definition: [NEN 3300:1996] Het geheel aan voorzieningen voor de inzameling en het transport van afvalwater met uitzondering van zuiveringstechnische werken
definition: [NEN 3300:1996] Samenhangend geheel van riolen en rioolputten en de bijbehorende voorzieningen voor de inzameling en het transport van afvalwater
author at start life: Marinus Vonhof
date of start life: 2014-12-02
validity context: *f
alternative label: Riolering
alternative label: Rioleringsnet
scope note: Collection of facts TOP
type: Class
subclass of: Stelsel
subclass of: Restriction
  author of change: Marinus Vonhof
  date of change: 2016-04-24
  author at start life: Marinus Vonhof
  date of start life: 2014-11-30
  on class: Rioleringsgebied
  on property: has as part (inverse)
  max qualified cardinality: 1
subclass of: Restriction
  author at start life: Marinus Vonhof
  date of start life: 2017-12-12
  on class: Hydraulisch rioleringsmodel
  on property: is represented by
  max qualified cardinality: 1
subclass of: Restriction
  on property: heeft Functie
  has value: InzamelingVanAfvalwater
subclass of: Restriction
  on property: heeft Functie
  has value: TransportVanAfvalwater

Drainagestelsel
author of change: Marinus Vonhof
author of change: Johan Post
date of change: 2016-08-25
date of change: 2026-05-18
date of change: 2022-10-01
definition: Een netwerk van drains voor het op peil houden van het grondwater door exfiltratie
definition: [EN 16323:2014] operation consisting of the removal of a fluid volume
author at start life: Marinus Vonhof
date of start life: 2014-04-11
validity context: 10d
alternative label: Drainage
alternative label: Ontwateringsstelsel
scope note: Collection of facts BAS
type: Class
subclass of: Stelsel
subclass of: Restriction
  author of change: Marinus Vonhof
  date of change: 2014-09-02
  date of change: 2023-01-12
  author at start life: Finy Teitsma (Oranjewoud)
  date of start life: 2007-10-23
  on class: Drain
  on property: has as part
  min qualified cardinality: 1
subclass of: Restriction
  author of change: Marinus Vonhof
  date of change: 2014-09-05
  author at start life: Finy Teitsma (Oranjewoud)
  date of start life: 2006-11-29
  on class: Grondwatersysteem
  on property: has as part (inverse)
  qualified cardinality: 1
subclass of: Restriction
  author of change: Marinus Vonhof
  date of change: 2020-04-17
  author at start life: Marinus Vonhof
  date of start life: 2019-05-15
  on class: Infiltratiekoffer
  on property: has as part
  min qualified cardinality: 0
subclass of: Restriction
  author at start life: Marinus Vonhof
  date of start life: 2016-04-20
  on class: Drainagelaag
  on property: has as part
  max qualified cardinality: 1
subclass of: Restriction
  author at start life: Marinus Vonhof
  date of start life: 2018-05-03
  on class: Drainagegemaal
  on property: has as part
  max qualified cardinality: 1
subclass of: Restriction
  on property: heeft Toepassing
  has value: BeheersingVanGrondwaterpeil
subclass of: Restriction
  on property: heeft Functie
  has value: InzamelingVanGrondwater
subclass of: Restriction
  on property: heeft Functie
  has value: TransportVanGrondwater
subclass of: Restriction
  on class: DIT-riool
  on property: has as part
  min qualified cardinality: 0
subclass of: Restriction
  on class: DT-riool
  on property: has as part
  min qualified cardinality: 0
subclass of: Restriction
  on class: Drainageput
  on property: has as part
  min qualified cardinality: 0
subclass of: Restriction
  on class: Hemelwaterriool
  on property: has as part
  min qualified cardinality: 0
subclass of: Restriction
  on class: Inspectieput
  on property: has as part
  min qualified cardinality: 0
subclass of: Restriction
  on class: Lozingsput
  on property: has as part
  min qualified cardinality: 0
subclass of: Restriction
  on class: Pompput
  on property: has as part
  min qualified cardinality: 0
subclass of: Restriction
  on class: Verzameldrain
  on property: has as part
  min qualified cardinality: 0

Drukriolering
author of change: Johan Post
date of change: 2021-10-01
date of change: 2026-05-18
definition: [NEN 3300:1996] Overdrukriolering is synoniem van drukriolering
definition: [NEN 3300:1996] Riolering waarbij het transport plaatsvindt door middel van overdruk
author at start life: Marinus Vonhof
date of start life: 2012-04-29
validity context: 1d 12d
see also: [NEN-EN 1671:1996] Een systeem voor transport van vervuild huishoudelijk afvalwater met een enkele drukleiding of een netwerk van drukleidingen. Het punt van lozen is het punt waar het totale debiet van het drukrioleringssysteem terugkeert naar atmosferische druk
alternative label: Drukrioleringsstelsel
alternative label: Overdrukriolering
scope note: Collection of facts MDS
scope note: Collection of facts RGM
scope note: Collection of facts DMO
type: Class
subclass of: Mechanisch rioolstelsel
subclass of: Restriction
  author of change: Marinus Vonhof
  date of change: 2020-04-17
  author at start life: Marinus Vonhof
  date of start life: 2013-09-14
  on class: Pompunit
  on property: has as part
  min qualified cardinality: 1
subclass of: Restriction
  author of change: Marinus Vonhof
  date of change: 2020-04-17
  author at start life: Marinus Vonhof
  date of start life: 2014-04-30
  on class: Drukleiding
  on property: has as part
  min qualified cardinality: 1
subclass of: Restriction
  author at start life: Marinus Vonhof
  date of start life: 2018-05-03
  on class: Centrale verdeelkast
  on property: has as part
  min qualified cardinality: 0
subclass of: Restriction
  on property: heeft Technologie
  has value: TransportOnderOverdruk
subclass of: Restriction
  on class: Sym_Drukriolering
  on property: is represented by
  max qualified cardinality: 1

Luchtpersriolering
author of change: Marinus Vonhof
author of change: Johan Post
date of change: 2021-08-05
date of change: 2026-05-18
author at start life: Marinus Vonhof
date of start life: 2014-10-29
validity context: 1d 12d
see also: [NEN-EN 1671:1996 (in de lijn van)] Een systeem voor transport van vervuild huishoudelijk afvalwater en bedrijfs- afvalwater waarbij het afvalwater met behulp van lucht onder overdruk in een enkele drukleiding of een netwerk van drukleidingen wordt gebracht. Het punt van lozen is het punt waar het totale debiet van het drukrioleringssysteem terugkeert naar atmosferische druk.
scope note: Collection of facts MDS
scope note: Collection of facts RGM
scope note: Collection of facts DMO
type: Class
subclass of: Mechanisch rioolstelsel
subclass of: Restriction
  author of change: Marinus Vonhof
  date of change: 2018-11-07
  author at start life: Marinus Vonhof
  date of start life: 2018-05-03
  on class: Luchtpersgemaal
  on property: has as part
  qualified cardinality: 1
subclass of: Restriction
  author of change: Marinus Vonhof
  date of change: 2018-11-07
  author at start life: Marinus Vonhof
  date of start life: 2018-05-03
  on class: Luchtpersleiding
  on property: has as part
  qualified cardinality: 1
subclass of: Restriction
  author at start life: Marinus Vonhof
  date of start life: 2020-04-17
  on class: Centrale verdeelkast
  on property: has as part
  min qualified cardinality: 0
subclass of: Restriction
  on property: heeft Technologie
  has value: TransportOnderOverdruk

Persleidingstelsel
author of change: Johan Post
date of change: 2026-05-21
date of change: 2021-10-01
date of change: 2024-04-30
definition: Een netwerk met een enkele persleiding of meerdere persleidingen voor transport van afvalwater.
author at start life: Marinus Vonhof
date of start life: 2014-12-02
validity context: 1d 12d
alternative label: Persleidingsysteem
scope note: Collection of facts MDS
scope note: Collection of facts PLI
scope note: Collection of facts RGM
scope note: Collection of facts DMO
type: Class
subclass of: Transportstelsel
subclass of: Restriction
  author of change: Marinus Vonhof
  date of change: 2015-03-01
  author at start life: Marinus Vonhof
  date of start life: 2012-04-29
  on class: Ontluchtingsleiding
  on property: has as part
  min qualified cardinality: 0
subclass of: Restriction
  author of change: Marinus Vonhof
  date of change: 2018-05-03
  author at start life: Marinus Vonhof
  date of start life: 2012-04-29
  on class: Waterslagvoorziening
  on property: has as part
  min qualified cardinality: 0
subclass of: Restriction
  author at start life: Marinus Vonhof
  date of start life: 2014-12-02
  on class: Persleiding
  on property: has as part
  min qualified cardinality: 1
subclass of: Restriction
  author at start life: Marinus Vonhof
  date of start life: 2014-12-02
  on class: Rioolgemaal
  on property: has as part
  min qualified cardinality: 1
subclass of: Restriction
  author at start life: Marinus Vonhof
  date of start life: 2014-12-02
  on class: Afvalwatersysteem
  on property: has as part (inverse)
  qualified cardinality: 1
subclass of: Restriction
  author at start life: Marinus Vonhof
  date of start life: 2014-12-02
  on class: Lozingspunt
  on property: has as part
  qualified cardinality: 1
subclass of: Restriction
  on property: heeft Technologie
  has value: TransportOnderOverdruk
subclass of: Restriction
  on class: Pigging-installatie
  on property: has as part
  max qualified cardinality: 1
subclass of: Restriction
  on class: Sym_Persleidingsysteem
  on property: is represented by
  max qualified cardinality: 1

Vacuümriolering
author of change: Johan Post
date of change: 2021-10-01
date of change: 2026-05-18
definition: [NEN 3300:1996] Onderdrukriolering is synoniem van vacuümriolering
definition: [NEN 3300:1996] Riolering waarbij het transport plaatsvindt door onderdruk
author at start life: Marinus Vonhof
date of start life: 2012-04-29
validity context: 1d 12d
comment: 20151014: NEN3300-definitie aangepast
see also: [NEN-EN 1671:1996 (in de lijn van)] Een systeem voor transport van vervuild huishoudelijk afvalwater en bedrijfs- afvalwater met een enkele onderdrukleiding of een netwerk van onderdrukleidingen. Het punt van lozen is het punt waar het totale debiet van het vacuümrioleringssysteem terugkeert naar atmosferische druk
alternative label: Onderdrukriolering
scope note: Collection of facts MDS
scope note: Collection of facts RGM
scope note: Collection of facts DMO
type: Class
subclass of: Mechanisch rioolstelsel
subclass of: Restriction
  author of change: Marinus Vonhof
  date of change: 2016-04-22
  author at start life: Marinus Vonhof
  date of start life: 2013-09-14
  on class: Bufferput
  on property: has as part
  min qualified cardinality: 0
subclass of: Restriction
  author at start life: Marinus Vonhof
  date of start life: 2013-09-14
  on class: Vacuümleiding
  on property: has as part
  min qualified cardinality: 1
subclass of: Restriction
  author at start life: Marinus Vonhof
  date of start life: 2013-09-14
  on class: Vacuümpompstation
  on property: has as part
  min qualified cardinality: 1
subclass of: Restriction
  author at start life: Marinus Vonhof
  date of start life: 2020-04-17
  on class: Centrale verdeelkast
  on property: has as part
  min qualified cardinality: 0
subclass of: Restriction
  on property: heeft Technologie
  has value: TransportOnderOnderdruk
subclass of: Restriction
  on class: Sym_Vacuumriolering
  on property: is represented by
  max qualified cardinality: 1
subclass of: Restriction
  on class: Datakabel
  on property: has as part
  min qualified cardinality: 0

Afvalwatertransportwerk
author of change: Marinus Vonhof
date of change: 2020-11-23
date of change: 2022-10-04
author at start life: Marinus Vonhof
date of start life: 2014-11-28
validity context: 6d
see also: [IRIS-RIOKEN:2012] Een verbinding met dezelfde diameter (segmenten) tussen gemeentelijke riolen en rioolwaterzuiveringsinstallaties alsmede zuiveringswerken niet zijnde rioolwaterzuiveringsinstallaties (persleidingen c.a., ontluchtingspunten, overstortpunten en rioolgemalen).
scope note: Collection of facts BAS
type: Class
subclass of: Systeem
subclass of: Restriction
  on property: heeft Functie
  has value: VerbindenRioleringMetZuiveringswerk

Afvloeiend hemelwater
author of change: Marinus Vonhof
author of change: Eric van Gorkom
date of change: 2021-09-11
date of change: 2022-12-24
definition: [NEN 3300:1996] de hoeveelheid afvalwater die per tijdseenheid in een regenweersituatie via het rioolstelsel wordt afgevoerd
definition: [NEN-EN 752:2008] water afkomstig van neerslag die van een oppervlak naar een aansluitleiding, riool of ontvangend water stroomt
definition: [Waterwet] Soort afvalwater
notation: HWA
author at start life: Finy Teitsma (Oranjewoud)
date of start life: 2007-10-24
alternative label: Afstromend hemelwater
alternative label: Blauw afvalwater
alternative label: HWA
alternative label: Hemelwaterafvoer
alternative label: RWA
scope note: Collection of facts BAS
scope note: Collection of facts DMO
type: Class
subclass of: Afvalwater

Afvloeiingscoëfficiënt
label: Runoff coefficient @en
definition: [EN 16323:2014] factor dependent on the ground catchment, and by which the rainwater quantity per unit of time is multiplied in order to indicate the flow expected to be carried to the drain or sewer system @en
definition: [NEN 3300:1996] coëfficiënt toegepast op het, volgens de berekening, aangenomen naar de riolering afvoerende oppervlak
definition: [NEN-EN 752:2008] factor die afhankelijk is van het afvoerend oppervlak en waarmee de hoeveelheid regenwater per tijdseenheid moet worden vermenigvuldigd om de verwachte instroom naar het systeem van aansluitleidingen of de buitenriolering af te schatten
author at start life: Johan Post
date of start life: 2026-05-21
comment: [is aspect]
scope note: Collection of facts HYD
type: Class
subclass of: Kenmerk
subclass of: Restriction
  on property: has as value
  all values from: Afvloeiingscoëfficiënt (datatype)

Afvoer DWA-situatie
author of change: Johan Post
date of change: 2022-11-27
date of change: 2024-05-02
definition: Som van DWA-debiet en DWA-debiet van invoerende afvoerpunten
author at start life: Marinus Vonhof
date of start life: 2020-11-25
units of measurements: m3/h
validity context: 10d 15d
comment: [is aspect]
scope note: Collection of facts BAS
scope note: Collection of facts PLI
scope note: Collection of facts DMO
type: Class
subclass of: Kenmerk
subclass of: Restriction
  author at start life: Marinus Vonhof
  date of start life: 2021-05-14
  on class: Inwinning
  on property: has as aspect
  max qualified cardinality: 1
subclass of: Restriction
  on property: has as value
  all values from: decimal
subclass of: Restriction
  on class: Transportleiding
  on property: has as aspect (inverse)
  max qualified cardinality: 1

Transportleiding
author of change: Marinus Vonhof
author of change: Johan Post
author of change: Wouter van Riel
date of change: 2025-01-16
date of change: 2024-04-23
date of change: 2026-05-13
date of change: 2025-04-02
definition: [IMBOR] Leiding met als functie de voortgeleiding van materie met mechanische en vrijverval leidingen als subtypen.
author at start life: Marinus Vonhof
date of start life: 2014-12-02
validity context: *f
scope note: Collection of facts TOP
type: Class
subclass of: Leiding
subclass of: Restriction
  author of change: 2026-05-13
  author at start life: Johan Post
  on class: Leidingvlak
  on property: has as part
  min qualified cardinality: 0
subclass of: Restriction
  author of change: Marinus Vonhof
  date of change: 2020-04-17
  author at start life: Marinus Vonhof
  date of start life: 2014-12-02
  on class: Mechanische afsluiter
  on property: is connected to
  max qualified cardinality: 2
subclass of: Restriction
  author of change: Marinus Vonhof
  date of change: 2026-08-04
  author at start life: Marinus Vonhof
  date of start life: 2018-12-05
  on class: Voorzorgsmaatregel-document
  on property: is represented by
  max qualified cardinality: 1
subclass of: Restriction
  author of change: Marinus Vonhof
  date of change: 2024-07-16
  author at start life: Wouter van Riel
  date of start life: 2024-04-23
  on class: Coating
  on property: has as part
  max qualified cardinality: 1
subclass of: Restriction
  author at start life: Marinus Vonhof
  date of start life: 2018-10-27
  on class: NLCS_TRANSPORTLEIDING
  on property: is represented by
  max qualified cardinality: 1
subclass of: Restriction
  author at start life: Marinus Vonhof
  date of start life: 2024-05-16
  on class: Drukklasse
  on property: has as aspect
  max qualified cardinality: 1
subclass of: Restriction
  author at start life: Marinus Vonhof
  date of start life: 2024-05-16
  on class: Kathodische bescherming
  on property: has as aspect
  max qualified cardinality: 1
subclass of: Restriction
  author at start life: Marinus Vonhof
  date of start life: 2024-05-16
  on class: Kleur
  on property: has as aspect
  max qualified cardinality: 1
subclass of: Restriction
  author at start life: Marinus Vonhof
  date of start life: 2024-05-16
  on class: Rioolafsluiter
  on property: has as part
  max qualified cardinality: 1
subclass of: Restriction
  author at start life: Marinus Vonhof
  date of start life: 2024-05-16
  on class: SDR-waarde
  on property: has as aspect
  max qualified cardinality: 1
subclass of: Restriction
  author at start life: Marinus Vonhof
  date of start life: 2026-07-20
  on class: Doorlaat
  on property: has as part
  min qualified cardinality: 0
subclass of: Restriction
  author at start life: Wouter van Riel
  date of start life: 2024-04-23
  on class: Deelliner
  on property: has as part
  min qualified cardinality: 0
subclass of: Restriction
  validity context: 13t 14t
  on class: Afvoer DWA-situatie
  on property: has as aspect
  min qualified cardinality: 0
subclass of: Restriction
  validity context: 13t 14t
  on class: Afvoer HWA-situatie
  on property: has as aspect
  min qualified cardinality: 0
subclass of: Restriction
  on property: heeft Functie
  has value: TransportVanAfvalwater
subclass of: Restriction
  on class: Overnamepunt
  on property: has as part
  max qualified cardinality: 1
subclass of: Restriction
  on class: Beluchter
  on property: has as part
  min qualified cardinality: 0
subclass of: Restriction
  on class: Buisdeel
  on property: has as part
  min qualified cardinality: 0
subclass of: Restriction
  on class: Compensator
  on property: has as part
  min qualified cardinality: 0
subclass of: Restriction
  on class: Mangat
  on property: has as part
  min qualified cardinality: 0
subclass of: Restriction
  on class: Verbindingsstuk
  on property: has as part
  min qualified cardinality: 0

Afvoer HWA-situatie
author of change: Marinus Vonhof
author of change: Johan Post
date of change: 2022-11-27
date of change: 2024-05-02
date of change: 2023-01-13
definition: Dit is de gesommeerde afvoer van het DWA-debiet, pompovercapaciteit en invoerende afvoerpunten
author at start life: Marinus Vonhof
date of start life: 2020-11-25
units of measurements: m3/h
validity context: 10d 15d
comment: [is aspect]
scope note: Collection of facts BAS
scope note: Collection of facts PLI
scope note: Collection of facts DMO
type: Class
subclass of: Kenmerk
subclass of: Restriction
  author at start life: Marinus Vonhof
  date of start life: 2021-05-14
  on class: Inwinning
  on property: has as aspect
  max qualified cardinality: 1
subclass of: Restriction
  on property: has as value
  all values from: decimal
subclass of: Restriction
  on class: Transportleiding
  on property: has as aspect (inverse)
  max qualified cardinality: 1

Afvoercoëfficiënt
label: Discharge coefficient @en
author of change: Johan Post
date of change: 2026-05-21
definition: factor om de afvoer onder ideale omstandigheden voor verliezen door randcondities, stromingsweerstand en geometrie te corrigeren
author at start life: Marinus Vonhof
date of start life: 2011-12-15
comment: [is aspect]
scope note: Collection of facts MDS
scope note: Collection of facts HYD
type: Class
subclass of: Kenmerk
subclass of: Restriction
  author of change: Marinus Vonhof
  date of change: 2019-03-20
  author at start life: Marinus Vonhof
  date of start life: 2011-12-15
  validity context: 5t 11t
  on class: Stuwmuur
  on property: has as aspect (inverse)
  max qualified cardinality: 1
subclass of: Restriction
  author at start life: Marinus Vonhof
  date of start life: 2015-09-20
  validity context: 5t 11t
  on class: Overstortdrempel
  on property: has as aspect (inverse)
  max qualified cardinality: 1
subclass of: Restriction
  on property: has as value
  all values from: Afvoercoëfficiënt (datatype)

Stuwmuur
author of change: Marinus Vonhof
author of change: Johan Post
date of change: 2025-01-16
date of change: 2024-05-01
date of change: 2015-07-28
date of change: 2026-07-02
definition: [IMBOR] Een onderdeel bestaande uit muur die als functie heeft het keren van water.
author at start life: Marinus Vonhof
date of start life: 2013-09-28
comment: Als de stuwmuur geen drempniveau heeft is er geen overstort mogelijk, er wordt van uitgegaan dat de muur tot aan de bovenzijde van de put reikt.
scope note: Collection of facts MDS
scope note: Collection of facts REV
scope note: Collection of facts HYD
scope note: Collection of facts DMO
type: Class
subclass of: Wand
subclass of: Restriction
  author of change: Johan Post
  date of change: 2022-11-25
  on class: Drempeldikte
  on property: has as aspect
  max qualified cardinality: 1
subclass of: Restriction
  author of change: Marinus Vonhof
  date of change: 2019-03-20
  author at start life: Marinus Vonhof
  date of start life: 2011-12-15
  validity context: 5t 11t 14t
  on class: Afvoercoëfficiënt
  on property: has as aspect
  max qualified cardinality: 1
subclass of: Restriction
  author of change: Marinus Vonhof
  date of change: 2026-07-20
  author at start life: Marinus Vonhof
  date of start life: 2019-03-20
  comment: Temporeel kenmerk, met kenmerk Inwinning
  on class: Drempelniveau
  on property: has as aspect
  min qualified cardinality: 0
subclass of: Restriction
  author at start life: Johan Post
  date of start life: 2026-07-02
  on class: Vorm drempel in bovenaanzicht
  on property: has as aspect
  max qualified cardinality: 1
subclass of: Restriction
  author at start life: Marinus Vonhof
  date of start life: 2017-03-29
  on class: Stuwconstructie
  on property: has as part (inverse)
  qualified cardinality: 1
subclass of: Restriction
  author at start life: Marinus Vonhof
  date of start life: 2017-12-07
  on class: Stuwput
  on property: has as part (inverse)
  qualified cardinality: 1
subclass of: Restriction
  author at start life: Marinus Vonhof
  date of start life: 2019-03-20
  validity context: 11t 14t
  on class: Vrije overstorthoogte
  on property: has as aspect
  max qualified cardinality: 1
subclass of: Restriction
  author at start life: Marinus Vonhof
  date of start life: 2019-03-20
  validity context: 5t 11t 14t
  on class: Drempelbreedte
  on property: has as aspect
  max qualified cardinality: 1
subclass of: Restriction
  author at start life: Marinus Vonhof
  date of start life: 2019-03-20
  validity context: 5t 11t 14t
  on class: Stromingsrichting
  on property: has as aspect
  max qualified cardinality: 1
subclass of: Restriction
  author at start life: Marinus Vonhof
  date of start life: 2019-03-20
  on class: Vorm drempel
  on property: has as aspect
  max qualified cardinality: 1
subclass of: Restriction
  on property: heeft Functie
  has value: KerenVanWater

Overstortdrempel
author of change: Marinus Vonhof
author of change: Johan Post
date of change: 2025-01-16
date of change: 2024-05-01
date of change: 2026-07-02
definition: [IMBOR] De bovenste rand van een constructie om pieken in water toevoer te regelen, door water over deze rand te storten wanneer de toegevoerde waterhoeveelheid een bepaald volume overschrijdt.
notation: OVS
author at start life: Marinus Vonhof
date of start life: 2011-12-15
validity context: 1d
scope note: Collection of facts MDS
scope note: Collection of facts REV
scope note: Collection of facts HYD
scope note: Collection of facts DMO
type: Class
subclass of: Wand
subclass of: Restriction
  author of change: Johan Post
  date of change: 2022-11-25
  on class: Drempeldikte
  on property: has as aspect
  max qualified cardinality: 1
subclass of: Restriction
  author of change: Marinus Vonhof
  date of change: 2015-07-28
  author at start life: Finy Teitsma (Oranjewoud)
  date of start life: 2006-02-25
  on class: Vorm drempel
  on property: has as aspect
  max qualified cardinality: 1
subclass of: Restriction
  author of change: Marinus Vonhof
  date of change: 2019-09-02
  author at start life: Finy Teitsma (Oranjewoud)
  date of start life: 2006-02-25
  validity context: 12t
  comment: Temporeel kenmerk, met kenmerk Inwinning
  on class: Drempelniveau
  on property: has as aspect
  min qualified cardinality: 1
subclass of: Restriction
  author of change: Marinus Vonhof
  date of change: 2021-08-06
  author at start life: Finy Teitsma (Oranjewoud)
  date of start life: 2006-02-25
  on class: Overstortput
  on property: has as part (inverse)
  qualified cardinality: 1
subclass of: Restriction
  author of change: Marinus Vonhof
  date of change: 2017-12-07
  author at start life: Marinus Vonhof
  date of start life: 2011-12-15
  validity context: 5t 11t 14t
  on class: Stromingsrichting
  on property: has as aspect
  max qualified cardinality: 1
subclass of: Restriction
  author of change: Marinus Vonhof
  date of change: 2017-12-07
  author at start life: Marinus Vonhof
  date of start life: 2015-09-20
  validity context: 11t 14t
  on class: Vrije overstorthoogte
  on property: has as aspect
  max qualified cardinality: 1
subclass of: Restriction
  author of change: Marinus Vonhof
  date of change: 2021-08-05
  author at start life: Marinus Vonhof
  date of start life: 2015-05-29
  on class: Overstortconstructie
  on property: has as part (inverse)
  qualified cardinality: 1
subclass of: Restriction
  author at start life: Finy Teitsma (Oranjewoud)
  date of start life: 2006-02-25
  validity context: 5t 11t 14t
  on class: Drempelbreedte
  on property: has as aspect
  max qualified cardinality: 1
subclass of: Restriction
  author at start life: Johan Post
  date of start life: 2026-07-02
  on class: Vorm drempel in bovenaanzicht
  on property: has as aspect
  max qualified cardinality: 1
subclass of: Restriction
  author at start life: Marinus Vonhof
  date of start life: 2015-09-20
  validity context: 5t 11t 14t
  on class: Afvoercoëfficiënt
  on property: has as aspect
  max qualified cardinality: 1
subclass of: Restriction
  author at start life: Marinus Vonhof
  date of start life: 2019-05-15
  on class: Slokop
  on property: has as part (inverse)
  qualified cardinality: 1
subclass of: Restriction
  on property: heeft Functie
  has value: KerenVanWater

Afvoerend oppervlak
label: Catchment area @en
author of change: Marinus Vonhof
author of change: Wouter van Riel
date of change: 2014-05-11
date of change: 2024-04-20
definition: Het oppervlak van de bovenlaag dat water afvoert naar het object
definition: [EN 16323:2014] area draining to a drain, sewer or watercourse @en
definition: [NEN 3300:1996] het naar de riolering afwaterende oppervlak
author at start life: Marinus Vonhof
date of start life: 2011-12-15
units of measurements: m2
validity context: 1d 3d 10d 12d 15d
comment: [is aspect]
scope note: Collection of facts MDS
scope note: Collection of facts HYD
scope note: Collection of facts DMO
type: Class
subclass of: Kenmerk
subclass of: Restriction
  author of change: Marinus Vonhof
  date of change: 2018-05-03
  author at start life: Marinus Vonhof
  date of start life: 2014-12-02
  validity context: 5t 11t
  on class: Rioolput
  on property: has as aspect (inverse)
  max qualified cardinality: 1
subclass of: Restriction
  author of change: Marinus Vonhof
  date of change: 2018-05-03
  author at start life: Marinus Vonhof
  date of start life: 2014-12-02
  on class: Compartiment
  on property: has as aspect (inverse)
  max qualified cardinality: 1
subclass of: Restriction
  author at start life: Marinus Vonhof
  date of start life: 2017-08-31
  validity context: 5t 11t
  on class: Gemengd riool
  on property: has as aspect (inverse)
  max qualified cardinality: 1
subclass of: Restriction
  author at start life: Marinus Vonhof
  date of start life: 2017-08-31
  validity context: 5t 11t
  on class: Hemelwaterriool
  on property: has as aspect (inverse)
  max qualified cardinality: 1
subclass of: Restriction
  author at start life: Marinus Vonhof
  date of start life: 2019-05-15
  validity context: 5t 11t
  on class: Open leiding
  on property: has as aspect (inverse)
  max qualified cardinality: 1
subclass of: Restriction
  date of change: 2022-11-25
  on class: Inwinning
  on property: has as aspect
  max qualified cardinality: 1
subclass of: Restriction
  on property: has as value
  all values from: decimal

Open leiding
author of change: Marinus Vonhof
date of change: 2019-04-30
definition: Een rioolleiding waarvan de bovenzijde niet is afgesloten.
notation: OPL
author at start life: Marinus Vonhof
author at start life: Finy Teitsma (Oranjewoud)
date of start life: 2006-03-23
validity context: *f
scope note: Collection of facts MDS
scope note: Collection of facts REV
scope note: Collection of facts HYD
type: Class
subclass of: Leiding
subclass of: Restriction
  author of change: Marinus Vonhof
  date of change: 2022-10-02
  author at start life: Marinus Vonhof
  date of start life: 2019-05-15
  on class: Afvoerend oppervlak
  on property: has as aspect
  max qualified cardinality: 12
subclass of: Restriction
  author at start life: Marinus Vonhof
  date of start life: 2019-05-15
  on class: Profiel open leiding
  on property: has as aspect
  max qualified cardinality: 1
subclass of: Restriction
  on property: heeft Structuur
  has value: Open

Afvoerend oppervlak hellend
author of change: Marinus Vonhof
date of change: 2016-04-24
definition: Afvoerend oppervlak met een helling groter dan 4%
author at start life: Marinus Vonhof
date of start life: 2011-12-15
units of measurements: m2
comment: [is aspect]
scope note: Collection of facts MDS
scope note: Collection of facts HYD
type: Class
subclass of: Afvoerend oppervlak
subclass of: Restriction
  on property: has as value
  all values from: decimal

Afvoerend oppervlak vlak
definition: Afvoerend oppervlak met een helling kleiner of gelijk aan 4% en anders dan vlak uitgestrekt afvoerend oppervlak
author at start life: Marinus Vonhof
date of start life: 2011-12-15
units of measurements: m2
comment: [is aspect]
scope note: Collection of facts MDS
scope note: Collection of facts HYD
type: Class
subclass of: Afvoerend oppervlak
subclass of: Restriction
  on property: has as value
  all values from: decimal

Afvoerend oppervlak vlak uitgestrekt
author of change: Marinus Vonhof
date of change: 2016-04-24
definition: Oppervlak met een afstroomlengte naar het lozingspunt op het rioolstelsel die groter is dan 100 m. Bijvoorbeeld: platte daken van fabrieken of parkeerplaatsen.
author at start life: Marinus Vonhof
date of start life: 2011-12-15
units of measurements: m2
comment: [is aspect]
scope note: Collection of facts MDS
scope note: Collection of facts HYD
type: Class
subclass of: Afvoerend oppervlak
subclass of: Restriction
  on property: has as value
  all values from: decimal

Afvoerkromme
definition: [NEN 3300:1996] De grafiek die het verband aangeeft tussen de grootte van de afvoer van bijvoorbeeld regenwater en de tijd
author at start life: Marinus Vonhof
date of start life: 2022-09-30
validity context: *d
scope note: Collection of facts BAS
type: Class
subclass of: NEN 3300 Term

Representatie fysiek object
author of change: Marinus Vonhof
date of change: 2017-12-12
date of change: 2024-07-17
definition: Een topologisch element met als enige functie het dragen van de geometrie voor het representeren van fysieke objecten. Het vormt dus geen onderdeel van een netwerkdefinitie
author at start life: Marinus Vonhof
date of start life: 2013-02-03
scope note: Collection of facts TOP
type: Class
subclass of: Topologisch element

Zuiveringseenheid
author of change: Johan Post
date of change: 2024-05-01
date of change: 2021-10-01
author at start life: Marinus Vonhof
date of start life: 2015-06-02
validity context: 1d
comment: Voorkeursterm was Zuiveringsgebied (t/m versie 1.4). URI blijft Zuiveringsgebied
see also: [SWWB] Een afbakening van de zone, waarbinnen al het afvalwater naar eenzelfde rioolwaterzuivering wordt afgevoerd om daar gezuiverd te worden. Locaties die niet op het riool zijn aangesloten vallen binnen het vlak, maar zijn dus in werkelijkheid niet aangesloten. De grenzen van het gebied hoeven zich niet te beperken tot de gemeente- en waterschapsgrenzen.
alternative label: Zuiveringsgebied
alternative label: Zuiveringskring
scope note: Collection of facts BAS
scope note: Collection of facts DMO
type: Class
subclass of: Gebied
subclass of: Restriction
  author of change: Marinus Vonhof
  date of change: 2018-04-23
  author at start life: Marinus Vonhof
  date of start life: 2015-07-08
  on class: Transportsysteem
  on property: has as part
  min qualified cardinality: 0
subclass of: Restriction
  author of change: Marinus Vonhof
  date of change: 2018-12-06
  author at start life: Marinus Vonhof
  date of start life: 2015-06-02
  on class: Rioleringsgebied
  on property: has as part
  min qualified cardinality: 1
subclass of: Restriction
  author at start life: Marinus Vonhof
  date of start life: 2015-06-02
  on class: RWZI
  on property: has as part
  qualified cardinality: 1
subclass of: Restriction
  author at start life: Marinus Vonhof
  date of start life: 2015-07-23
  on class: Code
  on property: has as aspect
  max qualified cardinality: 1
subclass of: Restriction
  author at start life: Marinus Vonhof
  date of start life: 2018-12-06
  on class: Transportstelsel
  on property: has as part
  min qualified cardinality: 0
subclass of: Restriction
  on class: Sym Zuiveringseenheid
  on property: is represented by
  max qualified cardinality: 1

Eigenaar
author of change: Marinus Vonhof
author of change: Wouter van Riel
date of change: 2025-01-16
date of change: 2022-08-12
definition: Degene die als natuurlijk persoon handelende in de uitoefening van een beroep of bedrijf dan wel als rechtspersoon iets in eigendom heeft
definition: [IMBOR] (Rechts)persoon die het meest omvattend recht op een zaak heeft. De typen eigenaren zijn conform de indeling in bronhouders (BGT).
author at start life: Marinus Vonhof
date of start life: 2017-05-31
scope note: Collection of facts BAS
scope note: Collection of facts DMO
type: Class
subclass of: Levensvorm
subclass of: Restriction
  author at start life: Marinus Vonhof
  date of start life: 2017-05-31
  on class: Fysiek object
  on property: has as input
  min qualified cardinality: 0

Gebied
author of change: Marinus Vonhof
date of change: 2017-11-16
date of change: 2024-11-22
author at start life: Marinus Vonhof
date of start life: 2014-11-29
validity context: *f
see also: [IRIS-RIOKEN:2012] Het geheel van virtuele en fysieke (aanwijsbare) opdelingen en indelingen van het aardoppervlak.
alternative label: Ruimtelijk gebied
scope note: Collection of facts TOP
type: Class
subclass of: Ruimte
subclass of: Restriction
  author of change: Marinus Vonhof
  date of change: 2016-11-09
  author at start life: Marinus Vonhof
  date of start life: 2015-07-28
  on class: Gebiedsoriëntatie
  on property: has as aspect
  max qualified cardinality: 1

Reservoir
author of change: Marinus Vonhof
author of change: Wouter van Riel
date of change: 2025-01-16
date of change: 2024-04-22
date of change: 2017-08-21
definition: Constructies met een specifieke functie binnen het rioolstelsel.
definition: Een natuurlijk of kunstmatig gebied dat gebruikt wordt om water op te slaan
author at start life: Marinus Vonhof
date of start life: 2013-03-30
validity context: *f 12f 13d
scope note: Collection of facts TOP
type: Class
subclass of: Bouwwerk
subclass of: Restriction
  author of change: Marinus Vonhof
  date of change: 2018-05-03
  author at start life: Marinus Vonhof
  date of start life: 2017-08-19
  on class: Compartiment
  on property: has as part
  min qualified cardinality: 0
subclass of: Restriction
  author at start life: Marinus Vonhof
  date of start life: 2018-12-06
  on class: Bergend oppervlak
  on property: has as aspect
  max qualified cardinality: 1
subclass of: Restriction
  author at start life: Marinus Vonhof
  date of start life: 2026-07-24
  on class: WIBON thema
  on property: has as aspect
  max qualified cardinality: 1
subclass of: Restriction
  on property: heeft Uitvoering
  has value: NatuurlijkOfKunstmatigGebied
subclass of: Restriction
  on property: heeft Functie
  has value: OpslagVanWater

Stelsel
author of change: Marinus Vonhof
date of change: 2025-01-16
date of change: 2014-12-02
date of change: 2022-10-01
definition: Een netwerk van leidingen en aanverwante constructies
author at start life: Marinus Vonhof
date of start life: 2012-04-29
validity context: *f
scope note: Collection of facts TOP
type: Class
subclass of: Fysiek object
subclass of: Restriction
  author of change: Marinus Vonhof
  date of change: 2018-11-06
  author at start life: Marinus Vonhof
  date of start life: 2014-11-30
  on class: Meetinstrument
  on property: has as part
  min qualified cardinality: 0
subclass of: Restriction
  author at start life: Marinus Vonhof
  date of start life: 2019-05-15
  on class: Afwateringsgebied
  on property: has as part (inverse)
  max qualified cardinality: 1
subclass of: Restriction
  author at start life: Marinus Vonhof
  date of start life: 2019-05-15
  on class: Registratief gebied
  on property: has as part (inverse)
  max qualified cardinality: 1
subclass of: Restriction
  author at start life: Marinus Vonhof
  date of start life: 2020-04-20
  validity context: 14t
  on class: Gebiedsoriëntatie
  on property: has as aspect
  max qualified cardinality: 1
subclass of: Restriction
  on property: heeft Uitvoering
  has value: NetwerkVanVerbondenKnooppunten

Verbinding
author of change: Marinus Vonhof
date of change: 2024-07-17
date of change: 2017-12-22
definition: De verbinding van de knopen binnen de netwerkdefinitie
author at start life: Marinus Vonhof
date of start life: 2013-09-03
see also: [SUF-HYD 1.10] Een stroomvoerend element
scope note: Collection of facts TOP
type: Class
subclass of: Edge

Lijn
author of change: Marinus Vonhof
author of change: Johan Post
date of change: 2019-05-15
date of change: 2024-05-02
definition: Eéndimensionaal geometrisch element. Voor geografische beschrijvingen conform het coordinatenstelsel EPSG:7415 (x/y conform EPSG:28992, optioneel z conform EPSG:5709).
author at start life: Marinus Vonhof
date of start life: 2016-11-09
units of measurements: gml
comment: [is aspect]
scope note: Collection of facts TOP
type: Class
subclass of: Geometrie
subclass of: Restriction
  author of change: Marinus Vonhof
  date of change: 2020-04-18
  author at start life: Marinus Vonhof
  date of start life: 2016-11-09
  on class: Leidingoriëntatie
  on property: has as aspect (inverse)
  max qualified cardinality: 1
subclass of: Restriction
  author at start life: Marinus Vonhof
  date of start life: 2020-04-18
  on class: Kabeloriëntatie
  on property: has as aspect (inverse)
  max qualified cardinality: 1
subclass of: Restriction
  on property: has as value
  all values from: gmlLiteral
subclass of: Restriction
  on class: Constructieonderdeeloriëntatie
  on property: has as aspect (inverse)
  max qualified cardinality: 1

Afwateringsgebied
author of change: Marinus Vonhof
date of change: 2015-07-08
definition: [NEN-EN 752:2008] naar een aansluitleiding, riool of waterloop afwaterend gebied [EN 1085:2007, definitie 1270]
author at start life: Marinus Vonhof
date of start life: 2013-05-10
validity context: *d
see also: [IHW:20130706] een gebied begrenst door (stroom)scheidingen, waaruit beschouwd vanuit het afvoerpunt het water van dat gebied afstroomt of via bemaling getransporteerd wordt naar het desbetreffende afvoerpunt [INSPIRE]
alternative label: Stroomgebied
scope note: Collection of facts MDS
type: Class
subclass of: Gebied
subclass of: Restriction
  author of change: Marinus Vonhof
  date of change: 2015-07-28
  author at start life: Marinus Vonhof
  date of start life: 2014-04-29
  on class: Afwateringssysteem
  on property: has as part
  min qualified cardinality: 0
subclass of: Restriction
  author at start life: Marinus Vonhof
  date of start life: 2015-07-23
  on class: Code
  on property: has as aspect
  max qualified cardinality: 1
subclass of: Restriction
  author at start life: Marinus Vonhof
  date of start life: 2019-05-15
  on class: Bouwwerk
  on property: has as part
  min qualified cardinality: 0
subclass of: Restriction
  author at start life: Marinus Vonhof
  date of start life: 2019-05-15
  on class: Leiding
  on property: has as part
  min qualified cardinality: 0
subclass of: Restriction
  author at start life: Marinus Vonhof
  date of start life: 2019-05-15
  on class: Put
  on property: has as part
  min qualified cardinality: 0
subclass of: Restriction
  author at start life: Marinus Vonhof
  date of start life: 2019-05-15
  on class: Stelsel
  on property: has as part
  min qualified cardinality: 0

Afwateringssysteem
author of change: Marinus Vonhof
date of change: 2013-10-02
definition: [NEN-EN 752:2008] natuurlijk of kunstmatig systeem voor de afwatering van een gebied
author at start life: Marinus Vonhof
date of start life: 2013-05-10
validity context: *d
scope note: Collection of facts BAS
type: Class
subclass of: Oppervlaktewatersysteem
subclass of: Restriction
  author of change: Marinus Vonhof
  date of change: 2015-07-28
  author at start life: Marinus Vonhof
  date of start life: 2014-04-29
  on class: Afwateringsgebied
  on property: has as part (inverse)
  max qualified cardinality: 1
subclass of: Restriction
  on property: heeft Functie
  has value: AfvoerVanHemelwater

Code
author of change: Marinus Vonhof
date of change: 2015-07-23
definition: Unieke verkorte aanduiding
author at start life: Nic Roest (Idoro)
date of start life: 2006-02-21
validity context: 15d
comment: [is aspect]
scope note: Collection of facts MDS
scope note: Collection of facts DMO
type: Class
subclass of: Unieke identificatie
subclass of: Restriction
  author at start life: Marinus Vonhof
  date of start life: 2015-07-23
  on class: Afwateringsgebied
  on property: has as aspect (inverse)
  max qualified cardinality: 1
subclass of: Restriction
  author at start life: Marinus Vonhof
  date of start life: 2015-07-23
  on class: Rioleringsgebied
  on property: has as aspect (inverse)
  max qualified cardinality: 1
subclass of: Restriction
  author at start life: Marinus Vonhof
  date of start life: 2015-07-23
  on class: Zuiveringseenheid
  on property: has as aspect (inverse)
  max qualified cardinality: 1
subclass of: Restriction
  author at start life: Marinus Vonhof
  date of start life: 2015-07-23
  on class: RWZI
  on property: has as aspect (inverse)
  qualified cardinality: 1

Bouwwerk
author of change: Marinus Vonhof
author of change: Johan Post
author of change: Eric van Gorkom
date of change: 2025-01-16
date of change: 2024-05-01
date of change: 2021-11-23
definition: [IMBOR] Gegevens die specifiek zijn voor een met de aarde verbonden duurzaam constructie, dat niet valt onder de definities van een pand of kunstwerk.
definition: [Omgevingswet] Constructie van enige omvang van hout, steen, metaal of ander materiaal, die op de plaats van bestemming hetzij direct of indirect met de grond verbonden is, hetzij direct of indirect steun vindt in of op de grond, bedoeld om ter plaatse te functioneren, met inbegrip van de daarvan deel uitmakende bouwwerkgebonden installaties
author at start life: Marinus Vonhof
date of start life: 2016-04-20
validity context: *f
scope note: Collection of facts TOP
type: Class
subclass of: Fysiek object
subclass of: Restriction
  author of change: Marinus Vonhof
  date of change: 2017-08-21
  author at start life: Finy Teitsma (Oranjewoud)
  date of start life: 2006-02-25
  validity context: 5t 11t 14t
  comment: Vorm = niet rond
  on class: Breedte bouwwerk
  on property: has as aspect
  max qualified cardinality: 1
subclass of: Restriction
  author of change: Marinus Vonhof
  date of change: 2017-08-21
  author at start life: Finy Teitsma (Oranjewoud)
  date of start life: 2006-02-25
  validity context: 5t 11t
  comment: Vorm = niet rond
  on class: Lengte bouwwerk
  on property: has as aspect
  max qualified cardinality: 1
subclass of: Restriction
  author of change: Marinus Vonhof
  date of change: 2017-08-21
  author at start life: Finy Teitsma (Oranjewoud)
  date of start life: 2006-02-25
  validity context: 5t 11t
  on class: Vorm bouwwerk
  on property: has as aspect
  max qualified cardinality: 1
subclass of: Restriction
  author of change: Marinus Vonhof
  date of change: 2017-08-21
  author at start life: Finy Teitsma (Oranjewoud)
  date of start life: 2006-02-25
  on class: Hoogte bouwwerk
  on property: has as aspect
  max qualified cardinality: 1
subclass of: Restriction
  author of change: Marinus Vonhof
  date of change: 2018-05-03
  author at start life: Marinus Vonhof
  date of start life: 2017-08-19
  validity context: 5t 10t 11t 14t
  on class: Bouwwerkoriëntatie
  on property: has as aspect
  max qualified cardinality: 1
subclass of: Restriction
  author of change: Marinus Vonhof
  date of change: 2018-12-05
  author at start life: Marinus Vonhof
  date of start life: 2018-09-03
  on class: Straat
  on property: has as part (inverse)
  max qualified cardinality: 1
subclass of: Restriction
  author of change: Marinus Vonhof
  date of change: 2018-12-06
  author at start life: Marinus Vonhof
  date of start life: 2014-12-02
  on class: Status functioneren
  on property: has as aspect
  max qualified cardinality: 1
subclass of: Restriction
  author of change: Marinus Vonhof
  date of change: 2021-08-06
  date of change: 2026-07-23
  author at start life: Marinus Vonhof
  date of start life: 2018-12-12
  on class: Revisietekening
  on property: is represented by
  min qualified cardinality: 0
subclass of: Restriction
  author at start life: Finy Teitsma (Oranjewoud)
  date of start life: 2006-02-25
  on property: has as aspect
  some values from: Breedte bouwwerk
subclass of: Restriction
  author at start life: Finy Teitsma (Oranjewoud)
  date of start life: 2006-02-25
  on property: has as aspect
  some values from: Hoogte bouwwerk
subclass of: Restriction
  author at start life: Finy Teitsma (Oranjewoud)
  date of start life: 2006-02-25
  on property: has as aspect
  some values from: Vorm bouwwerk
subclass of: Restriction
  author at start life: Marinus Vonhof
  date of start life: 2017-08-21
  validity context: 5t 11t 14t
  on class: Materiaal bouwwerk
  on property: has as aspect
  max qualified cardinality: 1
subclass of: Restriction
  author at start life: Marinus Vonhof
  date of start life: 2017-08-21
  on property: has as aspect
  some values from: Materiaal bouwwerk
subclass of: Restriction
  author at start life: Marinus Vonhof
  date of start life: 2018-09-03
  on class: Ondergrond
  on property: has as part (inverse)
  max qualified cardinality: 1
subclass of: Restriction
  author at start life: Marinus Vonhof
  date of start life: 2018-12-06
  on class: Fundering
  on property: has as part
  max qualified cardinality: 1
subclass of: Restriction
  author at start life: Marinus Vonhof
  date of start life: 2018-12-12
  on class: Registratief gebied
  on property: has as part (inverse)
  max qualified cardinality: 1
subclass of: Restriction
  author at start life: Marinus Vonhof
  date of start life: 2019-05-15
  on class: Afwateringsgebied
  on property: has as part (inverse)
  max qualified cardinality: 1
subclass of: Restriction
  on property: heeft Uitvoering
  has value: ConstructieVanEnigeOmvang
subclass of: Restriction
  on property: heeft Uitvoering
  has value: VerbondenMetDeGrond
subclass of: Restriction
  on class: Theoretische levensduur
  on property: has as aspect
  max qualified cardinality: 1

Oppervlaktewatersysteem
author of change: Marinus Vonhof
date of change: 2018-12-05
definition: [Omgevingswet] Een samenhangend geheel van 1 of meer oppervlaktewaterlichamen en grondwaterlichamen, met bijbehorende bergingsgebieden, waterkeringen en ondersteunende kunstwerken
author at start life: Marinus Vonhof
date of start life: 2018-12-05
scope note: Collection of facts BAS
type: Class
subclass of: Systeem
subclass of: Restriction
  author of change: Marinus Vonhof
  date of change: 2019-04-30
  author at start life: Finy Teitsma (Oranjewoud)
  date of start life: 2007-10-24
  on class: Goot
  on property: has as part
  min qualified cardinality: 0
subclass of: Restriction
  author of change: Marinus Vonhof
  date of change: 2016-04-22
  author at start life: Marinus Vonhof
  date of start life: 2014-04-30
  on class: Bergingsvijver
  on property: has as part
  min qualified cardinality: 0
subclass of: Restriction
  author of change: Marinus Vonhof
  date of change: 2016-04-28
  author at start life: Marinus Vonhof
  date of start life: 2012-04-29
  on class: Waterkering
  on property: has as part
  min qualified cardinality: 0
subclass of: Restriction
  author at start life: Marinus Vonhof
  date of start life: 2012-04-29
  on class: Duiker
  on property: has as part
  min qualified cardinality: 0
subclass of: Restriction
  author at start life: Marinus Vonhof
  date of start life: 2012-04-29
  on class: Waterloop
  on property: has as part
  min qualified cardinality: 0
subclass of: Restriction
  author at start life: Marinus Vonhof
  date of start life: 2013-10-02
  on class: Stedelijk gebied
  on property: has as part (inverse)
  max qualified cardinality: 1
subclass of: Restriction
  on property: heeft Functie
  has value: OpslagVanOppervlaktewater
subclass of: Restriction
  on property: heeft Functie
  has value: TransportVanOppervlaktewater

Afzetting
definition: [NEN 3300:1996] Aankoeking van slib, vet en kalk op de buiswand; tevens afzetting van bodemmateriaal anders dan zand ter plaatse van een buisverbinding of scheur
author at start life: Marinus Vonhof
date of start life: 2022-09-30
validity context: *d
scope note: Collection of facts BAS
type: Class
subclass of: NEN 3300 Term

Reinigen vrijverval leiding
author of change: Marinus Vonhof
date of change: 2018-05-01
author at start life: Marinus Vonhof
date of start life: 2014-12-23
scope note: Collection of facts MDS
scope note: Collection of facts RRB
scope note: Collection of facts LDR
scope note: Collection of facts MTR
scope note: Collection of facts DMO
type: Class
subclass of: Reinigen
subclass of: Restriction
  author of change: Marinus Vonhof
  date of change: 2019-04-04
  author at start life: Marinus Vonhof
  date of start life: 2014-12-23
  validity context: 2t
  on class: Vrijverval rioolleiding
  on property: has as input
  qualified cardinality: 1
subclass of: Restriction
  author at start life: Marinus Vonhof
  date of start life: 2014-12-23
  validity context: *t
  comment: Relatie (kardinaliteit) uitgeschakeld voor CFK's (SHACL-syntax) (20260403) (20260824)
  on class: Vrijverval rioolleiding
  on property: has as output
  qualified cardinality: 1
subclass of: Restriction
  author at start life: Marinus Vonhof
  date of start life: 2014-12-23
  on class: Reinigingsproject riolering
  on property: has as part (inverse)
  qualified cardinality: 1
subclass of: Restriction
  author at start life: Marinus Vonhof
  date of start life: 2015-10-26
  on class: Inspectieproject riolering
  on property: has as part (inverse)
  qualified cardinality: 1
subclass of: Restriction
  author at start life: Marinus Vonhof
  date of start life: 2020-04-20
  on class: Voegmateriaal
  on property: has as output
  max qualified cardinality: 1
subclass of: Restriction
  on property: heeft Functie
  has value: AfstromingHerstellen

Reinigen rioolput
author of change: Marinus Vonhof
date of change: 2018-05-01
author at start life: Marinus Vonhof
date of start life: 2014-12-23
scope note: Collection of facts MDS
scope note: Collection of facts RRB
scope note: Collection of facts LDR
scope note: Collection of facts MTR
scope note: Collection of facts DMO
type: Class
subclass of: Reinigen
subclass of: Restriction
  author of change: Marinus Vonhof
  date of change: 2019-04-04
  author at start life: Marinus Vonhof
  date of start life: 2014-12-23
  on class: Rioolput
  on property: has as input
  qualified cardinality: 1
subclass of: Restriction
  author at start life: Marinus Vonhof
  date of start life: 2014-12-23
  validity context: *t
  comment: Relatie (kardinaliteit) uitgeschakeld voor CFK's (SHACL-syntax) (20260403) (20260824)
  on class: Rioolput
  on property: has as output
  qualified cardinality: 1
subclass of: Restriction
  author at start life: Marinus Vonhof
  date of start life: 2014-12-23
  on class: Reinigingsproject riolering
  on property: has as part (inverse)
  qualified cardinality: 1
subclass of: Restriction
  author at start life: Marinus Vonhof
  date of start life: 2015-02-01
  on class: Lengte toegang
  on property: has as output
  max qualified cardinality: 1
subclass of: Restriction
  author at start life: Marinus Vonhof
  date of start life: 2015-02-02
  on class: Breedte toegang
  on property: has as output
  max qualified cardinality: 1
subclass of: Restriction
  author at start life: Marinus Vonhof
  date of start life: 2015-10-26
  on class: Inspectieproject riolering
  on property: has as part (inverse)
  qualified cardinality: 1
subclass of: Restriction
  author at start life: Marinus Vonhof
  date of start life: 2020-04-20
  on class: Voegmateriaal
  on property: has as output
  max qualified cardinality: 1
subclass of: Restriction
  on property: heeft Functie
  has value: AfstromingHerstellen

Reinigen en inspecteren kolk
author of change: Marinus Vonhof
date of change: 2018-05-01
author at start life: Marinus Vonhof
date of start life: 2012-05-06
scope note: Collection of facts MDS
scope note: Collection of facts RRB
scope note: Collection of facts LDR
scope note: Collection of facts MTR
type: Class
subclass of: Reinigen
subclass of: Restriction
  author of change: Marinus Vonhof
  date of change: 2013-10-18
  author at start life: Marinus Vonhof
  date of start life: 2013-07-19
  on class: Kolk
  on property: has as output
  qualified cardinality: 1
subclass of: Restriction
  author of change: Marinus Vonhof
  date of change: 2014-09-03
  author at start life: Marinus Vonhof
  date of start life: 2014-04-29
  on class: Reinigings- en inspectieproject kolken
  on property: has as part (inverse)
  qualified cardinality: 1
subclass of: Restriction
  author of change: Marinus Vonhof
  date of change: 2016-01-21
  author at start life: Marinus Vonhof
  date of start life: 2013-10-18
  on class: Uitklimvoorziening
  on property: has as output
  max qualified cardinality: 1
subclass of: Restriction
  author of change: Marinus Vonhof
  date of change: 2016-03-25
  author at start life: Marinus Vonhof
  date of start life: 2013-10-18
  on class: Verwachte type reiniging
  on property: has as output
  max qualified cardinality: 1
subclass of: Restriction
  author of change: Marinus Vonhof
  date of change: 2019-04-04
  author at start life: Marinus Vonhof
  date of start life: 2014-04-29
  on class: Kolk
  on property: has as input
  qualified cardinality: 1
subclass of: Restriction
  author at start life: Marinus Vonhof
  date of start life: 2020-04-20
  on class: Voegmateriaal
  on property: has as output
  max qualified cardinality: 1
subclass of: Restriction
  on property: heeft Functie
  has value: AfstromingHerstellen

Toegankelijk (coll)
author at start life: Eric van Gorkom
date of start life: 2021-08-16
comment: [is coll]
scope note: Collection of facts BAS
type: Class
subclass of: Verzameling soorten

Materiaal afsluiter (coll)
comment: [is coll]
scope note: Collection of facts BAS
scope note: Collection of facts PLI
type: Class
subclass of: Verzameling soorten
subclass of: Class
  one of: GrijsGietijzer
  one of: NodulairGietijzer
  one of: Staal

Ander afvalwater
author of change: Marinus Vonhof
date of change: 2016-04-07
definition: [Waterwet] Datgene wat niet onder een van voorgaande begrippen is te vatten. De wetgever beoogt niet om met bovenstaande begrippen alle soorten afvalwater uitputtend te omschrijven. Een voorbeeld van ‘ander afvalwater’ is ‘ zwembadwater’ bij een particulier huishouden dat geloosd moet worden. Te lozen zwembadwater van een professioneel zwembad is bedrijfsafvalwater
author at start life: Marinus Vonhof
date of start life: 2015-03-29
scope note: Collection of facts BAS
scope note: Collection of facts DMO
type: Class
subclass of: Afvalwater

Type reiniging (kolk) (coll)
validity context: 6d
comment: [is coll]
scope note: Collection of facts RRB
scope note: Collection of facts BAS
type: Class
subclass of: Verzameling soorten

Type vervuiling (coll)
comment: [is coll]
scope note: Collection of facts RRB
scope note: Collection of facts LDR
scope note: Collection of facts BAS
type: Class
subclass of: Verzameling soorten

Verbindingstype (coll)
comment: [is coll]
scope note: Collection of facts MDS
scope note: Collection of facts RRB
scope note: Collection of facts LDR
scope note: Collection of facts PLI
type: Class
subclass of: Verzameling soorten

Verhardingstype (coll)
validity context: 6d
comment: [is coll]
scope note: Collection of facts MDS
scope note: Collection of facts RRB
scope note: Collection of facts LDR
type: Class
subclass of: Verzameling soorten

Vorm leiding (coll)
comment: [is coll]
scope note: Collection of facts MDS
scope note: Collection of facts EN
scope note: Collection of facts RRB
scope note: Collection of facts REV
scope note: Collection of facts HYD
type: Class
subclass of: Verzameling soorten

Vorm opening (coll)
comment: [is coll]
scope note: Collection of facts TOP
type: Class
subclass of: Verzameling soorten

Vorm put (coll)
comment: [is coll]
scope note: Collection of facts TOP
type: Class
subclass of: Verzameling soorten

Apparatuur
author of change: Marinus Vonhof
author of change: Johan Post
author of change: Wouter van Riel
date of change: 2025-01-16
date of change: 2024-05-01
date of change: 2017-05-31
date of change: 2024-04-22
date of change: 2024-12-16
definition: De apparatuur bestemd voor meten, regelen, controleren en onderhouden van het transport van afvalwater.
definition: [IMBOR] Een (vaak compact) mechanisch of elektronisch ding dat is gemaakt of toegepast voor een specifieke toepassing en doorgaans in één behuizing gevat is.
author at start life: Marinus Vonhof
date of start life: 2016-04-20
validity context: 1d 3d 10d 11d 12d 13d 14f 15d
alternative label: Apparaat
scope note: Collection of facts TOP
type: Class
subclass of: Fysiek object
subclass of: Restriction
  author at start life: Wouter van Riel
  date of start life: 2024-04-22
  on class: Apparatuuroriëntatie
  on property: has as aspect
  max qualified cardinality: 1
subclass of: Restriction
  on property: heeft Functie
  has value: Meten Regelen ControlerenEnOnderhouden
subclass of: Restriction
  on class: Theoretische levensduur
  on property: has as aspect
  max qualified cardinality: 1

Apparatuuroriëntatie
author of change: Marinus Vonhof
date of change: 2024-07-16
definition: Een topologisch element dat het zwaartepunt (vertex) van de bovenkant apparatuurbodem beschrijft
author at start life: Wouter van Riel
date of start life: 2024-04-22
scope note: Collection of facts BAS
scope note: Collection of facts PLI
type: Class
subclass of: Representatie fysiek object
subclass of: Restriction
  author at start life: Marinus Vonhof
  date of start life: 2024-07-16
  on class: Punt
  on property: has as aspect
  max qualified cardinality: 1
subclass of: Restriction
  author at start life: Wouter van Riel
  date of start life: 2024-04-22
  on class: Apparatuur
  on property: has as aspect (inverse)
  max qualified cardinality: 1
subclass of: Restriction
  author at start life: Wouter van Riel
  date of start life: 2024-04-22
  on class: Maaiveldoriëntatie
  on property: is connected to
  max qualified cardinality: 1

Theoretische levensduur
author of change: Marinus Vonhof
date of change: 2025-01-16
date of change: 2026-05-19
definition: Datum waarop een einde komt aan de theoretische periode waarin verwacht kan worden dat een bouw- of installatiedeel naar behoren kan functioneert, mits goed onderhouden.
definition: [IMBOR] De tijdsduur dat het object na fabricatie vanaf de ingebruikname haar technische functie adequaat kan vervullen.
author at start life: Johan Post
date of start life: 2024-05-01
units of measurements: yyyy-mm-dd
validity context: 15d
alternative label: Technische levensduur
alternative label: Theoretisch Vervangingsjaar
comment: [is aspect]
scope note: Collection of facts BAS
scope note: Collection of facts PLI
type: Class
subclass of: Datum
subclass of: Restriction
  author at start life: Marinus Vonhof
  date of start life: 2013-09-28
  on class: Apparatuur
  on property: has as aspect (inverse)
  max qualified cardinality: 1
subclass of: Restriction
  author at start life: Marinus Vonhof
  date of start life: 2026-07-24
  on class: Infiltratievoorziening
  on property: has as aspect (inverse)
  max qualified cardinality: 1
subclass of: Restriction
  on property: has as value
  all values from: date
subclass of: Restriction
  on class: Bouwwerk
  on property: has as aspect (inverse)
  max qualified cardinality: 1
subclass of: Restriction
  on class: Constructieonderdeel
  on property: has as aspect (inverse)
  max qualified cardinality: 1
subclass of: Restriction
  on class: Inwinning
  on property: has as aspect
  max qualified cardinality: 1
subclass of: Restriction
  on class: Kabel
  on property: has as aspect (inverse)
  max qualified cardinality: 1
subclass of: Restriction
  on class: Leiding
  on property: has as aspect (inverse)
  max qualified cardinality: 1
subclass of: Restriction
  on class: Put
  on property: has as aspect (inverse)
  max qualified cardinality: 1

Punt
author of change: Marinus Vonhof
date of change: 2026-07-24
definition: Nuldimensionaal element van geografische informatie. Conform coordinatenstelsel EPSG:7415 (x/y conform EPSG:28992, optioneel z conform EPSG:5709).
author at start life: Marinus Vonhof
date of start life: 2016-11-09
units of measurements: gml
comment: [is aspect]
scope note: Collection of facts TOP
type: Class
subclass of: Geometrie
subclass of: Restriction
  author of change: Marinus Vonhof
  date of change: 2020-04-18
  author at start life: Marinus Vonhof
  date of start life: 2016-11-09
  on class: Dekseloriëntatie
  on property: has as aspect (inverse)
  max qualified cardinality: 1
subclass of: Restriction
  author of change: Marinus Vonhof
  date of change: 2020-04-18
  author at start life: Marinus Vonhof
  date of start life: 2016-11-09
  on class: Aansluitpunt
  on property: has as aspect (inverse)
  qualified cardinality: 1
subclass of: Restriction
  author of change: Marinus Vonhof
  date of change: 2020-04-18
  author at start life: Marinus Vonhof
  date of start life: 2016-11-09
  on class: Knooppunt
  on property: has as aspect (inverse)
  qualified cardinality: 1
subclass of: Restriction
  author of change: Marinus Vonhof
  date of change: 2020-04-18
  author at start life: Marinus Vonhof
  date of start life: 2016-11-09
  on class: Meetpunt
  on property: has as aspect (inverse)
  qualified cardinality: 1
subclass of: Restriction
  author of change: Marinus Vonhof
  date of change: 2020-04-18
  author at start life: Marinus Vonhof
  date of start life: 2016-11-09
  on class: Putoriëntatie
  on property: has as aspect (inverse)
  qualified cardinality: 1
subclass of: Restriction
  author of change: Marinus Vonhof
  date of change: 2020-04-18
  author at start life: Marinus Vonhof
  date of start life: 2018-12-12
  on class: Maaiveldoriëntatie
  on property: has as aspect (inverse)
  max qualified cardinality: 1
subclass of: Restriction
  author of change: Marinus Vonhof
  date of change: 2021-08-06
  author at start life: Marinus Vonhof
  date of start life: 2019-05-15
  on class: Injectiepunt
  on property: has as aspect (inverse)
  qualified cardinality: 1
subclass of: Restriction
  author at start life: Marinus Vonhof
  date of start life: 2021-08-06
  on class: Appendage-oriëntatie
  on property: has as aspect (inverse)
  qualified cardinality: 1
subclass of: Restriction
  on property: has as value
  all values from: gmlLiteral

Appendage (coll)
definition: Hulpstuk in een mechanisch transportsysteem
validity context: *d
comment: [is coll]
scope note: Collection of facts BAS
scope note: Collection of facts PLI
type: Class
subclass of: Verzameling soorten
subclass of: Class
  one of: Mechanische afsluiter
  one of: Ontluchter
  one of: Compensator
  one of: Waterslagvoorziening

Ontluchter
author of change: Marinus Vonhof
author of change: Johan Post
author of change: Wouter van Riel
date of change: 2021-10-01
date of change: 2024-04-23
definition: Een toestel waarmee lucht uit een rioolstelsel kan ontsnappen.
author at start life: Finy Teitsma (Oranjewoud)
date of start life: 2007-10-23
validity context: 1d 10d
scope note: Collection of facts BAS
scope note: Collection of facts PLI
type: Class
subclass of: Constructieonderdeel
subclass of: Restriction
  author of change: Marinus Vonhof
  date of change: 2015-02-28
  date of change: 2023-01-10
  author at start life: Finy Teitsma (Oranjewoud)
  date of start life: 2006-05-01
  on class: Mechanische rioolleiding
  on property: has as part (inverse)
  max qualified cardinality: 1
subclass of: Restriction
  author of change: Marinus Vonhof
  date of change: 2015-09-20
  author at start life: Finy Teitsma (Oranjewoud)
  date of start life: 2007-11-30
  on class: Besturingskast
  on property: is connected to
  max qualified cardinality: 1
subclass of: Restriction
  author of change: Marinus Vonhof
  date of change: 2019-03-20
  author at start life: Marinus Vonhof
  date of start life: 2014-12-02
  on class: Service mechanisch
  on property: has as input (inverse)
  max qualified cardinality: 1
subclass of: Restriction
  author of change: Marinus Vonhof
  date of change: 2023-01-10
  author at start life: Marinus Vonhof
  date of start life: 2014-12-02
  on class: Mechanische transportleiding
  on property: has as part (inverse)
  max qualified cardinality: 1
subclass of: Restriction
  author at start life: Marinus Vonhof
  date of start life: 2021-08-06
  on class: Appendage-oriëntatie
  on property: has as aspect
  max qualified cardinality: 1
subclass of: Restriction
  author at start life: Wouter van Riel
  date of start life: 2024-04-23
  on class: Energieverliescoëfficiënt
  on property: has as aspect
  max qualified cardinality: 1
subclass of: Restriction
  on property: heeft Functie
  has value: OntluchtenLeiding
subclass of: Restriction
  on class: Sym_Ontspanningsventiel
  on property: is represented by
  max qualified cardinality: 1

Compensator
author of change: Marinus Vonhof
author of change: Johan Post
date of change: 2025-01-16
date of change: 2024-05-02
definition: Hulpstuk voor het opvangen van spanningen in leidingwerk (vanwege trilling, uitzetting, krimp)
author at start life: Marinus Vonhof
date of start life: 2020-10-28
scope note: Collection of facts BAS
scope note: Collection of facts PLI
type: Class
subclass of: Hulpstuk
subclass of: Restriction
  on property: heeft Toepassing
  has value: BijTrilling Uitzetting Krimp
subclass of: Restriction
  on property: heeft Doel
  has value: OpvangenVanSpanningen
subclass of: Restriction
  on class: Transportleiding
  on property: has as part (inverse)
  max qualified cardinality: 1

Waterslagvoorziening
author of change: Marinus Vonhof
author of change: Wouter van Riel
date of change: 2018-05-03
date of change: 2024-04-23
definition: [NEN 3300:1996] Een constructie voor de vermindering van de effecten van waterslag
author at start life: Marinus Vonhof
date of start life: 2012-04-29
validity context: 10d 14d
comment: 20151014: NEN3300-definitie aangepast
scope note: Collection of facts BAS
scope note: Collection of facts PLI
type: Class
subclass of: Constructieonderdeel
subclass of: Restriction
  author of change: Marinus Vonhof
  date of change: 2018-05-03
  author at start life: Marinus Vonhof
  date of start life: 2012-04-29
  on class: Persleidingstelsel
  on property: has as part (inverse)
  qualified cardinality: 1
subclass of: Restriction
  author at start life: Marinus Vonhof
  date of start life: 2018-05-03
  on class: Gemaal
  on property: has as part (inverse)
  max qualified cardinality: 1
subclass of: Restriction
  author at start life: Marinus Vonhof
  date of start life: 2021-08-06
  on class: Appendage-oriëntatie
  on property: has as aspect
  max qualified cardinality: 1
subclass of: Restriction
  author at start life: Wouter van Riel
  date of start life: 2024-04-23
  on class: Energieverliescoëfficiënt
  on property: has as aspect
  max qualified cardinality: 1
subclass of: Restriction
  on property: heeft Technologie
  has value: Electromechanisch Mechanisch Bouwkundig
subclass of: Restriction
  on property: heeft Functie
  has value: VerminderingWaterslageffect

Appendage-oriëntatie
definition: De positie van de appendage
author at start life: Marinus Vonhof
date of start life: 2021-08-06
validity context: 1d 3d 10d 12d 14d
scope note: Collection of facts BAS
scope note: Collection of facts PLI
type: Class
subclass of: Representatie fysiek object
subclass of: Restriction
  author at start life: Marinus Vonhof
  date of start life: 2021-08-06
  on class: Beluchter
  on property: has as aspect (inverse)
  max qualified cardinality: 1
subclass of: Restriction
  author at start life: Marinus Vonhof
  date of start life: 2021-08-06
  on class: Lanceerpunt
  on property: has as aspect (inverse)
  max qualified cardinality: 1
subclass of: Restriction
  author at start life: Marinus Vonhof
  date of start life: 2021-08-06
  on class: Mangat
  on property: has as aspect (inverse)
  max qualified cardinality: 1
subclass of: Restriction
  author at start life: Marinus Vonhof
  date of start life: 2021-08-06
  on class: Ontluchter
  on property: has as aspect (inverse)
  max qualified cardinality: 1
subclass of: Restriction
  author at start life: Marinus Vonhof
  date of start life: 2021-08-06
  on class: Waterslagvoorziening
  on property: has as aspect (inverse)
  max qualified cardinality: 1
subclass of: Restriction
  author at start life: Marinus Vonhof
  date of start life: 2021-08-06
  on class: Zakbaak
  on property: has as aspect (inverse)
  max qualified cardinality: 1
subclass of: Restriction
  author at start life: Marinus Vonhof
  date of start life: 2021-08-06
  on class: Punt
  on property: has as aspect
  qualified cardinality: 1

Beluchter
author of change: Marinus Vonhof
author of change: Finy Teitsma (Oranjewoud)
author of change: Johan Post
author of change: Wouter van Riel
date of change: 2024-05-02
date of change: 2024-04-23
date of change: 2007-11-12
date of change: 2024-07-31
date of change: 2026-07-02
definition: Een toestel voor het inbrengen van lucht in het stelsel.
author at start life: Finy Teitsma (Oranjewoud)
date of start life: 2007-10-23
validity context: 1d 10d 12d
scope note: Collection of facts BAS
scope note: Collection of facts PLI
type: Class
subclass of: Constructieonderdeel
subclass of: Restriction
  author at start life: Johan Post
  date of start life: 2026-07-02
  on class: Vacuümleiding
  on property: has as part (inverse)
  max qualified cardinality: 1
subclass of: Restriction
  author at start life: Marinus Vonhof
  date of start life: 2021-08-06
  on class: Appendage-oriëntatie
  on property: has as aspect
  max qualified cardinality: 1
subclass of: Restriction
  author at start life: Wouter van Riel
  date of start life: 2024-04-23
  on class: Energieverliescoëfficiënt
  on property: has as aspect
  max qualified cardinality: 1
subclass of: Restriction
  on property: heeft Functie
  has value: BeluchtenLeiding
subclass of: Restriction
  on class: Transportleiding
  on property: has as part (inverse)
  max qualified cardinality: 1

Lanceerpunt
author of change: Marinus Vonhof
author of change: Wouter van Riel
date of change: 2025-01-16
date of change: 2024-04-23
definition: [IMBOR] Een lanceerinrichting voor een pig run.
author at start life: Marinus Vonhof
date of start life: 2018-12-05
validity context: 1d 3d 10d
scope note: Collection of facts BAS
scope note: Collection of facts PLI
type: Class
subclass of: Constructieonderdeel
subclass of: Restriction
  author at start life: Marinus Vonhof
  date of start life: 2018-12-05
  on class: Pigging-installatie
  on property: has as part (inverse)
  qualified cardinality: 1
subclass of: Restriction
  author at start life: Marinus Vonhof
  date of start life: 2021-08-06
  on class: Appendage-oriëntatie
  on property: has as aspect
  max qualified cardinality: 1
subclass of: Restriction
  author at start life: Wouter van Riel
  date of start life: 2024-04-23
  on class: Energieverliescoëfficiënt
  on property: has as aspect
  max qualified cardinality: 1
subclass of: Restriction
  on property: heeft Functie
  has value: LancerenVanEenPig

Mangat
author of change: Johan Post
date of change: 2024-04-30
date of change: 2024-05-02
definition: Opening in leiding om toegang te geven. Veelal omgeven door een put.
author at start life: Marinus Vonhof
date of start life: 2014-12-02
validity context: 10d
scope note: Collection of facts BAS
scope note: Collection of facts PLI
type: Class
subclass of: Constructieonderdeel
subclass of: Restriction
  author of change: Marinus Vonhof
  date of change: 2017-10-12
  author at start life: Marinus Vonhof
  date of start life: 2014-12-02
  on class: Mechanische rioolleiding
  on property: has as part (inverse)
  max qualified cardinality: 1
subclass of: Restriction
  author at start life: Marinus Vonhof
  date of start life: 2021-08-06
  on class: Appendage-oriëntatie
  on property: has as aspect
  max qualified cardinality: 1
subclass of: Restriction
  on property: heeft Functie
  has value: ToegangGevenTotEenLeiding
subclass of: Restriction
  on class: Transportleiding
  on property: has as part (inverse)
  qualified cardinality: 1

Zakbaak
definition: [Wikipedia] Een hulpconstructie (meetpaal) om veranderingen in de hoogte van dieper liggende bodemlagen te bepalen
author at start life: Marinus Vonhof
date of start life: 2014-12-02
validity context: 1d 3d 10d 12d 14d
scope note: Collection of facts BAS
scope note: Collection of facts PLI
type: Class
subclass of: Constructieonderdeel
subclass of: Restriction
  author at start life: Marinus Vonhof
  date of start life: 2014-12-02
  on class: Persleiding
  on property: has as part (inverse)
  max qualified cardinality: 1
subclass of: Restriction
  author at start life: Marinus Vonhof
  date of start life: 2021-08-06
  on class: Appendage-oriëntatie
  on property: has as aspect
  max qualified cardinality: 1
subclass of: Restriction
  on property: heeft Functie
  has value: MetenVanNiveauwijziging

Materiaal substraat (coll)
validity context: 1d 3d 10d 12d 14d
comment: [is coll]
scope note: Collection of facts MDS
type: Class
subclass of: Verzameling soorten
subclass of: Class
  one of: Lava
  one of: Grind
  one of: Argex
  one of: Bims
  one of: Zand
  one of: Steenwol
  one of: Puin
  one of: Schelpen
  one of: Natuursteen

Materiaal deksel (coll)
author of change: Marinus Vonhof
date of change: 2025-12-19
comment: [is coll]
scope note: Collection of facts TOP
type: Class
subclass of: Verzameling soorten
subclass of: Class

Materiaal leiding (coll)
author of change: Marinus Vonhof
author of change: Johan Post
date of change: 2026-05-04
date of change: 2025-12-19
comment: [is coll]
scope note: Collection of facts TOP
type: Class
subclass of: Verzameling soorten
subclass of: Class

Materiaal put (coll)
author of change: Marinus Vonhof
author of change: Johan Post
author of change: Eric van Gorkom
date of change: 2026-05-04
date of change: 2022-10-03
date of change: 2026-05-21
date of change: 2024-05-13
author at start life: Marinus Vonhof
date of start life: 2026-05-01
comment: [is coll]
scope note: Collection of facts TOP
type: Class
subclass of: Verzameling soorten
subclass of: Class

Visueel inspecteren rioolput
label: Visual inspection manhole or inspection chamber @en
author of change: Marinus Vonhof
date of change: 2018-05-01
author at start life: Marinus Vonhof
date of start life: 2012-08-15
scope note: Collection of facts MDS
scope note: Collection of facts EN
scope note: Collection of facts MTR
type: Class
subclass of: VisueelInspecteren
subclass of: Restriction
  author of change: Marinus Vonhof
  date of change: 2015-08-26
  author at start life: Marinus Vonhof
  date of start life: 2013-07-19
  validity context: *t
  comment: Relatie (kardinaliteit) uitgeschakeld voor CFK's (SHACL-syntax) (20260403) (20260824)
  on class: Rioolput
  on property: has as output
  qualified cardinality: 1
subclass of: Restriction
  author of change: Marinus Vonhof
  date of change: 2015-10-20
  author at start life: Marinus Vonhof
  date of start life: 2013-07-19
  on class: Putdekselniveau
  on property: has as output
  max qualified cardinality: 1
subclass of: Restriction
  author of change: Marinus Vonhof
  date of change: 2017-03-23
  author at start life: Marinus Vonhof
  date of start life: 2013-01-05
  on class: Inspectieproject riolering
  on property: has as part (inverse)
  qualified cardinality: 1
subclass of: Restriction
  author of change: Marinus Vonhof
  date of change: 2019-04-04
  author at start life: Marinus Vonhof
  date of start life: 2014-08-29
  on class: Rioolput
  on property: has as input
  qualified cardinality: 1
subclass of: Restriction
  author at start life: Marinus Vonhof
  date of start life: 2020-04-20
  on class: Voegmateriaal
  on property: has as output
  max qualified cardinality: 1
subclass of: Restriction
  author at start life: Marinus Vonhof
  date of start life: 2020-04-20
  on class: Breedte afdekking
  on property: has as output
  max qualified cardinality: 1
subclass of: Restriction
  author at start life: Marinus Vonhof
  date of start life: 2020-04-20
  on class: Lengte afdekking
  on property: has as output
  max qualified cardinality: 1
subclass of: Restriction
  author at start life: Marinus Vonhof
  date of start life: 2020-04-20
  on class: Materiaal afdekking
  on property: has as output
  max qualified cardinality: 1

Axiale Verplaatsing
definition: [NEN 3300:1996] Een gelijkmatige verplaatsing van twee buizen ten opzichte van elkaar in de asrichting van de buizen
author at start life: Marinus Vonhof
date of start life: 2022-09-30
validity context: *d
scope note: Collection of facts BAS
type: Class
subclass of: NEN 3300 Term

Unieke identificatie
label: Resource identifier @en
author of change: Marinus Vonhof
date of change: 2025-01-16
date of change: 2015-08-24
date of change: 2024-11-22
definition: [IMBOR] Een ondubbelzinnige en unieke aanduiding van een object.
author at start life: Nic Roest (Idoro)
date of start life: 2006-03-23
comment: [is aspect]
scope note: Collection of facts TOP
type: Class
subclass of: Kenmerk

Voegmateriaal
author of change: Marinus Vonhof
date of change: 2021-08-12
definition: Afdichtingsmateriaal van de buisverbindingen
notation: AXP
notation: CXP
notation: EXP
notation: GXP
notation: JXP
author at start life: Marinus Vonhof
date of start life: 2013-11-26
alternative label: Afdichtingsmateriaal
comment: [is aspect]
scope note: Collection of facts MDS
scope note: Collection of facts RRB
scope note: Collection of facts LDR
type: Class
subclass of: Materiaal
subclass of: Restriction
  author at start life: Marinus Vonhof
  date of start life: 2018-12-05
  on class: Leiding
  on property: has as aspect (inverse)
  max qualified cardinality: 1
subclass of: Restriction
  author at start life: Marinus Vonhof
  date of start life: 2020-04-20
  on class: Reinigen en inspecteren kolk
  on property: has as output (inverse)
  max qualified cardinality: 1
subclass of: Restriction
  author at start life: Marinus Vonhof
  date of start life: 2020-04-20
  on class: Reinigen rioolput
  on property: has as output (inverse)
  max qualified cardinality: 1
subclass of: Restriction
  author at start life: Marinus Vonhof
  date of start life: 2020-04-20
  on class: Reinigen vrijverval leiding
  on property: has as output (inverse)
  max qualified cardinality: 1
subclass of: Restriction
  author at start life: Marinus Vonhof
  date of start life: 2020-04-20
  on class: Visueel inspecteren rioolput
  on property: has as output (inverse)
  max qualified cardinality: 1
subclass of: Restriction
  author at start life: Marinus Vonhof
  date of start life: 2020-04-20
  on class: Visueel inspecteren vrijverval leiding
  on property: has as output (inverse)
  max qualified cardinality: 1
subclass of: Restriction
  on property: has as reference (qualification)
  all values from: Voegmateriaal (coll)

Materiaal
author of change: Marinus Vonhof
date of change: 2015-06-01
author at start life: Marinus Vonhof
date of start life: 2013-09-03
validity context: 15d
comment: [is aspect]
scope note: Collection of facts TOP
type: Class
subclass of: Kenmerk

Voegmateriaal (coll)
author of change: Marinus Vonhof
author of change: Eric van Gorkom
date of change: 2023-01-10
date of change: 2021-08-16
comment: [is coll]
scope note: Collection of facts MDS
scope note: Collection of facts RRB
scope note: Collection of facts LDR
type: Class
subclass of: Verzameling soorten

Materiaal lining (coll)
author at start life: Marinus Vonhof
date of start life: 2026-07-17
comment: [is coll]
scope note: Collection of facts TOP
type: Class
subclass of: Verzameling soorten
subclass of: Class
  one of: BetonnenSegmenten
  one of: Vezelcement
  one of: GVK
  one of: Epoxy
  one of: Polyester
  one of: Polymeerbeton
  one of: PE
  one of: HDPE
  one of: Polypropyleen
  one of: BAIZob
  one of: PVC

Pigging
author of change: Marinus Vonhof
date of change: 2019-04-05
definition: Een methode om aangroei en/of vervuiling uit een leidingsysteem te verwijderen. Hierbij maakt men gebruik van reinigingsproppen, de zogenaamde pigs, die men met behulp van een bepaald medium door de leiding perst. De pig is een flexibele prop van een stevig, maar goed vervormbaar polyurethaan, bekleed met een coating en soms afgewerkt met een wirebrush van staal, rvs en Teflon. Afhankelijk van het soort vervuiling en de materiaalsoort van de leiding, zijn er ook andere afwerkingen mogelijk.(bron: https://www.vecom-group.com/nl/diensten/diensten-op-locatie/pipe-pigging/)
author at start life: Marinus Vonhof
date of start life: 2014-12-02
comment: Bron afbeelding: https://www.vecom-group.com/nl/diensten/diensten-op-locatie/pipe-pigging/
scope note: Collection of facts BAS
scope note: Collection of facts PLI
scope note: Collection of facts MTR
type: Class
subclass of: Reinigen mechanische leiding
subclass of: Restriction
  author of change: Marinus Vonhof
  date of change: 2019-04-05
  author at start life: Marinus Vonhof
  date of start life: 2014-12-02
  on class: Persleiding
  on property: has as input
  max qualified cardinality: 1
subclass of: Restriction
  on property: heeft Functie
  has value: AfstromingHerstellen

Buis is vervangen
label: Pipe replaced @en
author of change: Marinus Vonhof
date of change: 2025-01-16
notation: A
author at start life: Marinus Vonhof
date of start life: 2018-12-13
validity context: 6d
scope note: Collection of facts EN
scope note: Collection of facts BAS
scope note: Collection of facts MTR
type: Class
subclass of: Reparatie
subclass of: Restriction
  on property: heeft Uitvoering
  has value: MetVervangendeBuis

Reparatie
author of change: Marinus Vonhof
author of change: Wouter van Riel
date of change: 2025-01-16
date of change: 2024-04-23
date of change: 2018-12-14
definition: Het fysieke resultaat van repareren
author at start life: Marinus Vonhof
date of start life: 2018-12-13
validity context: *f 10d
scope note: Collection of facts EN
scope note: Collection of facts BAS
scope note: Collection of facts PLI
scope note: Collection of facts MTR
type: Class
subclass of: Constructieonderdeel
subclass of: Restriction
  author at start life: Marinus Vonhof
  date of start life: 2024-07-30
  on class: Constructieonderdeeloriëntatie
  on property: has as aspect
  max qualified cardinality: 1
subclass of: Restriction
  on property: heeft Toepassing
  has value: ResultaatRepareren

Deelliner
label: Localised lining of pipe @en
author of change: Marinus Vonhof
author of change: Wouter van Riel
date of change: 2025-01-16
date of change: 2018-11-14
date of change: 2024-04-23
definition: [IMBOR] Nieuwe bekleding of een geheel nieuw leidingdeel die in een bepaald stuk van een bestaande leiding wordt aangebracht.
notation: B
author at start life: Marinus Vonhof
date of start life: 2018-03-20
alternative label: Deellining
scope note: Collection of facts EN
scope note: Collection of facts LDR
scope note: Collection of facts BAS
scope note: Collection of facts PLI
scope note: Collection of facts MTR
type: Class
subclass of: Reparatie
subclass of: Restriction
  author of change: Marinus Vonhof
  author of change: Wouter van Riel
  date of change: 2018-11-14
  date of change: 2024-04-23
  author at start life: Marinus Vonhof
  date of start life: 2018-09-03
  on class: Rioolleiding
  on property: has as part (inverse)
  max qualified cardinality: 1
subclass of: Restriction
  author of change: Marinus Vonhof
  author of change: Wouter van Riel
  date of change: 2018-11-14
  date of change: 2024-04-23
  author at start life: Marinus Vonhof
  date of start life: 2018-09-03
  on class: Transportleiding
  on property: has as part (inverse)
  max qualified cardinality: 1
subclass of: Restriction
  on property: heeft Uitvoering
  has value: DeellinerAangebracht

Rioolleiding
label: Pipeline (EN) @en
author of change: Johan Post
author of change: Eric van Gorkom
author of change: Wouter van Riel
date of change: 2022-09-27
date of change: 2024-04-23
date of change: 2026-05-13
definition: [EN 16323:2014] hollow structure for transporting wastewater between manholes or other structures @en
definition: [EN 16323:2014] pipeline or other construction, usually underground, designed to carry wastewater from more than one source @en
definition: [NEN 3300:1996] samenstel van buizen tussen twee putten bestemd voor de inzameling en/of het transport van afvalwater
author at start life: Marinus Vonhof
date of start life: 2014-04-28
validity context: *f
alternative label: Riool
alternative label: Rioolstreng
alternative label: Sewer @en
alternative label: Streng
scope note: Collection of facts TOP
type: Class
subclass of: Leiding
subclass of: Restriction
  author of change: 2026-05-13
  author at start life: Johan Post
  on class: Leidingvlak
  on property: has as part
  min qualified cardinality: 0
subclass of: Restriction
  author of change: Marinus Vonhof
  date of change: 2024-05-16
  date of change: 2020-04-17
  author at start life: Finy Teitsma (Oranjewoud)
  date of start life: 2006-05-23
  on class: Rioolafsluiter
  on property: has as part
  max qualified cardinality: 1
subclass of: Restriction
  author at start life: Marinus Vonhof
  date of start life: 2024-05-16
  on class: Drukklasse
  on property: has as aspect
  max qualified cardinality: 1
subclass of: Restriction
  author at start life: Marinus Vonhof
  date of start life: 2024-05-16
  on class: Kleur
  on property: has as aspect
  max qualified cardinality: 1
subclass of: Restriction
  author at start life: Marinus Vonhof
  date of start life: 2024-05-16
  on class: SDR-waarde
  on property: has as aspect
  max qualified cardinality: 1
subclass of: Restriction
  author at start life: Marinus Vonhof
  date of start life: 2026-07-20
  on class: Doorlaat
  on property: has as part
  max qualified cardinality: 2
subclass of: Restriction
  author at start life: Marinus Vonhof
  date of start life: 2026-08-20
  on class: Vuilvangrooster
  on property: has as part
  max qualified cardinality: 1
subclass of: Restriction
  author of change: Marinus Vonhof
  date of change: 2026-08-20
  author at start life: Wouter van Riel
  date of start life: 2024-04-23
  on class: Deelliner
  on property: has as part
  max qualified cardinality: 1
subclass of: Restriction
  on property: heeft Functie
  has value: InzamelingVanAfvalwater
subclass of: Restriction
  on property: heeft Functie
  has value: TransportVanAfvalwater
subclass of: Restriction
  on class: Warmtewinningsnet
  on property: has as part (inverse)
  max qualified cardinality: 1
subclass of: Restriction
  on class: Bekabeling
  on property: has as part
  min qualified cardinality: 0
subclass of: Restriction
  on class: Buisdeel
  on property: has as part
  min qualified cardinality: 0

Ander geïnjecteerd dichtingsmateriaal
label: Other injected sealing material @en
author of change: Marinus Vonhof
date of change: 2025-01-16
notation: D
author at start life: Marinus Vonhof
date of start life: 2018-12-13
scope note: Collection of facts EN
scope note: Collection of facts BAS
type: Class
subclass of: Reparatie
subclass of: Restriction
  on property: heeft Uitvoering
  has value: DichtingsmateriaalGeinjecteerd

Gerepareerd gat
label: Hole repaired @en
author of change: Marinus Vonhof
date of change: 2025-01-16
notation: E
author at start life: Marinus Vonhof
date of start life: 2018-12-13
scope note: Collection of facts EN
scope note: Collection of facts BAS
scope note: Collection of facts MTR
type: Class
subclass of: Reparatie
subclass of: Restriction
  on property: heeft Uitvoering
  has value: GatGedicht

Deelliner bij een aansluiting (bijv. hoedje)
label: Localised lining of connection (e.g. top hat) @en
author of change: Marinus Vonhof
date of change: 2025-01-16
notation: E
notation: F
author at start life: Marinus Vonhof
date of start life: 2018-12-13
scope note: Collection of facts EN
scope note: Collection of facts BAS
scope note: Collection of facts MTR
type: Class
subclass of: Reparatie
subclass of: Restriction
  on property: heeft Uitvoering
  has value: DeellinerBijAansluitingAangebracht

Bakmodel
definition: [NEN 3300:1996] Hydraulische berekeningswijze waarbij het rioolstelsel tot een of meer bakken is geschematiseerd
author at start life: Marinus Vonhof
date of start life: 2022-09-30
validity context: *d
scope note: Collection of facts BAS
type: Class
subclass of: NEN 3300 Term

Balkeerklep
definition: Functioneert door middel van een inwendige bal die reageert op de vloeistofdruk.
author at start life: Marinus Vonhof
date of start life: 2026-07-17
scope note: Collection of facts PLI
scope note: Collection of facts HYD
type: Class
subclass of: Keerklep
subclass of: Restriction
  on property: heeft Uitvoering
  has value: VoorzienVanInwendigeBal

Keerklep
label: Non-return valve @en
definition: [EN 16323:2014] device that prevents backflow of wastewater @en
author at start life: Marinus Vonhof
date of start life: 2026-07-17
validity context: 1d 3d
scope note: Collection of facts PLI
scope note: Collection of facts HYD
type: Class
subclass of: Mechanische afsluiter
subclass of: Restriction
  author of change: Marinus Vonhof
  date of change: 2019-05-15
  author at start life: Marinus Vonhof
  date of start life: 2014-04-29
  on class: Overstortput
  on property: has as part (inverse)
  max qualified cardinality: 1
subclass of: Restriction
  author of change: Marinus Vonhof
  date of change: 2019-05-15
  author at start life: Marinus Vonhof
  date of start life: 2015-05-29
  on class: Overstortconstructie
  on property: has as part (inverse)
  max qualified cardinality: 1
subclass of: Restriction
  author at start life: Marinus Vonhof
  date of start life: 2026-07-17
  on class: Gemaal
  on property: has as part (inverse)
  max qualified cardinality: 1
subclass of: Restriction
  author at start life: Marinus Vonhof
  date of start life: 2026-07-17
  on class: Uitlaatconstructie
  on property: has as part (inverse)
  max qualified cardinality: 1
subclass of: Restriction
  on property: heeft Functie
  has value: AfsluitenInEenStroomrichting

Rioleringsbeheer
author at start life: Marinus Vonhof
date of start life: 2018-12-10
scope note: Collection of facts BAS
scope note: Collection of facts DMO
type: Class
subclass of: Gemeentelijke taak

Rioleringsplan
author of change: Marinus Vonhof
date of change: 2018-12-10
author at start life: Marinus Vonhof
date of start life: 2014-11-30
validity context: 6d
see also: [IRIS-RIOKEN:2012] Strategisch operationeel of maatregelen plan waarin beschreven staat hoe men binnen een bepaald gebied met de riolering dient om te gaan
scope note: Collection of facts BAS
scope note: Collection of facts PLI
scope note: Collection of facts DMO
type: Class
subclass of: Informatiedrager

Planvorming rioleringsbeheer
author of change: Marinus Vonhof
date of change: 2018-12-14
author at start life: Marinus Vonhof
date of start life: 2014-11-29
scope note: Collection of facts BAS
scope note: Collection of facts DMO
type: Class
subclass of: Rioleringsbeheer
subclass of: Restriction
  author of change: Marinus Vonhof
  date of change: 2018-12-13
  author at start life: Marinus Vonhof
  date of start life: 2014-11-29
  on class: Basisrioleringsplan
  on property: has as output
  min qualified cardinality: 1
subclass of: Restriction
  author of change: Marinus Vonhof
  date of change: 2018-12-13
  author at start life: Marinus Vonhof
  date of start life: 2014-11-29
  on class: Gemeentelijk rioleringsplan
  on property: has as output
  min qualified cardinality: 1
subclass of: Restriction
  author at start life: Marinus Vonhof
  date of start life: 2018-12-13
  on class: Inspectieplan
  on property: has as output
  min qualified cardinality: 0
subclass of: Restriction
  author at start life: Marinus Vonhof
  date of start life: 2018-12-13
  on class: Reinigingsplan
  on property: has as output
  min qualified cardinality: 0

Beginpunt leiding
label: Node 1 reference @en
author of change: Marinus Vonhof
date of change: 2016-04-24
definition: Het uiteinde van een leiding, anders dan het eindpunt. Ter plaatse van het leidingmidden op de bovenkant bodem.
definition: [EN13508-2+A1] The node reference of the second node as specified by the employing authority. @en
notation: AAD
notation: GAD
author at start life: Marinus Vonhof
date of start life: 2012-04-22
alternative label: Knooppuntreferentie 1
scope note: Collection of facts TOP
type: Class
subclass of: Vertex
subclass of: Restriction
  author of change: Marinus Vonhof
  date of change: 2018-12-06
  author at start life: Marinus Vonhof
  date of start life: 2016-11-09
  validity context: *t
  comment: Temporeel kenmerk, met kenmerk Inwinning
  on class: B.o.b. beginpunt leiding
  on property: has as aspect
  min qualified cardinality: 0
subclass of: Restriction
  author at start life: Marinus Vonhof
  date of start life: 2011-12-02
  validity context: *t
  on class: Knooppunt
  on property: is connected to
  max qualified cardinality: 1
subclass of: Restriction
  author at start life: Marinus Vonhof
  date of start life: 2011-12-02
  on class: Leidingoriëntatie
  on property: has as part (inverse)
  qualified cardinality: 1

Eindpunt leiding
label: Node 2 reference @en
author of change: Marinus Vonhof
date of change: 2016-04-24
definition: [EN13508-2+A1] The node reference of the second node as specified by the employing authority. @en
definition: Het uiteinde van een leiding, anders dan het beginpunt. Ter plaatse van het leidingmidden op de bovenkant bodem.
notation: AAF
notation: GAF
author at start life: Marinus Vonhof
date of start life: 2012-04-22
alternative label: Knooppuntreferentie 2
scope note: Collection of facts TOP
type: Class
subclass of: Vertex
subclass of: Restriction
  author of change: Marinus Vonhof
  date of change: 2018-12-06
  author at start life: Marinus Vonhof
  date of start life: 2016-11-09
  validity context: *t
  comment: Temporeel kenmerk, met kenmerk Inwinning
  on class: B.o.b. eindpunt leiding
  on property: has as aspect
  min qualified cardinality: 0
subclass of: Restriction
  author at start life: Marinus Vonhof
  date of start life: 2011-12-02
  validity context: *t
  on class: Knooppunt
  on property: is connected to
  max qualified cardinality: 1
subclass of: Restriction
  author at start life: Marinus Vonhof
  date of start life: 2011-12-02
  on class: Leidingoriëntatie
  on property: has as part (inverse)
  qualified cardinality: 1

Bedieningswijze (coll)
comment: [is coll]
scope note: Collection of facts BAS
scope note: Collection of facts PLI
type: Class
subclass of: Verzameling soorten
subclass of: Class
  one of: Handmatig
  one of: Elektrisch
  one of: Pneumatisch

Bedrijfsafvalwater
author of change: Marinus Vonhof
date of change: 2020-04-18
definition: [NEN 3300:1996] Afvalwater, dat niet afkomstig is uit particuliere huishoudens
definition: [NEN-EN 752:2008] afvalwater dat bij een industriële of commerciële activiteit vrijkomt [EN 1085:2007, definitie 2040]
definition: [Waterwet] Afvalwater dat vrijkomt bij door de mens bedrijfsmatig of in een omvang alsof zij bedrijfsmatig was, ondernomen bedrijvigheid, dat geen huishoudelijk afvalwater, afvloeiend hemelwater of grondwater is
author at start life: Marinus Vonhof
date of start life: 2015-03-29
see also: [Saniwijzer] Definitie: afvalwater van industrie of land/tuinbouw
scope note: Collection of facts BAS
scope note: Collection of facts DMO
type: Class
subclass of: Afvalwater

Type bebouwing (coll)
comment: [is coll]
scope note: Collection of facts BAS
scope note: Collection of facts DMO
type: Class
subclass of: Verzameling soorten

Beek
author of change: Marinus Vonhof
date of change: 2025-01-16
definition: [IMBOR] Een min of meer natuurlijke stroom ondiep water die vanuit een oorsprong, vaak een bron, stroomafwaarts vloeit.
author at start life: Marinus Vonhof
date of start life: 2017-05-31
validity context: 1d 3d 10d 12d 14d
scope note: Collection of facts MDS
type: Class
subclass of: Waterloop
subclass of: Restriction
  on property: heeft Uitvoering
  has value: NatuurlijkEnOndiep

Waterloop
author of change: Marinus Vonhof
date of change: 2014-03-23
author at start life: Marinus Vonhof
date of start life: 2013-03-31
see also: Vervallen link: https://imgeo.geostandaarden.nl/def/imgeo-object/waterdeel/waterloop
see also: [IMGeo:1.0/2007] Een voor de waterbeheersing bestemde geul met een vlakke bodem die meestal permanent water bevat.
scope note: Collection of facts BAS
type: Class
subclass of: Oppervlaktewater
subclass of: Restriction
  author of change: Marinus Vonhof
  date of change: 2014-04-10
  author at start life: Marinus Vonhof
  date of start life: 2012-04-29
  on class: Waterdeel
  on property: has as part
  min qualified cardinality: 0
subclass of: Restriction
  author at start life: Marinus Vonhof
  date of start life: 2012-04-29
  on class: Oppervlaktewatersysteem
  on property: has as part (inverse)
  qualified cardinality: 1
subclass of: Restriction
  on property: heeft Functie
  has value: TransportVanOppervlaktewater

Beekriool
author of change: Marinus Vonhof
date of change: 2025-01-16
date of change: 2018-12-06
definition: Overkluizing van een waterdeel
author at start life: Marinus Vonhof
date of start life: 2018-12-05
scope note: Collection of facts BAS
type: Class
subclass of: Overkluizing
subclass of: Restriction
  on property: heeft Doel
  has value: OverwelvenVanEenWaterdeel

Overkluizing
author of change: Marinus Vonhof
author of change: Wouter van Riel
date of change: 2025-01-16
date of change: 2024-04-20
date of change: 2018-12-12
definition: Een bouwwerk om een hydraulisch element, zoals een watergang of een duiker
definition: [Wikipedia] Een civieltechnisch kunstwerk waarmee een weg een andere weg, een plein of een waterloop (kruiselings) overwelft
author at start life: Marinus Vonhof
date of start life: 2014-12-02
validity context: 10d
scope note: Collection of facts BAS
type: Class
subclass of: Kunstwerk
subclass of: Restriction
  on property: heeft Doel
  has value: OverwelvenVanWegOfWater

Beerput
author of change: Marinus Vonhof
author of change: Johan Post
date of change: 2021-08-05
date of change: 2026-05-01
definition: Put bestemd voor het tijdelijk opslaan van vuilwater en voor een gedeeltelijke biologische afbraak van het vuilwater (waarbij geen overstort is op een rioolstelsel) / Variant: Een op terreinriolering of gebouwriolering aangesloten put, bedoeld voor het tijdelijk opslaan, de biologische afbraak en/ of de infiltratie in de bodem van stedelijk afvalwater.
definition: [NEN 3300:1996] put bestemd voor de tijdelijke opslag van fecaliën
author at start life: Finy Teitsma (Oranjewoud)
date of start life: 2007-10-23
alternative label: Rottingsput
scope note: Collection of facts MDS
type: Class
subclass of: Put
subclass of: Restriction
  author of change: Marinus Vonhof
  date of change: 2016-04-25
  author at start life: Nic Roest (Idoro)
  date of start life: 2007-11-29
  on class: Perceelaansluitpunt
  on property: is connected to
  min qualified cardinality: 1
subclass of: Restriction
  on property: heeft Technologie
  has value: BiologischReinigen
subclass of: Restriction
  on property: heeft Uitvoering
  has value: ReservoirZonderLozing
subclass of: Restriction
  on property: heeft Functie
  has value: ZuiverenAfvalwater
subclass of: Restriction
  on class: Gebouwaansluitpunt
  on property: is connected to
  min qualified cardinality: 0

Begindatum
author of change: Marinus Vonhof
author of change: Wouter van Riel
date of change: 2024-04-22
date of change: 2015-05-29
date of change: 2023-01-10
definition: Datum waarop het fysieke object is geplaatst of geïnstalleerd (het wordt daarmee onderdeel van een fysiek systeem). Dus bijvoorbeeld niet de datum van fabricage.
author at start life: Marinus Vonhof
date of start life: 2011-12-15
units of measurements: yyyy-mm-dd
validity context: 5d 16d
alternative label: Installatiedatum
comment: [is aspect]
scope note: Collection of facts TOP
type: Class
subclass of: Datum
subclass of: Restriction
  author at start life: Marinus Vonhof
  date of start life: 2013-09-28
  on class: Fysiek object
  on property: has as aspect (inverse)
  max qualified cardinality: 1
subclass of: Restriction
  on property: has as value
  all values from: date

Beginknooppunt
definition: Het knooppunt dat koppelt aan het (topologische) beginpunt van een leiding.
definition: [EN13508-2+A1] The node reference of the first node as specified by the employing authority. @en
author at start life: Marinus Vonhof
date of start life: 2026-07-17
alternative label: Beginknoop
scope note: Collection of facts TOP
type: Class
subclass of: Extra objecttype (rol)

Extra objecttype (rol)
definition: Aanvullende niet-functionele objecttypering, bijvoorbeeld voor onderscheid van de uitvoeringswijze of de toegevoegde rol van het object. Het subtype is altijd multiparent, met ook een functioneel supertype
author at start life: Marinus Vonhof
date of start life: 2024-08-01
validity context: *f
scope note: Collection of facts TOP
type: Class
subclass of: Informatiedrager

Vertex
author of change: Marinus Vonhof
date of change: 2020-11-24
definition: Het punt waar lijnstukken bij elkaar komen, in de grafentheorie een knoop, in de meetkunde een hoekpunt
author at start life: Marinus Vonhof
date of start life: 2012-04-22
validity context: *f
alternative label: Knoop
scope note: Collection of facts TOP
type: Class
subclass of: Topologisch element

B.o.b. beginpunt leiding
definition: Binnenonderkant buis ter plaatse van het beginpunt
notation: AXG
notation: GXG
author at start life: Marinus Vonhof
date of start life: 2013-03-26
units of measurements: m
alternative label: B.o.b. bij beginknoop t.o.v. NAP
comment: [is aspect]
scope note: Collection of facts TOP
type: Class
subclass of: Binnenonderkant buis
subclass of: Restriction
  author of change: Marinus Vonhof
  date of change: 2017-05-17
  date of change: 2024-05-15
  author at start life: Marinus Vonhof
  date of start life: 2015-10-29
  on class: Inwinning
  on property: has as aspect
  max qualified cardinality: 1
subclass of: Restriction
  author of change: Marinus Vonhof
  date of change: 2018-12-06
  author at start life: Marinus Vonhof
  date of start life: 2016-11-09
  validity context: *t
  on class: Beginpunt leiding
  on property: has as aspect (inverse)
  max qualified cardinality: 1
subclass of: Restriction
  on property: has as value
  all values from: decimal

Leidingoriëntatie
author of change: Marinus Vonhof
date of change: 2020-04-18
definition: Een topologisch element dat het beginpunt, eindpunt (vertices) en de verbindingslijn (edge) daartussen beschrijft. De geometrie volgt het midden van de binnenonderkant van de leiding
notation: AXY
notation: GXY
author at start life: Marinus Vonhof
date of start life: 2017-12-12
scope note: Collection of facts TOP
type: Class
subclass of: Verbinding
subclass of: Restriction
  author of change: Marinus Vonhof
  date of change: 2020-04-18
  author at start life: Marinus Vonhof
  date of start life: 2016-11-09
  comment: Temporeel kenmerk, met kenmerk Inwinning
  on class: Lijn
  on property: has as aspect
  max qualified cardinality: 1
subclass of: Restriction
  author of change: Marinus Vonhof
  date of change: 2020-11-25
  author at start life: Marinus Vonhof
  date of start life: 2014-05-02
  on class: Hydraulisch rioleringsmodel
  on property: has as part (inverse)
  qualified cardinality: 1
subclass of: Restriction
  author at start life: Marinus Vonhof
  date of start life: 2011-12-02
  on class: Beginpunt leiding
  on property: has as part
  qualified cardinality: 1
subclass of: Restriction
  author at start life: Marinus Vonhof
  date of start life: 2011-12-02
  on class: Eindpunt leiding
  on property: has as part
  qualified cardinality: 1
subclass of: Restriction
  author at start life: Marinus Vonhof
  date of start life: 2012-04-22
  validity context: *t
  on class: Leiding
  on property: has as aspect (inverse)
  max qualified cardinality: 1

Beginpunt onderdeel
author of change: Marinus Vonhof
date of change: 2017-12-08
definition: Bij een pomp, externe doorlaat of externe overstort bepaalt het beginpunt ook de stromingsrichting (= stroming van begin- naar eindpunt).
author at start life: Marinus Vonhof
date of start life: 2012-04-22
scope note: Collection of facts MDS
scope note: Collection of facts REV
scope note: Collection of facts HYD
type: Class
subclass of: Vertex
subclass of: Restriction
  author of change: Marinus Vonhof
  date of change: 2017-12-07
  author at start life: Marinus Vonhof
  date of start life: 2012-04-22
  on class: Onderdeeloriëntatie
  on property: has as part (inverse)
  qualified cardinality: 1
subclass of: Restriction
  author of change: Marinus Vonhof
  date of change: 2019-08-12
  author at start life: Marinus Vonhof
  date of start life: 2017-05-17
  on class: Binnenonderkant onderdeel
  on property: has as aspect
  max qualified cardinality: 1
subclass of: Restriction
  author at start life: Marinus Vonhof
  date of start life: 2017-12-12
  validity context: 5t 11t
  on class: Knooppunt
  on property: is connected to
  max qualified cardinality: 1

Onderdeeloriëntatie
author of change: Marinus Vonhof
author of change: Wouter van Riel
date of change: 2018-12-05
date of change: 2024-04-20
definition: Een topologisch element dat de verbindingslijn (edge) tussen het beginpunt en het eindpunt van het onderdeel beschrijft. Voor een wand, pomp of doorlaat beschrijft dit topologisch element de verbinding ervan binnen het netwerk, zie daarvoor de concepten "beginpunt/eindpunt onderdeel". Dit element kan een geometrie (punt of lijn) bevatten voor presentaties. Bij een wand (stuw-/overstortconstructie) beschrijft de geometrie het midden van de bovenkant wand in de breedterichting.
author at start life: Marinus Vonhof
date of start life: 2017-12-12
scope note: Collection of facts MDS
scope note: Collection of facts REV
scope note: Collection of facts HYD
scope note: Collection of facts DMO
type: Class
subclass of: Verbinding
subclass of: Restriction
  author of change: Marinus Vonhof
  date of change: 2015-06-08
  author at start life: Marinus Vonhof
  date of start life: 2012-04-22
  validity context: 5t 11t
  on class: Wand
  on property: has as aspect (inverse)
  max qualified cardinality: 1
subclass of: Restriction
  author of change: Marinus Vonhof
  date of change: 2017-12-07
  author at start life: Marinus Vonhof
  date of start life: 2012-04-22
  on class: Beginpunt onderdeel
  on property: has as part
  qualified cardinality: 1
subclass of: Restriction
  author of change: Marinus Vonhof
  date of change: 2017-12-07
  author at start life: Marinus Vonhof
  date of start life: 2012-04-22
  on class: Eindpunt onderdeel
  on property: has as part
  qualified cardinality: 1
subclass of: Restriction
  author of change: Marinus Vonhof
  date of change: 2018-05-03
  author at start life: Marinus Vonhof
  date of start life: 2012-04-22
  validity context: 5t 11t
  on class: Pomp
  on property: has as aspect (inverse)
  max qualified cardinality: 1
subclass of: Restriction
  author at start life: Marinus Vonhof
  date of start life: 2012-04-22
  validity context: 5t 11t
  on class: Doorlaat
  on property: has as aspect (inverse)
  max qualified cardinality: 1
subclass of: Restriction
  author at start life: Marinus Vonhof
  date of start life: 2025-03-19
  on class: Lijn
  on property: has as aspect
  max qualified cardinality: 1
subclass of: Restriction
  author at start life: Wouter van Riel
  date of start life: 2024-04-20
  on class: Punt
  on property: has as aspect
  max qualified cardinality: 1

Binnenonderkant onderdeel
author of change: Marinus Vonhof
date of change: 2019-08-12
author at start life: Marinus Vonhof
date of start life: 2017-05-31
comment: [is aspect]
scope note: Collection of facts BAS
type: Class
subclass of: Hoogte t.o.v. NAP
subclass of: Restriction
  author of change: Marinus Vonhof
  date of change: 2019-08-12
  author at start life: Marinus Vonhof
  date of start life: 2017-05-17
  on class: Beginpunt onderdeel
  on property: has as aspect (inverse)
  max qualified cardinality: 1
subclass of: Restriction
  author of change: Marinus Vonhof
  date of change: 2019-08-12
  author at start life: Marinus Vonhof
  date of start life: 2017-05-17
  on class: Eindpunt onderdeel
  on property: has as aspect (inverse)
  max qualified cardinality: 1

Begroeide infiltratievoorziening
definition: Een begroeide, onverharde verlaging in het maaiveld (wadi, veld, berm, greppel of sloot), waarin het hemelwater tijdelijk wordt geborgen en waarbij het hemelwater via een waterdoorlatende (zuiverende) bodempassage infiltreert in de ondergrond. In de ondergrond onder de bodempassage kan een infiltratiekoffer en/of infiltratiekrat aanwezig zijn. Bij overbelasting en voor de vertraagde leegloop van de voorziening kunnen onderdelen (drainage, noodoverstort, slokop etc.) zijn aangebracht voor het reguleren van hemelwater- en grondwater.
author at start life: Marinus Vonhof
date of start life: 2026-07-13
alternative label: Bovengrondse infiltratievoorziening
alternative label: Groene infiltratievoorziening
alternative label: Onverharde infiltratievoorziening
scope note: Collection of facts MDS
scope note: Collection of facts HYD
type: Class
subclass of: Infiltratievoorziening
subclass of: Restriction
  on property: heeft Uitvoering
  has value: VerdieptTerreinMetWaterdoorlatendeBodem
subclass of: Restriction
  on class: Slokop
  on property: has as part
  min qualified cardinality: 0
subclass of: Restriction
  on class: Infiltratiecompartiment
  on property: has as part
  min qualified cardinality: 1

Infiltratievoorziening
author of change: Marinus Vonhof
author of change: Johan Post
author of change: Eric van Gorkom
date of change: 2024-04-30
date of change: 2026-07-13
date of change: 2024-05-13
definition: Het geheel van componenten bestemd voor de inzameling van hemelwater en afvoer ervan door infiltratie.
author at start life: Marinus Vonhof
date of start life: 2014-03-20
validity context: *f
scope note: Collection of facts MDS
scope note: Collection of facts HYD
type: Class
subclass of: Fysiek object
subclass of: Restriction
  author of change: Marinus Vonhof
  date of change: 2026-07-14
  author at start life: Marinus Vonhof
  date of start life: 2019-07-10
  on class: Rioolstelsel
  on property: has as part (inverse)
  max qualified cardinality: 1
subclass of: Restriction
  author of change: Marinus Vonhof
  date of change: 2026-07-14
  author at start life: Nic Roest (Idoro)
  date of start life: 2007-11-29
  on class: Bergend vermogen
  on property: has as aspect
  max qualified cardinality: 1
subclass of: Restriction
  author of change: Marinus Vonhof
  date of change: 2026-07-14
  author at start life: Nic Roest (Idoro)
  date of start life: 2007-11-29
  on class: Infiltrerend oppervlak
  on property: has as aspect
  max qualified cardinality: 1
subclass of: Restriction
  author at start life: Marinus Vonhof
  date of start life: 2022-10-01
  on class: Retentiewaarde
  on property: has as aspect
  max qualified cardinality: 1
subclass of: Restriction
  author at start life: Marinus Vonhof
  date of start life: 2026-07-14
  on class: Gebiedsoriëntatie
  on property: has as aspect
  max qualified cardinality: 1
subclass of: Restriction
  author at start life: Marinus Vonhof
  date of start life: 2026-07-14
  on class: Sym_Infiltratievoorziening
  on property: is represented by
  max qualified cardinality: 1
subclass of: Restriction
  author at start life: Marinus Vonhof
  date of start life: 2026-07-24
  on class: Bergend oppervlak
  on property: has as aspect
  max qualified cardinality: 1
subclass of: Restriction
  author at start life: Marinus Vonhof
  date of start life: 2026-07-24
  on class: Status functioneren
  on property: has as aspect
  max qualified cardinality: 1
subclass of: Restriction
  author at start life: Marinus Vonhof
  date of start life: 2026-07-24
  on class: Theoretische levensduur
  on property: has as aspect
  max qualified cardinality: 1
subclass of: Restriction
  author at start life: Marinus Vonhof
  date of start life: 2026-07-24
  on class: DIT-riool
  on property: has as part
  min qualified cardinality: 0
subclass of: Restriction
  author at start life: Marinus Vonhof
  date of start life: 2026-07-24
  on class: DT-riool
  on property: has as part
  min qualified cardinality: 0
subclass of: Restriction
  author at start life: Marinus Vonhof
  date of start life: 2026-07-24
  on class: Drain
  on property: has as part
  min qualified cardinality: 0
subclass of: Restriction
  author at start life: Marinus Vonhof
  date of start life: 2026-07-24
  on class: Hemelwaterriool
  on property: has as part
  min qualified cardinality: 0
subclass of: Restriction
  author at start life: Marinus Vonhof
  date of start life: 2026-07-24
  on class: Infiltratiekoffer
  on property: has as part
  min qualified cardinality: 0
subclass of: Restriction
  author at start life: Marinus Vonhof
  date of start life: 2026-08-20
  on class: Infiltratieriool
  on property: has as part
  min qualified cardinality: 0
subclass of: Restriction
  author at start life: Marinus Vonhof
  date of start life: 2026-07-24
  on class: Infiltratiekrat
  on property: has as part
  min qualified cardinality: 0
subclass of: Restriction
  author at start life: Marinus Vonhof
  date of start life: 2026-07-24
  on class: Infiltratieput
  on property: has as part
  min qualified cardinality: 0
subclass of: Restriction
  author at start life: Marinus Vonhof
  date of start life: 2026-07-24
  on class: Inspectieput
  on property: has as part
  min qualified cardinality: 0
subclass of: Restriction
  author at start life: Marinus Vonhof
  date of start life: 2026-07-24
  on class: Kolk
  on property: has as part
  min qualified cardinality: 0
subclass of: Restriction
  author at start life: Marinus Vonhof
  date of start life: 2026-07-24
  on class: Revisietekening
  on property: is represented by
  min qualified cardinality: 0
subclass of: Restriction
  author at start life: Marinus Vonhof
  date of start life: 2026-08-04
  on class: Infiltratiestelsel
  on property: has as part (inverse)
  max qualified cardinality: 1
subclass of: Restriction
  on property: heeft Functie
  has value: HemelwaterAfvoerenNaarOndergrond

Slokop
author of change: Marinus Vonhof
date of change: 2017-05-31
definition: Een regelvoorziening voor het laten wegstromen van overtollig hemelwater bij een infiltratievoorziening
author at start life: Finy Teitsma (Oranjewoud)
date of start life: 2007-10-23
validity context: 1d 3d
scope note: Collection of facts BAS
scope note: Collection of facts HYD
type: Class
subclass of: Put
subclass of: Restriction
  author at start life: Marinus Vonhof
  date of start life: 2019-05-15
  on class: Overstortdrempel
  on property: has as part
  qualified cardinality: 1
subclass of: Restriction
  author at start life: Marinus Vonhof
  date of start life: 2019-10-08
  on class: Sym_DefaultPut
  on property: is represented by
  max qualified cardinality: 1
subclass of: Restriction
  author at start life: Marinus Vonhof
  date of start life: 2026-07-24
  on class: Begroeide infiltratievoorziening
  on property: has as part (inverse)
  qualified cardinality: 1
subclass of: Restriction
  on property: heeft Functie
  has value: OpvangHemelwater
subclass of: Restriction
  on property: heeft Functie
  has value: OvertolligHemelwaterInfiltratievoorzieningAfvoeren
subclass of: Restriction
  on class: Rooster
  on property: has as part
  max qualified cardinality: 1

Infiltratiecompartiment
definition: Een bovengrondse ruimte binnen een infiltratievoorziening waarin zich het hemelwater verzameld, waarna het infiltreert in de ondergrond en/of daarin aanwezige objecten
author at start life: Marinus Vonhof
date of start life: 2026-07-14
scope note: Collection of facts MDS
scope note: Collection of facts HYD
type: Class
subclass of: Reservoir
subclass of: Restriction
  author at start life: Marinus Vonhof
  date of start life: 2026-07-24
  on class: Compartimentoriëntatie
  on property: has as aspect
  max qualified cardinality: 1
subclass of: Restriction
  author at start life: Marinus Vonhof
  date of start life: 2026-07-24
  on class: Taludhelling
  on property: has as aspect
  max qualified cardinality: 1
subclass of: Restriction
  on property: heeft Functie
  has value: AfvoerVanHemelwater
subclass of: Restriction
  on class: Begroeide infiltratievoorziening
  on property: has as part (inverse)
  qualified cardinality: 1

Beheerder
author of change: Marinus Vonhof
date of change: 2025-01-16
date of change: 2016-04-25
definition: Degene die als natuurlijk persoon handelende in de uitoefening van een beroep of bedrijf dan wel als rechtspersoon iets beheert
definition: [IMBOR] Een publiekrechtelijke instantie of (rechts)persoon die toeziet op de instandhouding van o.a. een object, kunstwerk of waterstaatswerk. De domeinwaardenindeling is conform de indeling in bronhouders (BGT).
author at start life: Marinus Vonhof
date of start life: 2012-04-29
validity context: 1d 3f 10d 12d 14f
scope note: Collection of facts MDS
scope note: Collection of facts RRB
scope note: Collection of facts LDR
scope note: Collection of facts DMO
type: Class
subclass of: Levensvorm

Bekabeling
definition: (Glasvezel)bekabeling welke aangelegd is met gebruikmaking van het riool.
author at start life: Eric van Gorkom
date of start life: 2022-09-27
validity context: 10d
scope note: Collection of facts BAS
type: Class
subclass of: Constructieonderdeel
subclass of: Restriction
  on property: heeft Functie
  has value: VoortgeleidingVanSignaal
subclass of: Restriction
  on class: Put
  on property: has as part (inverse)
  min qualified cardinality: 0
subclass of: Restriction
  on class: Rioolleiding
  on property: has as part (inverse)
  min qualified cardinality: 0

Belastingklasse
author of change: Marinus Vonhof
date of change: 2024-07-17
definition: Constructieve ontwerpnorm
author at start life: Eric van Gorkom
date of start life: 2024-05-13
validity context: 15d
alternative label: Verkeerklasse
comment: [is aspect]
scope note: Collection of facts BAS
type: Class
subclass of: Kenmerk

Belastingklasse DIN19580/EN1433
author of change: Marinus Vonhof
date of change: 2024-12-16
definition: Belastingklassen volgens DIN 19580 / EN 1433
author at start life: Marinus Vonhof
date of start life: 2021-08-06
comment: [is aspect]
scope note: Collection of facts BAS
type: Class
subclass of: Belastingklasse
subclass of: Restriction
  author at start life: Marinus Vonhof
  date of start life: 2021-08-06
  on class: Rooster
  on property: has as aspect (inverse)
  max qualified cardinality: 1
subclass of: Restriction
  author at start life: Marinus Vonhof
  date of start life: 2026-07-16
  on class: Infiltratievoorziening
  on property: has as aspect (inverse)
  max qualified cardinality: 1
subclass of: Restriction
  author at start life: Marinus Vonhof
  date of start life: 2026-07-24
  on class: Infiltratiekoffer
  on property: has as aspect (inverse)
  max qualified cardinality: 1
subclass of: Restriction
  author at start life: Marinus Vonhof
  date of start life: 2026-07-24
  on class: Infiltratiekrat
  on property: has as aspect (inverse)
  max qualified cardinality: 1
subclass of: Restriction
  on property: has as reference (qualification)
  all values from: Belastingklasse DIN19580/EN1433 (coll)

Rooster
author of change: Marinus Vonhof
author of change: Johan Post
date of change: 2025-01-16
date of change: 2026-05-01
definition: Een open constructie van spijlen of sleuven die wordt toegepast om doorlaat van water of lucht mogelijk te maken, terwijl het toegang, instroom of doorgang van ongewenste objecten beperkt of voorkomt
definition: [IMBOR] Een in de ondergrond aangebracht horizontaal raamwerk dat dient voor infiltratie.
author at start life: Marinus Vonhof
date of start life: 2016-04-15
scope note: Collection of facts MDS
scope note: Collection of facts REV
type: Class
subclass of: Afdekking
subclass of: Restriction
  author at start life: Marinus Vonhof
  date of start life: 2016-04-15
  on class: Roostergoot
  on property: has as part (inverse)
  max qualified cardinality: 1
subclass of: Restriction
  author at start life: Marinus Vonhof
  date of start life: 2021-08-06
  on class: Belastingklasse DIN19580/EN1433
  on property: has as aspect
  max qualified cardinality: 1
subclass of: Restriction
  author at start life: Marinus Vonhof
  date of start life: 2026-08-04
  on class: Lijngoot
  on property: has as part (inverse)
  max qualified cardinality: 1
subclass of: Restriction
  on property: heeft Functie
  has value: Afschermen
subclass of: Restriction
  on property: heeft Uitvoering
  has value: Doorlatend
subclass of: Restriction
  on class: Infiltratieput
  on property: has as part (inverse)
  qualified cardinality: 1
subclass of: Restriction
  on class: Ontlastput
  on property: has as part (inverse)
  qualified cardinality: 1
subclass of: Restriction
  on class: Slokop
  on property: has as part (inverse)
  qualified cardinality: 1

Infiltratiekoffer
author of change: Marinus Vonhof
author of change: Johan Post
author of change: Eric van Gorkom
date of change: 2024-05-01
date of change: 2021-10-01
date of change: 2026-07-13
date of change: 2024-05-13
definition: Een in de ondergrond aangebrachte ruimte gevuld met een substraat met een hoge porositeit, waarin het hemelwater wordt verdeeld over de ruimte en daarin tijdelijk wordt geborgen, waarbij het hemelwater via de bodem en wanden infiltreert in de ondergrond.
author at start life: Marinus Vonhof
date of start life: 2016-04-20
comment: Vanaf versie 1.7.0 vervangt Infiltratiekoffer/-krat het concept Infiltratiereservoir
comment: Vanaf versie 1.7.0 kan het substraat-materiaal expliciet worden beschreven, daarmee is het gebruik van de subtypes Zandkoffer, Grindkoffer en dergelijke (voor gegevensuitwisseling) niet meer nodig.
alternative label: Infiltratiereservoir
scope note: Collection of facts MDS
scope note: Collection of facts HYD
type: Class
subclass of: Reservoir
subclass of: Restriction
  author at start life: Marinus Vonhof
  date of start life: 2019-07-10
  on class: Drain
  on property: has as part
  min qualified cardinality: 0
subclass of: Restriction
  author at start life: Marinus Vonhof
  date of start life: 2026-07-13
  validity context: *t
  on class: Substraat kern
  on property: has as part
  qualified cardinality: 1
subclass of: Restriction
  author at start life: Marinus Vonhof
  date of start life: 2026-07-14
  on class: Omhulling
  on property: has as part
  min qualified cardinality: 0
subclass of: Restriction
  author at start life: Marinus Vonhof
  date of start life: 2026-07-24
  on class: Belastingklasse DIN19580/EN1433
  on property: has as aspect
  max qualified cardinality: 1
subclass of: Restriction
  author at start life: Marinus Vonhof
  date of start life: 2026-07-24
  on class: Infiltratievoorziening
  on property: has as part (inverse)
  qualified cardinality: 1
subclass of: Restriction
  date of change: 2016-04-20
  author at start life: Nic Roest (Idoro)
  date of start life: 2007-11-29
  on class: Uitstroomniveau
  on property: has as aspect
  max qualified cardinality: 1
subclass of: Restriction
  on property: heeft Functie
  has value: AfvoerenHemelwaterNaarDeOndergrond
subclass of: Restriction
  on property: heeft Technologie
  has value: Infiltreren
subclass of: Restriction
  on property: heeft Functie
  has value: TijdelijkeBergingVanHemelwater
subclass of: Restriction
  on class: Putdeksel
  on property: has as part
  min qualified cardinality: 0

Infiltratiekrat
author of change: Marinus Vonhof
author of change: Johan Post
date of change: 2024-04-30
date of change: 2026-07-13
definition: Een ondergrondse holle ruimte gevuld met individuele kratjes bestemd voor de berging van hemelwater, waarbij het hemelwater door middel van infiltratie door de wanden kan worden afgevoerd.
author at start life: Marinus Vonhof
date of start life: 2015-09-20
validity context: 1d 10d 12d
scope note: Collection of facts MDS
scope note: Collection of facts HYD
type: Class
subclass of: Reservoir
subclass of: Restriction
  author of change: Marinus Vonhof
  date of change: 2026-07-24
  author at start life: Marinus Vonhof
  date of start life: 2017-05-31
  on class: Infiltratievoorziening
  on property: has as part (inverse)
  qualified cardinality: 1
subclass of: Restriction
  author of change: Marinus Vonhof
  date of change: 2017-05-20
  date of change: 2026-07-14
  author at start life: Nic Roest (Idoro)
  date of start life: 2007-11-29
  on class: Porositeit
  on property: has as aspect
  max qualified cardinality: 1
subclass of: Restriction
  author at start life: Marinus Vonhof
  date of start life: 2026-07-24
  on class: Belastingklasse DIN19580/EN1433
  on property: has as aspect
  max qualified cardinality: 1
subclass of: Restriction
  author at start life: Marinus Vonhof
  date of start life: 2026-07-24
  on class: Doorlaatbaarheid
  on property: has as aspect
  max qualified cardinality: 1
subclass of: Restriction
  author at start life: Marinus Vonhof
  date of start life: 2026-07-24
  on class: Omhulling
  on property: has as part
  min qualified cardinality: 0
subclass of: Restriction
  on property: heeft Functie
  has value: HemelwaterAfvoerenNaarOndergrond

Belastingklasse DIN19580/EN1433 (coll)
comment: [is coll]
scope note: Collection of facts BAS
type: Class
subclass of: Verzameling soorten
subclass of: Class
  one of: KlasseA15
  one of: KlasseB125
  one of: KlasseC250
  one of: KlasseD400
  one of: KlasseE600
  one of: KlasseF900

Vacuümleiding
label: Vacuum main @en
author of change: Marinus Vonhof
author of change: Johan Post
date of change: 2021-08-06
date of change: 2026-07-02
definition: Leiding bestemd voor de inzameling en het transport van huishoudelijk- en bedrijfsafvalwater, niet zijnde neerslag waarin het afvalwater door middel van onderdruk wordt getransporteerd
definition: [EN 16323:2014] pipeline for conveying wastewater under vacuum @en
definition: [NEN 3300:1996] leiding waardoor afvalwater door onderdruk wordt getransporteerd
author at start life: Finy Teitsma (Oranjewoud)
date of start life: 2007-10-23
validity context: 1d
scope note: Collection of facts MDS
scope note: Collection of facts RGM
type: Class
subclass of: Mechanische rioolleiding
subclass of: Restriction
  author at start life: Marinus Vonhof
  date of start life: 2013-09-14
  on class: Vacuümriolering
  on property: has as part (inverse)
  qualified cardinality: 1
subclass of: Restriction
  author at start life: Marinus Vonhof
  date of start life: 2018-10-27
  on class: NLCS_VACUUMLEIDING
  on property: is represented by
  max qualified cardinality: 1
subclass of: Restriction
  author at start life: Marinus Vonhof
  date of start life: 2018-11-07
  on class: Sym_Vacuumleiding
  on property: is represented by
  max qualified cardinality: 1
subclass of: Restriction
  on property: heeft Functie
  has value: TransportVanVuilwater
subclass of: Restriction
  on class: Beluchter
  on property: has as part
  min qualified cardinality: 0

Energieverliescoëfficiënt
definition: Factor voor lokaal verlies van energie (bij appendages)
author at start life: Wouter van Riel
date of start life: 2024-04-23
comment: [is aspect]
scope note: Collection of facts BAS
scope note: Collection of facts PLI
type: Class
subclass of: Kenmerk
subclass of: Restriction
  author at start life: Wouter van Riel
  date of start life: 2024-04-23
  on class: Beluchter
  on property: has as aspect (inverse)
  max qualified cardinality: 1
subclass of: Restriction
  author at start life: Wouter van Riel
  date of start life: 2024-04-23
  on class: Lanceerpunt
  on property: has as aspect (inverse)
  max qualified cardinality: 1
subclass of: Restriction
  author at start life: Wouter van Riel
  date of start life: 2024-04-23
  on class: Mechanische afsluiter
  on property: has as aspect (inverse)
  max qualified cardinality: 1
subclass of: Restriction
  author at start life: Wouter van Riel
  date of start life: 2024-04-23
  on class: Ontluchter
  on property: has as aspect (inverse)
  max qualified cardinality: 1
subclass of: Restriction
  author at start life: Wouter van Riel
  date of start life: 2024-04-23
  on class: Ontspanningsventiel
  on property: has as aspect (inverse)
  max qualified cardinality: 1
subclass of: Restriction
  author at start life: Wouter van Riel
  date of start life: 2024-04-23
  on class: Waterslagvoorziening
  on property: has as aspect (inverse)
  max qualified cardinality: 1
subclass of: Restriction
  on property: has as value
  all values from: Energieverliescoëfficiënt (datatype)

Beluchtingsleiding
definition: [NEN 3300:1996] Leiding bestemd voor de aanvoer van lucht
author at start life: Marinus Vonhof
date of start life: 2022-09-30
validity context: *d
scope note: Collection of facts BAS
type: Class
subclass of: NEN 3300 Term

Beluchtingsventiel
author of change: Marinus Vonhof
date of change: 2018-12-06
definition: Ventiel dat wordt gebruikt om een mechanische leiding te beluchten
author at start life: Marinus Vonhof
date of start life: 2018-12-05
validity context: 10d
scope note: Collection of facts BAS
scope note: Collection of facts PLI
type: Class
subclass of: Ontspanningsventiel
subclass of: Restriction
  author of change: Marinus Vonhof
  date of change: 2018-12-05
  author at start life: Nic Roest (Idoro)
  date of start life: 2007-11-29
  on class: Besturingskast
  on property: is connected to
  max qualified cardinality: 1
subclass of: Restriction
  on property: heeft Functie
  has value: BeluchtenMechanischeLeiding

Ontspanningsventiel
author of change: Marinus Vonhof
author of change: Wouter van Riel
date of change: 2013-10-02
date of change: 2024-04-23
definition: [NEN-EN 752:2008] ventiel dat wordt gebruikt om een persleiding te beluchten of te ontluchten
author at start life: Marinus Vonhof
date of start life: 2012-04-29
validity context: 10d
scope note: Collection of facts BAS
scope note: Collection of facts PLI
type: Class
subclass of: Constructieonderdeel
subclass of: Restriction
  author of change: Marinus Vonhof
  date of change: 2018-12-05
  author at start life: Finy Teitsma (Oranjewoud)
  date of start life: 2006-05-01
  on class: Mechanische rioolleiding
  on property: has as part (inverse)
  max qualified cardinality: 2
subclass of: Restriction
  author of change: Marinus Vonhof
  date of change: 2018-12-05
  author at start life: Marinus Vonhof
  date of start life: 2014-12-02
  on class: Mechanische transportleiding
  on property: has as part (inverse)
  max qualified cardinality: 2
subclass of: Restriction
  author of change: Marinus Vonhof
  date of change: 2019-03-20
  author at start life: Marinus Vonhof
  date of start life: 2017-03-29
  on class: Service mechanisch
  on property: has as input (inverse)
  max qualified cardinality: 1
subclass of: Restriction
  author at start life: Marinus Vonhof
  date of start life: 2018-11-07
  on class: Sym_Ontspanningsventiel
  on property: is represented by
  max qualified cardinality: 1
subclass of: Restriction
  author at start life: Wouter van Riel
  date of start life: 2024-04-23
  on class: Energieverliescoëfficiënt
  on property: has as aspect
  max qualified cardinality: 1
subclass of: Restriction
  on property: heeft Functie
  has value: Be OfOntluchten
subclass of: Restriction
  on property: heeft Functie
  has value: LuchtInMechanischeLeidingRegelen

Besturingskast
author of change: Marinus Vonhof
author of change: Johan Post
date of change: 2025-01-16
date of change: 2018-05-03
date of change: 2026-05-01
definition: Een toestel dat door middel van elektrische signalen de werking van een mechanische regelvoorziening regelt.
definition: [IMBOR] Een voedingskast die de aanvoer van elektriciteit naar een pomp regelt. Een toestel dat door middel van elektrische signalen de werking van een mechanische regelvoorziening regelt.
author at start life: Finy Teitsma (Oranjewoud)
date of start life: 2007-10-23
validity context: 1d 3d
comment: [VervallenLink http://definities.geostandaarden.nl/concepten/imgeo/doc/begrip/Besturingskast]
see also: [IMGeo:1.0/2007] Kast ten behoeve van de regeling van het transport van rioolwater.
alternative label: Rioolkast (type kast)
scope note: Collection of facts MDS
scope note: Collection of facts RGM
type: Class
subclass of: Elektriciteitskast
subclass of: Restriction
  author of change: Finy Teitsma (Oranjewoud)
  date of change: 2007-11-29
  author at start life: Finy Teitsma (Oranjewoud)
  date of start life: 2007-10-23
  on class: Pomp
  on property: is connected to
  min qualified cardinality: 0
subclass of: Restriction
  author of change: Marinus Vonhof
  date of change: 2015-09-20
  author at start life: Finy Teitsma (Oranjewoud)
  date of start life: 2007-11-30
  on class: Ontluchter
  on property: is connected to
  min qualified cardinality: 0
subclass of: Restriction
  author of change: Marinus Vonhof
  date of change: 2018-12-05
  author at start life: Nic Roest (Idoro)
  date of start life: 2007-11-29
  on class: Beluchtingsventiel
  on property: is connected to
  min qualified cardinality: 0
subclass of: Restriction
  author of change: Marinus Vonhof
  date of change: 2019-05-15
  author at start life: Nic Roest (Idoro)
  date of start life: 2007-11-29
  on class: Mechanische afsluiter
  on property: is connected to
  max qualified cardinality: 1
subclass of: Restriction
  author at start life: Marinus Vonhof
  date of start life: 2018-10-27
  on class: NLCS_PERSLEIDING_GEMAAL_BESTURINGSKAST
  on property: is represented by
  max qualified cardinality: 1
subclass of: Restriction
  author at start life: Marinus Vonhof
  date of start life: 2018-10-27
  on class: NLCS_VACUUMLEIDING_GEMAAL_BESTURINGSKAST
  on property: is represented by
  max qualified cardinality: 1
subclass of: Restriction
  author at start life: Marinus Vonhof
  date of start life: 2020-04-17
  on class: Regelinrichting
  on property: has as part (inverse)
  max qualified cardinality: 1
subclass of: Restriction
  on property: heeft Functie
  has value: Aansturen
subclass of: Restriction
  on class: Pompput
  on property: has as part (inverse)
  max qualified cardinality: 1

Bemaling
definition: [NEN 3300:1996] Het door een pomp of vijzel verplaatsen van afvalwater
author at start life: Marinus Vonhof
date of start life: 2022-09-30
validity context: *d
scope note: Collection of facts BAS
type: Class
subclass of: NEN 3300 Term

Bemalingsgebied
author of change: Johan Post
date of change: 2021-10-01
definition: [NEN 3300:1996] een rioleringsgebied waaruit het afvalwater door een gemaal wordt verwijderd
author at start life: Marinus Vonhof
date of start life: 2013-02-05
scope note: Collection of facts REV
scope note: Collection of facts BAS
scope note: Collection of facts DMO
type: Class
subclass of: Rioleringsgebied
subclass of: Restriction
  on class: Sym_Gebiedsomtrek
  on property: is represented by
  max qualified cardinality: 1

Rioleringsgebied
author of change: Johan Post
date of change: 2022-09-29
date of change: 2024-10-21
definition: Een gebied zodanig gekozen dat het voldoende inzicht geeft in de belasting van oppervlaktewater en overnamepunt
author at start life: Marinus Vonhof
date of start life: 2014-11-30
validity context: 1d
see also: [IRIS-RIOKEN:2012] Het gebied waarbinnen 1 of meerdere inliggende rioolstelsel(s) het afvalwater naar 1 gemaal of overnamepunt transporteert/teren. Een rioleringsgebied kan een enkelvoudig gebied zijn, maar kan ook meerdere rioleringsgebieden omvatten.
scope note: Collection of facts REV
scope note: Collection of facts BAS
scope note: Collection of facts DMO
type: Class
subclass of: Gebied
subclass of: Restriction
  author of change: Marinus Vonhof
  date of change: 2015-07-08
  author at start life: Marinus Vonhof
  date of start life: 2014-12-02
  on class: Gemeentelijk gebied
  on property: has as part (inverse)
  max qualified cardinality: 1
subclass of: Restriction
  author of change: Marinus Vonhof
  date of change: 2016-10-25
  author at start life: Marinus Vonhof
  date of start life: 2014-12-03
  on class: Rioleringsgebied
  on property: has as part (inverse)
  max qualified cardinality: 1
subclass of: Restriction
  author of change: Marinus Vonhof
  date of change: 2016-10-25
  author at start life: Marinus Vonhof
  date of start life: 2014-12-03
  on class: Rioleringsgebied
  on property: has as part
  min qualified cardinality: 0
subclass of: Restriction
  author of change: Marinus Vonhof
  date of change: 2018-12-06
  author at start life: Marinus Vonhof
  date of start life: 2015-06-02
  on class: Zuiveringseenheid
  on property: has as part (inverse)
  qualified cardinality: 1
subclass of: Restriction
  author at start life: Marinus Vonhof
  date of start life: 2015-07-23
  on class: Code
  on property: has as aspect
  max qualified cardinality: 1
subclass of: Restriction
  author at start life: Marinus Vonhof
  date of start life: 2022-10-01
  on class: Stelsel
  on property: has as part
  min qualified cardinality: 0
subclass of: Restriction
  author at start life: Marinus Vonhof
  date of start life: 2022-10-01
  on class: Systeem
  on property: has as part
  min qualified cardinality: 0
subclass of: Restriction
  on class: Overnamepunt
  on property: has as part
  max qualified cardinality: 1
subclass of: Restriction
  on class: Sym_Gebiedsomtrek
  on property: is represented by
  max qualified cardinality: 1

Sym_Gebiedsomtrek
author of change: Johan Post
date of change: 2022-09-29
author at start life: Johan Post
date of start life: 2021-10-01
scope note: Collection of facts NLCS
type: Class
subclass of: Geo-symbool
subclass of: Restriction
  author at start life: Marinus Vonhof
  date of start life: 2018-11-07
  on class: Bemalingsgebied
  on property: is represented by (inverse)
  max qualified cardinality: 1
subclass of: Restriction
  on class: Rioleringsgebied
  on property: is represented by (inverse)
  max qualified cardinality: 1

Benedenstrooms eindriool
author of change: Marinus Vonhof
date of change: 2016-04-28
definition: Een gesloten rioolleiding die het afvalwater afvoert van het eindgemaal naar de RWZI
author at start life: Finy Teitsma (Oranjewoud)
date of start life: 2007-10-23
scope note: Collection of facts MDS
scope note: Collection of facts HYD
scope note: Collection of facts DMO
type: Class
subclass of: Transportrioolleiding
subclass of: Restriction
  on property: heeft Functie
  has value: AfvoerVanAfvalwaterNaarEenRWZI

Transportrioolleiding
author of change: Marinus Vonhof
date of change: 2015-07-28
definition: Een gesloten rioolleiding waarop in principe geen aansluitleidingen zijn aangesloten.
definition: [NEN 3300:1996] Riool hoofdzakelijk bestemd voor het transport van afvalwater
author at start life: Finy Teitsma (Oranjewoud)
date of start life: 2006-11-29
comment: 20151014: NEN3300-definitie aangepast
alternative label: Hoofdriool
alternative label: Moerriool
alternative label: Transportriool
scope note: Collection of facts MDS
scope note: Collection of facts REV
scope note: Collection of facts HYD
scope note: Collection of facts DMO
type: Class
subclass of: Vrijverval transportleiding
subclass of: Restriction
  author of change: Marinus Vonhof
  date of change: 2025-12-03
  author at start life: Marinus Vonhof
  date of start life: 2018-12-06
  on class: Vrijverval leidingsegment
  on property: has as part
  min qualified cardinality: 0
subclass of: Restriction
  author at start life: Marinus Vonhof
  date of start life: 2018-11-07
  on class: Sym_Transportrioolleiding
  on property: is represented by
  max qualified cardinality: 1
subclass of: Restriction
  on property: heeft Uitvoering
  has value: ZonderAansluitingen

Beoordelen
definition: [NEN 3300:1996] Vaststellen van het verschil tussen de huidige situatie en de gewenste situatie en het geven van een oordeel over het verschil; de gewenste situatie is vastgelegd in doelen, functionele eisen en maatstaven
author at start life: Marinus Vonhof
date of start life: 2022-09-30
validity context: *d
scope note: Collection of facts BAS
type: Class
subclass of: NEN 3300 Term

Perceelaansluitleiding
author of change: Marinus Vonhof
author of change: Johan Post
date of change: 2025-01-16
date of change: 2021-08-05
date of change: 2026-05-01
definition: Onderdeel van een openbaar hemelwaterstelsel, openbaar ontwateringsstelsel of openbaar vuilwaterriool waarop aansluiting van terrein- en/of gebouwriolering aanwezig of mogelijk is
author at start life: Finy Teitsma (Oranjewoud)
date of start life: 2006-02-20
scope note: Collection of facts MDS
scope note: Collection of facts LDR
type: Class
subclass of: Aansluitleiding
subclass of: Restriction
  author of change: Marinus Vonhof
  date of change: 2016-04-25
  author at start life: Finy Teitsma (Oranjewoud)
  date of start life: 2007-11-30
  on class: Perceelaansluiting
  on property: has as part (inverse)
  qualified cardinality: 1
subclass of: Restriction
  author at start life: Finy Teitsma (Oranjewoud)
  date of start life: 2007-11-30
  on class: Perceelaansluitpunt
  on property: is connected to
  qualified cardinality: 1
subclass of: Restriction
  author at start life: Marinus Vonhof
  date of start life: 2018-10-27
  on class: NLCS_HUISAANSLUITING
  on property: is represented by
  max qualified cardinality: 1
subclass of: Restriction
  author at start life: Marinus Vonhof
  date of start life: 2018-10-27
  on class: NLCS_PERCEELAANSLUITING
  on property: is represented by
  max qualified cardinality: 1
subclass of: Restriction
  author at start life: Marinus Vonhof
  date of start life: 2018-11-07
  on class: Sym_Perceelaansluitleiding
  on property: is represented by
  max qualified cardinality: 1
subclass of: Restriction
  on property: heeft Functie
  has value: PerceelaansluitpuntMetInlaatVerbinden
subclass of: Restriction
  on class: Gebouwaansluitpunt
  on property: is connected to
  max qualified cardinality: 1

Vervangen
author of change: Marinus Vonhof
date of change: 2020-10-28
definition: [NEN 3300:1996] Herstel van het oorspronkelijke functioneren, waarbij het bestaande object wordt verwijderd en een nieuw gelijkwaardig object wordt teruggeplaatst
author at start life: Marinus Vonhof
date of start life: 2012-04-29
validity context: 6d
scope note: Collection of facts BAS
scope note: Collection of facts PLI
scope note: Collection of facts MTR
type: Class
subclass of: Maatregel
subclass of: Restriction
  on property: heeft Functie
  has value: VervangenFunctie

Bergbezinkbassin
author of change: Eric van Gorkom
author of change: Wouter van Riel
date of change: 2024-05-13
date of change: 2021-09-23
definition: Een gesloten reservoir waarin het afvalwater tijdelijk wordt opgevangen met een slibreinigende voorziening
definition: [NEN 3300:1996] reservoir voor de tijdelijke opslag van afvalwater waarin tevens slibafzetting plaatsvindt met een voorziening om het slib te kunnen verwijderen en waaruit overstortingen kunnen plaatsvinden
notation: BBB
author at start life: Marinus Vonhof
date of start life: 2013-09-29
scope note: Collection of facts MDS
scope note: Collection of facts HYD
scope note: Collection of facts RGM
type: Class
subclass of: Reservoir
subclass of: Restriction
  author of change: Eric van Gorkom
  date of change: 2021-11-23
  author at start life: Marinus Vonhof
  date of start life: 2015-05-29
  on class: Overstortconstructie
  on property: has as part
  min qualified cardinality: 0
subclass of: Restriction
  author of change: Marinus Vonhof
  date of change: 2018-05-03
  author at start life: Finy Teitsma (Oranjewoud)
  date of start life: 2006-02-25
  on class: Bergend vermogen
  on property: has as aspect
  max qualified cardinality: 1
subclass of: Restriction
  author of change: Marinus Vonhof
  date of change: 2016-04-24
  author at start life: Marinus Vonhof
  date of start life: 2013-10-01
  on class: Gemengd rioolstelsel
  on property: has as part (inverse)
  qualified cardinality: 1
subclass of: Restriction
  author at start life: Marinus Vonhof
  date of start life: 2015-05-29
  on class: Ledigingsvoorziening
  on property: has as part
  max qualified cardinality: 1
subclass of: Restriction
  author at start life: Marinus Vonhof
  date of start life: 2015-05-29
  on class: Spoelvoorziening
  on property: has as part
  max qualified cardinality: 1
subclass of: Restriction
  author at start life: Marinus Vonhof
  date of start life: 2017-05-30
  on class: Fundering
  on property: has as part
  max qualified cardinality: 1
subclass of: Restriction
  author at start life: Marinus Vonhof
  date of start life: 2017-12-07
  on class: Stuwconstructie
  on property: has as part
  min qualified cardinality: 0
subclass of: Restriction
  author at start life: Marinus Vonhof
  date of start life: 2026-08-20
  validity context: *t
  on class: Bezinkcompartiment
  on property: has as part
  qualified cardinality: 1
subclass of: Restriction
  author at start life: Marinus Vonhof
  date of start life: 2018-10-27
  on class: NLCS_ITR_RETENTIE_BERGBEZINKBASIN
  on property: is represented by
  max qualified cardinality: 1
subclass of: Restriction
  author at start life: Marinus Vonhof
  date of start life: 2018-11-10
  on class: Sym_Bergbezinkbassin
  on property: is represented by
  max qualified cardinality: 1
subclass of: Restriction
  author at start life: Marinus Vonhof
  date of start life: 2020-04-17
  on class: Diffusiescherm
  on property: has as part
  max qualified cardinality: 1
subclass of: Restriction
  author at start life: Marinus Vonhof
  date of start life: 2020-04-17
  on class: Drijflaagschot
  on property: has as part
  max qualified cardinality: 1
subclass of: Restriction
  author at start life: Marinus Vonhof
  date of start life: 2020-04-17
  on class: Verbeterd hemelwaterstelsel
  on property: has as part (inverse)
  max qualified cardinality: 1
subclass of: Restriction
  author at start life: Wouter van Riel
  date of start life: 2021-09-23
  on property: heeft Functie
  has value: BezinkenStoffen
subclass of: Restriction
  author at start life: Wouter van Riel
  date of start life: 2021-09-23
  on property: heeft Functie
  has value: TijdelijkeBergingVanAfvalwater
subclass of: Restriction
  author at start life: Wouter van Riel
  date of start life: 2021-09-23
  on property: heeft Doel
  has value: VerminderenVuilbelastingVanOppervlaktewater
subclass of: Restriction
  author at start life: Wouter van Riel
  date of start life: 2021-09-23
  on property: heeft Doel
  has value: VerwijderenBezinksel
subclass of: Restriction
  on property: heeft Functie
  has value: RegelingVanDeAfvoerVanHetAfvalwater
subclass of: Restriction
  on class: Putdeksel
  on property: has as part
  min qualified cardinality: 0

Overstortconstructie
author of change: Marinus Vonhof
author of change: Johan Post
author of change: Wouter van Riel
date of change: 2024-04-22
date of change: 2015-06-01
date of change: 2026-06-30
definition: Een constructie die het overstorten van water bij een ontworpen peilverschil mogelijk maakt, gerealiseerd door een overstortdrempel eventueel aangevuld met een op elkaar afgestemde combinatie van terugslagklep en duikschot.
author at start life: Marinus Vonhof
date of start life: 2015-05-29
validity context: 10f 11f 14f
scope note: Collection of facts MDS
scope note: Collection of facts HYD
type: Class
subclass of: Constructieonderdeel
subclass of: Restriction
  author of change: Marinus Vonhof
  date of change: 2017-03-06
  author at start life: Marinus Vonhof
  date of start life: 2015-07-27
  on class: Bergingsleiding
  on property: has as part (inverse)
  max qualified cardinality: 1
subclass of: Restriction
  author of change: Marinus Vonhof
  date of change: 2018-05-03
  author at start life: Marinus Vonhof
  date of start life: 2015-05-29
  on class: Bergbezinkbassin
  on property: has as part (inverse)
  max qualified cardinality: 1
subclass of: Restriction
  author of change: Marinus Vonhof
  date of change: 2018-05-03
  author at start life: Marinus Vonhof
  date of start life: 2015-07-27
  on class: Bergbezinkleiding
  on property: has as part (inverse)
  max qualified cardinality: 1
subclass of: Restriction
  author of change: Marinus Vonhof
  date of change: 2019-05-15
  author at start life: Marinus Vonhof
  date of start life: 2015-05-29
  on class: Keerklep
  on property: has as part
  max qualified cardinality: 1
subclass of: Restriction
  author of change: Marinus Vonhof
  date of change: 2021-08-05
  author at start life: Marinus Vonhof
  date of start life: 2015-05-29
  comment: per definitie
  on class: Overstortdrempel
  on property: has as part
  min qualified cardinality: 1
subclass of: Restriction
  author at start life: Marinus Vonhof
  date of start life: 2015-05-29
  on class: Bergingsbassin
  on property: has as part (inverse)
  max qualified cardinality: 1
subclass of: Restriction
  author at start life: Marinus Vonhof
  date of start life: 2015-05-29
  on class: Duikschot
  on property: has as part
  max qualified cardinality: 1
subclass of: Restriction
  on property: heeft Functie
  has value: OvertolligAfvalwaterLatenWegstromen

Bergend vermogen
author of change: Nic Roest (Idoro)
author of change: Johan Post
date of change: 2026-05-21
date of change: 2006-11-23
definition: De hoeveelheid afvalwater die in de voorziening kan worden geborgen
author at start life: Nic Roest (Idoro)
date of start life: 2006-02-21
units of measurements: m3
comment: [is aspect]
scope note: Collection of facts MDS
scope note: Collection of facts RGM
type: Class
subclass of: Inhoud
subclass of: Restriction
  author of change: Marinus Vonhof
  date of change: 2018-05-03
  author at start life: Finy Teitsma (Oranjewoud)
  date of start life: 2006-02-25
  on class: Bergbezinkbassin
  on property: has as aspect (inverse)
  max qualified cardinality: 1
subclass of: Restriction
  author at start life: Marinus Vonhof
  date of start life: 2015-05-29
  on class: Bergingsbassin
  on property: has as aspect (inverse)
  max qualified cardinality: 1
subclass of: Restriction
  author at start life: Marinus Vonhof
  date of start life: 2026-07-26
  on class: Inwinning
  on property: has as aspect
  max qualified cardinality: 1
subclass of: Restriction
  author at start life: Nic Roest (Idoro)
  date of start life: 2007-11-29
  on class: Infiltratiekoffer
  on property: has as aspect (inverse)
  max qualified cardinality: 1
subclass of: Restriction
  on property: has as value
  all values from: decimal
subclass of: Restriction
  on class: Bufferput
  on property: has as aspect (inverse)
  max qualified cardinality: 1

Ledigingsvoorziening
author of change: Marinus Vonhof
date of change: 2025-01-16
definition: Voorziening voor het verwijderen van afvalwater
author at start life: Marinus Vonhof
date of start life: 2015-05-29
scope note: Collection of facts BAS
scope note: Collection of facts HYD
scope note: Collection of facts RGM
type: Class
subclass of: Constructieonderdeel
subclass of: Restriction
  author of change: Marinus Vonhof
  date of change: 2016-04-13
  author at start life: Marinus Vonhof
  date of start life: 2015-05-29
  on class: Pomp
  on property: has as part
  min qualified cardinality: 1
subclass of: Restriction
  author of change: Marinus Vonhof
  date of change: 2018-05-03
  author at start life: Marinus Vonhof
  date of start life: 2015-07-27
  on class: Bergbezinkleiding
  on property: has as part (inverse)
  max qualified cardinality: 1
subclass of: Restriction
  author at start life: Marinus Vonhof
  date of start life: 2015-05-29
  on class: Bergbezinkbassin
  on property: has as part (inverse)
  max qualified cardinality: 1
subclass of: Restriction
  author at start life: Marinus Vonhof
  date of start life: 2015-05-29
  on class: Bergingsbassin
  on property: has as part (inverse)
  max qualified cardinality: 1
subclass of: Restriction
  author at start life: Marinus Vonhof
  date of start life: 2015-05-29
  on class: Bezinkbassin
  on property: has as part (inverse)
  max qualified cardinality: 1
subclass of: Restriction
  author at start life: Marinus Vonhof
  date of start life: 2024-05-17
  on class: Schuif
  on property: has as part
  min qualified cardinality: 0
subclass of: Restriction
  on property: heeft Functie
  has value: VerwijderenVanWater

Spoelvoorziening
author of change: Marinus Vonhof
author of change: Johan Post
date of change: 2024-05-01
date of change: 2016-04-13
definition: Spoelvoorziening voor het opwoelen en verzamelen van bezinksel
author at start life: Marinus Vonhof
date of start life: 2015-05-29
validity context: 1d 5d 10d
scope note: Collection of facts BAS
type: Class
subclass of: Constructieonderdeel
subclass of: Restriction
  author of change: Marinus Vonhof
  date of change: 2015-09-20
  author at start life: Marinus Vonhof
  date of start life: 2015-07-27
  on class: Pomp
  on property: has as part
  min qualified cardinality: 0
subclass of: Restriction
  author of change: Marinus Vonhof
  date of change: 2017-03-06
  author at start life: Marinus Vonhof
  date of start life: 2015-07-27
  on class: Bergingsleiding
  on property: has as part (inverse)
  max qualified cardinality: 1
subclass of: Restriction
  author of change: Marinus Vonhof
  date of change: 2018-05-03
  author at start life: Marinus Vonhof
  date of start life: 2015-07-27
  on class: Bergbezinkleiding
  on property: has as part (inverse)
  max qualified cardinality: 1
subclass of: Restriction
  author at start life: Marinus Vonhof
  date of start life: 2015-05-29
  on class: Bergbezinkbassin
  on property: has as part (inverse)
  max qualified cardinality: 1
subclass of: Restriction
  author at start life: Marinus Vonhof
  date of start life: 2015-05-29
  on class: Bergingsbassin
  on property: has as part (inverse)
  max qualified cardinality: 1
subclass of: Restriction
  author at start life: Marinus Vonhof
  date of start life: 2015-05-29
  on class: Bezinkbassin
  on property: has as part (inverse)
  max qualified cardinality: 1
subclass of: Restriction
  author at start life: Marinus Vonhof
  date of start life: 2015-09-20
  on class: Spoelleiding
  on property: has as part
  min qualified cardinality: 0
subclass of: Restriction
  author at start life: Marinus Vonhof
  date of start life: 2024-05-17
  on class: Schuif
  on property: has as part
  min qualified cardinality: 0
subclass of: Restriction
  on property: heeft Functie
  has value: OpwoelenEnVerzamelenVanBezinksel
subclass of: Restriction
  on property: heeft Doel
  has value: VerwijderenVanBezinksel
subclass of: Restriction
  on class: Spoelklep
  on property: has as part
  min qualified cardinality: 0

Fundering
author of change: Marinus Vonhof
date of change: 2025-01-16
date of change: 2018-05-03
definition: [IMBOR] Ondersteuning van het object via de ondergrond.
author at start life: Nic Roest (Idoro)
date of start life: 2006-02-21
validity context: 1d 3f 10d 12d 14f
scope note: Collection of facts MDS
scope note: Collection of facts RGM
type: Class
subclass of: Constructieonderdeel
subclass of: Restriction
  author of change: Finy Teitsma (Oranjewoud)
  date of change: 2006-04-20
  author at start life: Finy Teitsma (Oranjewoud)
  date of start life: 2006-02-25
  on class: Rioolput
  on property: has as part (inverse)
  max qualified cardinality: 1
subclass of: Restriction
  author of change: Marinus Vonhof
  date of change: 2018-05-03
  author at start life: Finy Teitsma (Oranjewoud)
  date of start life: 2006-02-25
  on class: Leiding
  on property: has as part (inverse)
  max qualified cardinality: 1
subclass of: Restriction
  author at start life: Marinus Vonhof
  date of start life: 2017-05-30
  on class: Bergbezinkbassin
  on property: has as part (inverse)
  max qualified cardinality: 1
subclass of: Restriction
  author at start life: Marinus Vonhof
  date of start life: 2017-05-30
  on class: Bergingsbassin
  on property: has as part (inverse)
  max qualified cardinality: 1
subclass of: Restriction
  author at start life: Marinus Vonhof
  date of start life: 2017-05-30
  on class: Bezinkbassin
  on property: has as part (inverse)
  max qualified cardinality: 1
subclass of: Restriction
  author at start life: Marinus Vonhof
  date of start life: 2018-05-03
  on class: Materiaal fundering
  on property: has as aspect
  max qualified cardinality: 1
subclass of: Restriction
  author at start life: Marinus Vonhof
  date of start life: 2018-05-03
  on property: has as aspect
  some values from: Materiaal fundering
subclass of: Restriction
  author at start life: Marinus Vonhof
  date of start life: 2018-12-06
  on class: Bouwwerk
  on property: has as part (inverse)
  max qualified cardinality: 1
subclass of: Restriction
  on property: heeft Functie
  has value: OndersteunenViaDeOndergrond

Stuwconstructie
label: Weir @en
author of change: Marinus Vonhof
author of change: Wouter van Riel
date of change: 2025-01-16
date of change: 2024-04-22
date of change: 2018-05-17
definition: [EN 16323:2014] overflow structure that can be used for controlling upstream surface level or for measuring discharge, or for both @en
definition: [IMBOR] Een inrichting waarmee bij regen de afstroming van rioolwater uit hooggelegen riolen wordt vertraagd.
author at start life: Marinus Vonhof
date of start life: 2013-09-28
validity context: 1d
scope note: Collection of facts MDS
scope note: Collection of facts HYD
scope note: Collection of facts DMO
type: Class
subclass of: Constructieonderdeel
subclass of: Restriction
  author of change: Marinus Vonhof
  date of change: 2017-12-07
  author at start life: Finy Teitsma (Oranjewoud)
  date of start life: 2006-02-25
  on class: Bergingsbassin
  on property: has as part (inverse)
  qualified cardinality: 1
subclass of: Restriction
  author of change: Marinus Vonhof
  date of change: 2018-12-12
  author at start life: Marinus Vonhof
  date of start life: 2015-09-07
  on class: Opening in wand
  on property: has as part
  min qualified cardinality: 0
subclass of: Restriction
  author of change: Marinus Vonhof
  date of change: 2020-04-17
  author at start life: Marinus Vonhof
  date of start life: 2014-04-29
  comment: per definitie
  on class: Stuwklep
  on property: has as part
  max qualified cardinality: 1
subclass of: Restriction
  author at start life: Marinus Vonhof
  date of start life: 2017-03-29
  on class: Stuwmuur
  on property: has as part
  qualified cardinality: 1
subclass of: Restriction
  author at start life: Marinus Vonhof
  date of start life: 2017-12-07
  on class: Bergbezinkbassin
  on property: has as part (inverse)
  max qualified cardinality: 1
subclass of: Restriction
  author at start life: Marinus Vonhof
  date of start life: 2018-12-12
  on class: Wervelventiel
  on property: has as part
  max qualified cardinality: 1
subclass of: Restriction
  on property: heeft Functie
  has value: BovenstroomsWaterpeilRegelen

Bezinkcompartiment
definition: Een compartiment (fysiek onderdeel) van een bergbezinkvoorziening dat is bedoeld voor tijdelijke berging van afvalwater en het bevorderen van bezinking van zwevende stoffen door lage stroomsnelheid. Het compartiment wordt doorgaans gemodelleerd met leiding-eigenschappen: een leiding met ronde of vierkante vorm, aangelegd met bodemverhang.
author at start life: Marinus Vonhof
date of start life: 2026-08-21
scope note: Collection of facts MDS
scope note: Collection of facts HYD
type: Class
subclass of: Leiding
subclass of: Restriction
  on property: heeft Functie
  has value: BezinkenStoffen
subclass of: Restriction
  on property: heeft Functie
  has value: TransportVanAfvalwater
subclass of: Restriction
  validity context: *t
  on class: Bergbezinkbassin
  on property: has as part (inverse)
  qualified cardinality: 1

NLCS_ITR_RETENTIE_BERGBEZINKBASIN
author of change: Marinus Vonhof
date of change: 2018-11-07
definition: Lijntype: CONTINUOUS
notation: 1981
author at start life: Marinus Vonhof
date of start life: 2018-10-27
scope note: Collection of facts NLCS
type: Class
subclass of: NLCS_Object
subclass of: Restriction
  author at start life: Marinus Vonhof
  date of start life: 2018-10-27
  on class: Bergbezinkbassin
  on property: is represented by (inverse)
  max qualified cardinality: 1

Sym_Bergbezinkbassin
author of change: Marinus Vonhof
date of change: 2019-10-08
definition: Standaard stijl: Vorm half vierkant, Lijnkleur 35 35 35, Vulkleur 255 127 0, Grootte 10
author at start life: Marinus Vonhof
date of start life: 2018-11-10
scope note: Collection of facts NLCS
type: Class
subclass of: Geo-symbool
subclass of: Restriction
  author at start life: Marinus Vonhof
  date of start life: 2018-11-10
  on class: Bergbezinkbassin
  on property: is represented by (inverse)
  max qualified cardinality: 1
subclass of: Restriction
  author at start life: Marinus Vonhof
  date of start life: 2018-11-10
  on class: Bergingsbassin
  on property: is represented by (inverse)
  max qualified cardinality: 1
subclass of: Restriction
  author at start life: Marinus Vonhof
  date of start life: 2018-11-10
  on class: Bergingsvijver
  on property: is represented by (inverse)
  max qualified cardinality: 1
subclass of: Restriction
  author at start life: Marinus Vonhof
  date of start life: 2018-11-10
  on class: Bezinkbassin
  on property: is represented by (inverse)
  max qualified cardinality: 1

Diffusiescherm
author of change: Marinus Vonhof
author of change: Johan Post
date of change: 2025-01-16
date of change: 2024-04-30
definition: Een obstructie in het onbelemmerde transport van water, vooral om de stromingsenergie te verlagen waardoor bezinking van materiaal mogelijk wordt.
author at start life: Marinus Vonhof
date of start life: 2020-04-17
validity context: 10d
alternative label: Diffusiewand
scope note: Collection of facts BAS
type: Class
subclass of: Constructieonderdeel
subclass of: Restriction
  author at start life: Marinus Vonhof
  date of start life: 2020-04-17
  on class: Bergbezinkbassin
  on property: has as part (inverse)
  max qualified cardinality: 1
subclass of: Restriction
  on property: heeft Doel
  has value: BezinkenVanMateriaal
subclass of: Restriction
  on property: heeft Functie
  has value: StromingsenergieVerlagen

Drijflaagschot
author of change: Marinus Vonhof
author of change: Eric van Gorkom
date of change: 2025-01-16
date of change: 2024-05-13
definition: Constructie in een externe overstort wat drijvend vuil belemmert over te storten naar oppervlaktewater
definition: [IMBOR] Scherm dat wordt geïnstalleerd bij de externe overstort in de randvoorziening om te voorkomen dat verontreinigingen in het oppervlaktewater terechtkomen en dat het drijvende vuil belemmerd over te storten.
author at start life: Marinus Vonhof
date of start life: 2020-04-17
validity context: 10d
scope note: Collection of facts BAS
type: Class
subclass of: Constructieonderdeel
subclass of: Restriction
  author at start life: Marinus Vonhof
  date of start life: 2020-04-17
  on class: Bergbezinkbassin
  on property: has as part (inverse)
  max qualified cardinality: 1
subclass of: Restriction
  on property: heeft Functie
  has value: DrijvendMateriaalOpvangen
subclass of: Restriction
  on property: heeft Doel
  has value: SchoonhoudenOppervlaktewater

Verbeterd hemelwaterstelsel
author of change: Marinus Vonhof
date of change: 2019-03-20
definition: Hemelwaterstelsel met voorzieningen waardoor een deel van de neerslag naar het vuilwaterriool wordt afgevoerd of wordt gezuiverd door bijvoorbeeld een filterconstructie of wadi.
author at start life: Marinus Vonhof
date of start life: 2018-12-06
scope note: Collection of facts TOP
type: Class
subclass of: Hemelwaterstelsel
subclass of: Restriction
  author at start life: Marinus Vonhof
  date of start life: 2018-12-06
  on class: Verbeterd gescheiden systeem
  on property: has as part (inverse)
  qualified cardinality: 1
subclass of: Restriction
  author at start life: Marinus Vonhof
  date of start life: 2020-04-17
  on class: Bergbezinkbassin
  on property: has as part
  min qualified cardinality: 0
subclass of: Restriction
  author at start life: Marinus Vonhof
  date of start life: 2020-04-17
  on class: Bergingsbassin
  on property: has as part
  min qualified cardinality: 0
subclass of: Restriction
  author at start life: Marinus Vonhof
  date of start life: 2020-04-17
  on class: Bergingsvijver
  on property: has as part
  min qualified cardinality: 0
subclass of: Restriction
  author at start life: Marinus Vonhof
  date of start life: 2020-04-17
  on class: Bezinkbassin
  on property: has as part
  min qualified cardinality: 0
subclass of: Restriction
  author at start life: Marinus Vonhof
  date of start life: 2020-05-26
  on class: Rioolgemaal
  on property: has as part
  min qualified cardinality: 0
subclass of: Restriction
  on property: heeft Functie
  has value: TijdelijkeBergingVanHemelwater

Putdeksel
author of change: Marinus Vonhof
author of change: Eric van Gorkom
author of change: Wouter van Riel
date of change: 2025-01-16
date of change: 2024-04-22
date of change: 2024-05-13
definition: [IMBOR] Het deksel waarmee een rioolput wordt afgesloten.
author at start life: Marinus Vonhof
date of start life: 2011-12-02
validity context: 5d 11d
scope note: Collection of facts MDS
scope note: Collection of facts EN
scope note: Collection of facts RRB
scope note: Collection of facts REV
type: Class
subclass of: Deksel
subclass of: Restriction
  author at start life: Marinus Vonhof
  date of start life: 2018-12-06
  on class: Knevelvoorziening
  on property: has as part
  max qualified cardinality: 1
subclass of: Restriction
  author at start life: Marinus Vonhof
  date of start life: 2018-12-06
  on class: Ontluchtingsunit
  on property: has as part
  max qualified cardinality: 1
subclass of: Restriction
  author at start life: Wouter van Riel
  date of start life: 2024-04-22
  on class: Rioolput
  on property: has as part (inverse)
  max qualified cardinality: 1
subclass of: Restriction
  on property: heeft Functie
  has value: AfdekkenPut
subclass of: Restriction
  on class: Bergbezinkbassin
  on property: has as part (inverse)
  min qualified cardinality: 0
subclass of: Restriction
  on class: Bergingsbassin
  on property: has as part (inverse)
  min qualified cardinality: 0
subclass of: Restriction
  on class: Infiltratiekoffer
  on property: has as part (inverse)
  min qualified cardinality: 0
subclass of: Restriction
  on class: Zuiveringsreservoir
  on property: has as part (inverse)
  min qualified cardinality: 0

Bergbezinkleiding
author of change: Marinus Vonhof
date of change: 2018-05-03
date of change: 2026-08-20
definition: Een bergbezinkbassin voorzien van een gesloten leiding waarin het afvalwater tijdelijk wordt opgevangen met een slibreinigende voorziening
definition: [NEN 3300:1996] riool voor de tijdelijke opslag van afvalwater waarin tevens slibafzetting plaatsvindt met een voorziening om het slib te kunnen verwijderen en waaruit overstortingen kunnen plaatsvinden
notation: BBL
author at start life: Nic Roest (Idoro)
date of start life: 2006-03-23
alternative label: Bergbezinkriool
scope note: Collection of facts MDS
scope note: Collection of facts HYD
scope note: Collection of facts RGM
type: Class
subclass of: Bergbezinkbassin
subclass of: Restriction
  author at start life: Marinus Vonhof
  date of start life: 2019-10-08
  on class: Sym_Bergingsleiding
  on property: is represented by
  max qualified cardinality: 1
subclass of: Restriction
  on property: heeft Uitvoering
  has value: UitgevoerdAlsLeiding

Sym_Bergingsleiding
definition: Standaard stijl: Lijntype doorgetrokken, Lijnkleur 255 127 0, Lijndikte 2.0
author at start life: Marinus Vonhof
date of start life: 2019-10-08
scope note: Collection of facts NLCS
type: Class
subclass of: Geo-symbool
subclass of: Restriction
  author at start life: Marinus Vonhof
  date of start life: 2019-10-08
  on class: Bergbezinkleiding
  on property: is represented by (inverse)
  max qualified cardinality: 1
subclass of: Restriction
  author at start life: Marinus Vonhof
  date of start life: 2019-10-08
  on class: Bergingsleiding
  on property: is represented by (inverse)
  max qualified cardinality: 1

Bergend oppervlak
author of change: Marinus Vonhof
date of change: 2019-04-29
definition: Het oppervlak waarover het water op straat uitstroomt
author at start life: Marinus Vonhof
date of start life: 2011-12-15
units of measurements: m2
validity context: 15d
alternative label: Oppervlak water op straat
comment: [is aspect]
scope note: Collection of facts MDS
scope note: Collection of facts HYD
type: Class
subclass of: Kenmerk
subclass of: Restriction
  author of change: Marinus Vonhof
  date of change: 2018-05-03
  author at start life: Marinus Vonhof
  date of start life: 2011-12-15
  validity context: 5t 11t
  on class: Rioolput
  on property: has as aspect (inverse)
  max qualified cardinality: 1
subclass of: Restriction
  author at start life: Marinus Vonhof
  date of start life: 2018-12-06
  on class: Reservoir
  on property: has as aspect (inverse)
  max qualified cardinality: 1
subclass of: Restriction
  author at start life: Marinus Vonhof
  date of start life: 2026-07-24
  on class: Infiltratievoorziening
  on property: has as aspect (inverse)
  max qualified cardinality: 1
subclass of: Restriction
  author at start life: Marinus Vonhof
  date of start life: 2026-07-26
  on class: Inwinning
  on property: has as aspect
  max qualified cardinality: 1
subclass of: Restriction
  on property: has as value
  all values from: decimal

Inhoud
author of change: Marinus Vonhof
date of change: 2025-01-16
date of change: 2015-05-29
definition: [IMBOR] Kenmerk voor het volume van het beheerobject.
author at start life: Nic Roest (Idoro)
date of start life: 2006-02-21
units of measurements: m3
comment: [is aspect]
scope note: Collection of facts TOP
type: Class
subclass of: Kenmerk
subclass of: Restriction
  on property: has as value
  all values from: decimal

Bergingsbassin
label: Detention tank @en
author of change: Eric van Gorkom
author of change: Wouter van Riel
date of change: 2024-05-13
date of change: 2021-09-23
definition: Een gesloten reservoir waarin het afvalwater tijdelijk wordt opgevangen
definition: [EN 16323:2014] closed or open tank for the temporary storage of wastewater @en
definition: [NEN 3300:1996] reservoir voor de tijdelijke opslag van afvalwater, ter regeling van de afvoerhoeveelheid
definition: [NEN-EN 752:2008] tank of reservoir voor de tijdelijke opslag van afvalwater [EN1085:2007, definitie 2240]
author at start life: Nic Roest (Idoro)
date of start life: 2006-03-23
alternative label: Bufferbassin
alternative label: Retentiebassin
scope note: Collection of facts MDS
scope note: Collection of facts HYD
type: Class
subclass of: Reservoir
subclass of: Restriction
  author of change: Marinus Vonhof
  date of change: 2017-12-07
  author at start life: Finy Teitsma (Oranjewoud)
  date of start life: 2006-02-25
  on class: Stuwconstructie
  on property: has as part
  min qualified cardinality: 0
subclass of: Restriction
  author of change: Marinus Vonhof
  date of change: 2016-04-24
  author at start life: Marinus Vonhof
  date of start life: 2014-04-30
  on class: Gemengd rioolstelsel
  on property: has as part (inverse)
  qualified cardinality: 1
subclass of: Restriction
  author at start life: Marinus Vonhof
  date of start life: 2015-05-29
  on class: Bergend vermogen
  on property: has as aspect
  max qualified cardinality: 1
subclass of: Restriction
  author at start life: Marinus Vonhof
  date of start life: 2015-05-29
  on class: Ledigingsvoorziening
  on property: has as part
  max qualified cardinality: 1
subclass of: Restriction
  author at start life: Marinus Vonhof
  date of start life: 2015-05-29
  on class: Overstortconstructie
  on property: has as part
  max qualified cardinality: 1
subclass of: Restriction
  author at start life: Marinus Vonhof
  date of start life: 2015-05-29
  on class: Spoelvoorziening
  on property: has as part
  max qualified cardinality: 1
subclass of: Restriction
  author at start life: Marinus Vonhof
  date of start life: 2017-05-30
  on class: Fundering
  on property: has as part
  max qualified cardinality: 1
subclass of: Restriction
  author at start life: Marinus Vonhof
  date of start life: 2018-11-10
  on class: Sym_Bergbezinkbassin
  on property: is represented by
  max qualified cardinality: 1
subclass of: Restriction
  author at start life: Marinus Vonhof
  date of start life: 2020-04-17
  on class: Verbeterd hemelwaterstelsel
  on property: has as part (inverse)
  max qualified cardinality: 1
subclass of: Restriction
  author at start life: Wouter van Riel
  date of start life: 2021-09-23
  on property: heeft Functie
  has value: RegelingVanDeAfvoerVanHetAfvalwater
subclass of: Restriction
  author at start life: Wouter van Riel
  date of start life: 2021-09-23
  on property: heeft Functie
  has value: TijdelijkeBergingVanAfvalwater
subclass of: Restriction
  author at start life: Wouter van Riel
  date of start life: 2021-09-23
  on property: heeft Doel
  has value: VerminderenVuilbelastingVanOppervlaktewater
subclass of: Restriction
  on class: Putdeksel
  on property: has as part
  min qualified cardinality: 0

Bufferput
definition: Put die afvalwater buffert, vaak uitgerust met een vacuümklep waarmee vuilwater naar een vacuümriool wordt afgevoerd.
definition: [NEN 3300:1996] Put voor het inzamelen en tijdelijk opslaan van afvalwater.
author at start life: Johan Post
date of start life: 2026-05-21
alternative label: Vacuümput
scope note: Collection of facts BAS
type: Class
subclass of: Put
subclass of: Restriction
  author of change: Marinus Vonhof
  date of change: 2016-04-22
  author at start life: Marinus Vonhof
  date of start life: 2013-09-14
  on class: Vacuümriolering
  on property: has as part (inverse)
  max qualified cardinality: 1
subclass of: Restriction
  on property: heeft Functie
  has value: InzamelenEnKortstondigOpslaanAfvalwater
subclass of: Restriction
  on class: Bergend vermogen
  on property: has as aspect
  max qualified cardinality: 1
subclass of: Restriction
  on class: Kathodische bescherming
  on property: has as aspect
  max qualified cardinality: 1
subclass of: Restriction
  on class: Mechanische afsluiter
  on property: has as part
  min qualified cardinality: 0
subclass of: Restriction
  on class: Meetinstrument
  on property: has as part
  min qualified cardinality: 0
subclass of: Restriction
  on class: Vacuümklep
  on property: has as part
  min qualified cardinality: 0

Berging
definition: [NEN 3300:1996] De inhoud van de riolering uitgedrukt in m3 of in mm ten opzichte van het afvoerend oppervlak
author at start life: Marinus Vonhof
date of start life: 2022-09-30
validity context: *d
scope note: Collection of facts BAS
type: Class
subclass of: NEN 3300 Term

Berging op straat
definition: [NEN 3300:1996] Het gedeelte van de neerslag dat niet tot afstroming naar de riolering komt maar wordt geborgen op het afvoerende oppervlak en daar verdampt of infiltreert
author at start life: Marinus Vonhof
date of start life: 2022-09-30
validity context: *d
scope note: Collection of facts BAS
type: Class
subclass of: NEN 3300 Term

Bergings-hoogtekromme
definition: [NEN 3300:1996] De grafiek die het verband aangeeft tussen de inhoud van een rioolstelsel en het waterniveau in het rioolstelsel
author at start life: Marinus Vonhof
date of start life: 2022-09-30
validity context: *d
scope note: Collection of facts BAS
type: Class
subclass of: NEN 3300 Term

Bergingsleiding
author of change: Marinus Vonhof
date of change: 2015-07-27
definition: Een gesloten leiding waarin het afvalwater tijdelijk wordt opgevangen.
definition: [NEN 3300:1996] riool waardoor extra berging in het rioolstelsel wordt verkregen
definition: [NEN-EN 752:2008] deel van een riool dat als bergingsbassin fungeert
author at start life: Finy Teitsma (Oranjewoud)
date of start life: 2006-05-23
alternative label: Bergingsriool
alternative label: Retentieleiding
scope note: Collection of facts MDS
scope note: Collection of facts REV
scope note: Collection of facts HYD
type: Class
subclass of: Vrijverval rioolleiding
subclass of: Restriction
  author of change: Marinus Vonhof
  date of change: 2017-03-06
  author at start life: Marinus Vonhof
  date of start life: 2015-07-27
  on class: Overstortconstructie
  on property: has as part
  max qualified cardinality: 1
subclass of: Restriction
  author of change: Marinus Vonhof
  date of change: 2017-03-06
  author at start life: Marinus Vonhof
  date of start life: 2015-07-27
  on class: Spoelvoorziening
  on property: has as part
  max qualified cardinality: 1
subclass of: Restriction
  author at start life: Marinus Vonhof
  date of start life: 2019-10-08
  on class: Sym_Bergingsleiding
  on property: is represented by
  max qualified cardinality: 1
subclass of: Restriction
  on property: heeft Functie
  has value: TijdelijkeBergingVanAfvalwater

Bergingsverlies
definition: [NEN 3300:1996] Het verlies aan nuttige berging
author at start life: Marinus Vonhof
date of start life: 2022-09-30
validity context: *d
scope note: Collection of facts BAS
type: Class
subclass of: NEN 3300 Term

Bergingsvijver
author of change: Johan Post
date of change: 2021-09-23
definition: Een open reservoir (vijver, sloot, gracht, etc.), bestemd voor de berging van afvalwater ter regeling van de afvoer van het afvalwater.
definition: [NEN 3300:1996] open water voor de tijdelijke opslag van afvalwater
author at start life: Nic Roest (Idoro)
date of start life: 2006-03-23
validity context: 11d 12d
alternative label: Retentievijver
scope note: Collection of facts MDS
scope note: Collection of facts HYD
type: Class
subclass of: Reservoir
subclass of: Restriction
  author of change: Marinus Vonhof
  date of change: 2015-09-20
  author at start life: Marinus Vonhof
  date of start life: 2015-07-27
  on class: Folie
  on property: has as part
  max qualified cardinality: 1
subclass of: Restriction
  author of change: Marinus Vonhof
  date of change: 2016-04-22
  author at start life: Marinus Vonhof
  date of start life: 2014-04-30
  on class: Oppervlaktewatersysteem
  on property: has as part (inverse)
  qualified cardinality: 1
subclass of: Restriction
  author of change: Marinus Vonhof
  date of change: 2016-04-24
  author at start life: Marinus Vonhof
  date of start life: 2016-04-22
  on class: Gemengd rioolstelsel
  on property: has as part (inverse)
  qualified cardinality: 1
subclass of: Restriction
  author at start life: Finy Teitsma (Oranjewoud)
  date of start life: 2007-11-30
  on class: Lozingspunt
  on property: has as part
  min qualified cardinality: 1
subclass of: Restriction
  author at start life: Johan Post
  date of start life: 2021-09-23
  on property: heeft Functie
  has value: RegelingVanDeAfvoerVanHetAfvalwater
subclass of: Restriction
  author at start life: Johan Post
  date of start life: 2021-09-23
  on property: heeft Functie
  has value: TijdelijkeBergingVanAfvalwater
subclass of: Restriction
  author at start life: Johan Post
  date of start life: 2021-09-23
  on property: heeft Doel
  has value: VerminderenVuilbelastingVanOppervlaktewater
subclass of: Restriction
  author at start life: Marinus Vonhof
  date of start life: 2016-04-22
  on class: Hemelwaterstelsel
  on property: has as part (inverse)
  max qualified cardinality: 1
subclass of: Restriction
  author at start life: Marinus Vonhof
  date of start life: 2018-10-27
  on class: NLCS_ITR_RETENTIE_VIJVER
  on property: is represented by
  max qualified cardinality: 1
subclass of: Restriction
  author at start life: Marinus Vonhof
  date of start life: 2018-11-10
  on class: Sym_Bergbezinkbassin
  on property: is represented by
  max qualified cardinality: 1
subclass of: Restriction
  author at start life: Marinus Vonhof
  date of start life: 2020-04-17
  on class: Verbeterd hemelwaterstelsel
  on property: has as part (inverse)
  max qualified cardinality: 1

Folie
author of change: Marinus Vonhof
date of change: 2025-01-16
date of change: 2015-09-20
definition: [IMBOR] Een zeer dun doek dat gebruikt kan worden als kunstmatige waterbodem, bijvoorbeeld om verontreinigde grond te scheiden van het waterobject.
author at start life: Marinus Vonhof
date of start life: 2015-07-27
validity context: *d
scope note: Collection of facts BAS
type: Class
subclass of: Constructieonderdeel
subclass of: Restriction
  author of change: Marinus Vonhof
  date of change: 2015-09-20
  author at start life: Marinus Vonhof
  date of start life: 2015-07-27
  on class: Bergingsvijver
  on property: has as part (inverse)
  max qualified cardinality: 1
subclass of: Restriction
  on property: heeft Uitvoering
  has value: KunststofDoek

Lozingspunt
label: Discharge point @en
definition: Een knooppunt in een stelsel waar het afvalwater het stelsel verlaat of binnenkomt.
definition: [EN 16323:2014] point where wastewater is discharged into a receiving water @en
definition: [NEN 3300:1996] het punt waar afvalwater het in beschouwing genomen rioolstelsel in- of uitstroomt
author at start life: Marinus Vonhof
date of start life: 2015-07-27
see also: [20150227] Vanuit het stelsel gezien het punt waar het afvalwater het stelsel verlaat
see also: [IRIS-RIOKEN:2012] Het punt waar door middel van een werk (afval)water in het oppervlaktewater wordt gebracht. Het water is niet afkomstig uit een ander oppervlaktewater.
scope note: Collection of facts MDS
scope note: Collection of facts PLI
scope note: Collection of facts HYD
type: Class
subclass of: Aansluitpunt
subclass of: Restriction
  author of change: Finy Teitsma (Oranjewoud)
  date of change: 2007-11-29
  author at start life: Finy Teitsma (Oranjewoud)
  date of start life: 2007-10-23
  on class: Vrijverval drainagestelsel
  on property: has as part (inverse)
  max qualified cardinality: 1
subclass of: Restriction
  author of change: Marinus Vonhof
  date of change: 2016-04-13
  author at start life: Finy Teitsma (Oranjewoud)
  date of start life: 2007-10-24
  validity context: 5t 11t
  on class: Hemelwaterstelsel
  on property: has as part (inverse)
  max qualified cardinality: 1
subclass of: Restriction
  author of change: Marinus Vonhof
  date of change: 2016-04-22
  author at start life: Finy Teitsma (Oranjewoud)
  date of start life: 2007-10-24
  validity context: 5t 11t
  on class: Gemengd rioolstelsel
  on property: has as part (inverse)
  max qualified cardinality: 1
subclass of: Restriction
  author of change: Marinus Vonhof
  date of change: 2018-05-03
  author at start life: Finy Teitsma (Oranjewoud)
  date of start life: 2007-10-23
  on class: Mechanisch rioolstelsel
  on property: has as part (inverse)
  max qualified cardinality: 1
subclass of: Restriction
  author of change: Marinus Vonhof
  date of change: 2015-05-27
  author at start life: Marinus Vonhof
  date of start life: 2014-12-11
  on class: RWZI
  on property: is connected to
  max qualified cardinality: 1
subclass of: Restriction
  author at start life: Finy Teitsma (Oranjewoud)
  date of start life: 2007-11-30
  on class: Bergingsvijver
  on property: has as part (inverse)
  max qualified cardinality: 1
subclass of: Restriction
  author at start life: Marinus Vonhof
  date of start life: 2014-04-10
  on class: Mechanisch drainagestelsel
  on property: has as part (inverse)
  max qualified cardinality: 1
subclass of: Restriction
  author at start life: Marinus Vonhof
  date of start life: 2014-07-25
  on class: Waterdeel
  on property: has as part (inverse)
  max qualified cardinality: 1
subclass of: Restriction
  author at start life: Marinus Vonhof
  date of start life: 2014-12-02
  on class: Persleidingstelsel
  on property: has as part (inverse)
  max qualified cardinality: 1
subclass of: Restriction
  author at start life: Marinus Vonhof
  date of start life: 2015-03-01
  validity context: 5t 11t
  on class: Vuilwaterstelsel
  on property: has as part (inverse)
  max qualified cardinality: 1
subclass of: Restriction
  author at start life: Marinus Vonhof
  date of start life: 2018-10-27
  on class: NLCS_DRAINAGE_LOZINGSPUNT
  on property: is represented by
  max qualified cardinality: 1
subclass of: Restriction
  author at start life: Marinus Vonhof
  date of start life: 2018-10-27
  on class: NLCS_GWA_LOZINGSPUNT
  on property: is represented by
  max qualified cardinality: 1
subclass of: Restriction
  author at start life: Marinus Vonhof
  date of start life: 2018-10-27
  on class: NLCS_HWA_LOZINGSPUNT
  on property: is represented by
  max qualified cardinality: 1
subclass of: Restriction
  author at start life: Marinus Vonhof
  date of start life: 2018-10-27
  on class: NLCS_ITR_LOZINGSPUNT
  on property: is represented by
  max qualified cardinality: 1
subclass of: Restriction
  author at start life: Marinus Vonhof
  date of start life: 2018-10-27
  on class: NLCS_SWA_LOZINGSPUNT
  on property: is represented by
  max qualified cardinality: 1
subclass of: Restriction
  on property: heeft Functie
  has value: LozenAfvalwater

Hemelwaterstelsel
author of change: Marinus Vonhof
author of change: Johan Post
author of change: Wouter van Riel
date of change: 2024-05-16
date of change: 2021-10-01
date of change: 2024-04-22
definition: Een enkelvoudig vrijverval rioolstelsel bestemd voor de inzameling, het transport en de tijdelijke berging van hemelwater.
definition: [NEN 3300:1996] Rwa-rioolstelsel is synoniem van hemelwaterstelsel
definition: [NEN 3300:1996] rioolstelsel alleen bestemd voor de inzameling en het transport van neerslag
author at start life: Finy Teitsma (Oranjewoud)
date of start life: 2007-10-23
alternative label: HWA stelsel
alternative label: RWA-rioolstelsel
alternative label: Regenwaterrioolstelsel
scope note: Collection of facts TOP
type: Class
subclass of: Vrijverval rioolstelsel
subclass of: Restriction
  author of change: Marinus Vonhof
  date of change: 2014-04-30
  author at start life: Finy Teitsma (Oranjewoud)
  date of start life: 2007-10-24
  validity context: *t
  on class: Hemelwaterriool
  on property: has as part
  min qualified cardinality: 1
subclass of: Restriction
  author of change: Marinus Vonhof
  date of change: 2016-04-13
  author at start life: Finy Teitsma (Oranjewoud)
  date of start life: 2007-10-24
  validity context: 5t 11t
  on class: Lozingspunt
  on property: has as part
  min qualified cardinality: 1
subclass of: Restriction
  author of change: Marinus Vonhof
  date of change: 2016-04-13
  author at start life: Finy Teitsma (Oranjewoud)
  date of start life: 2007-10-24
  on class: Goot
  on property: has as part
  min qualified cardinality: 0
subclass of: Restriction
  author of change: Marinus Vonhof
  date of change: 2016-04-30
  author at start life: Finy Teitsma (Oranjewoud)
  date of start life: 2007-10-24
  on class: Kolkaansluiting
  on property: has as part
  min qualified cardinality: 0
subclass of: Restriction
  author of change: Marinus Vonhof
  date of change: 2018-12-13
  author at start life: Finy Teitsma (Oranjewoud)
  date of start life: 2007-11-29
  on class: Gescheiden systeem
  on property: has as part (inverse)
  qualified cardinality: 1
subclass of: Restriction
  author at start life: Marinus Vonhof
  date of start life: 2016-04-22
  on class: Bergingsvijver
  on property: has as part
  min qualified cardinality: 0
subclass of: Restriction
  author at start life: Marinus Vonhof
  date of start life: 2020-04-18
  on class: DIT-riool
  on property: has as part
  min qualified cardinality: 0
subclass of: Restriction
  author at start life: Marinus Vonhof
  date of start life: 2020-04-18
  on class: DT-riool
  on property: has as part
  min qualified cardinality: 0
subclass of: Restriction
  author at start life: Marinus Vonhof
  date of start life: 2020-05-26
  on class: Infiltratieriool
  on property: has as part
  min qualified cardinality: 0
subclass of: Restriction
  author at start life: Marinus Vonhof
  date of start life: 2022-10-03
  comment: 20160415: Inverse = optioneel, niet elke specialisatie zit in vv stelsel
  on class: Onderbemaling
  on property: has as part
  min qualified cardinality: 0
subclass of: Restriction
  author at start life: Marinus Vonhof
  date of start life: 2022-10-03
  on class: Gestuwd rioolstelsel
  on property: has as part
  min qualified cardinality: 0
subclass of: Restriction
  author at start life: Marinus Vonhof
  date of start life: 2024-05-16
  on class: Uitlaat (punt)
  on property: has as part
  min qualified cardinality: 1
subclass of: Restriction
  on property: heeft Functie
  has value: InzamelingVanHemelwater
subclass of: Restriction
  on property: heeft Functie
  has value: TransportVanHemelwater
subclass of: Restriction
  on class: Sym_Hemelwaterstelsel
  on property: is represented by
  max qualified cardinality: 1

NLCS_ITR_RETENTIE_VIJVER
author of change: Marinus Vonhof
date of change: 2018-11-07
definition: Lijntype: CONTINUOUS
notation: 1982
author at start life: Marinus Vonhof
date of start life: 2018-10-27
scope note: Collection of facts NLCS
type: Class
subclass of: NLCS_Object
subclass of: Restriction
  author at start life: Marinus Vonhof
  date of start life: 2018-10-27
  on class: Bergingsvijver
  on property: is represented by (inverse)
  max qualified cardinality: 1

Bermsloot
author of change: Marinus Vonhof
date of change: 2025-01-16
definition: [IMBOR] Een in de wegberm gelegen sloot die zorgt voor het afvoeren van (hemel)water van een weg.
author at start life: Marinus Vonhof
date of start life: 2017-05-31
validity context: 1d 3d 10d 12d 14d
scope note: Collection of facts MDS
type: Class
subclass of: Sloot
subclass of: Restriction
  on property: heeft Toepassing
  has value: InDeBerm

Sloot
author of change: Marinus Vonhof
date of change: 2025-01-16
definition: [IMBOR] Een gegraven watergang die dient om overtollig water af te voeren om wateroverlast te voorkomen, en breder is dan een greppel en smaller dan een gracht. Algemene benaming voor een waterloop van beperkte breedte die stilstaand of slechts langzaam stromend water bevat. (Bron: definities.geostandaarden.nl)
author at start life: Marinus Vonhof
date of start life: 2017-05-31
validity context: 1d 3d 10d 12d 14d
scope note: Collection of facts MDS
type: Class
subclass of: Waterloop
subclass of: Restriction
  on property: heeft Uitvoering
  has value: GegravenEnKlein
subclass of: Restriction
  on property: heeft Structuur
  has value: LangzaamStromend
subclass of: Restriction
  on property: heeft Functie
  has value: RegelenGrondwaterniveau

Beschadiging
definition: [NEN 3300:1996] De schade die is ontstaan in de productie of aanlegfase van het riool of die het gevolg is van werkzaamheden aan of in de omgeving van het riool
author at start life: Marinus Vonhof
date of start life: 2022-09-30
validity context: *d
scope note: Collection of facts BAS
type: Class
subclass of: NEN 3300 Term

Bescherming
author of change: Marinus Vonhof
date of change: 2025-01-16
date of change: 2022-10-04
definition: Het fysieke resultaat van onderhouden of renoveren
author at start life: Marinus Vonhof
date of start life: 2018-03-20
validity context: 10d
comment: [is aspect]
scope note: Collection of facts BAS
scope note: Collection of facts PLI
scope note: Collection of facts MTR
scope note: Collection of facts RGM
type: Class
subclass of: Kenmerk
subclass of: Constructieonderdeel
subclass of: Restriction
  on property: heeft Functie
  has value: ConstructieBeschermen

NLCS_PERSLEIDING_GEMAAL_BESTURINGSKAST
author of change: Marinus Vonhof
date of change: 2018-11-07
definition: Lijntype: CONTINUOUS
notation: 2067
author at start life: Marinus Vonhof
date of start life: 2018-10-27
scope note: Collection of facts NLCS
type: Class
subclass of: NLCS_Object
subclass of: Restriction
  author at start life: Marinus Vonhof
  date of start life: 2018-10-27
  on class: Besturingskast
  on property: is represented by (inverse)
  max qualified cardinality: 1

NLCS_VACUUMLEIDING_GEMAAL_BESTURINGSKAST
author of change: Marinus Vonhof
date of change: 2018-11-07
definition: Lijntype: CONTINUOUS
notation: 2207
author at start life: Marinus Vonhof
date of start life: 2018-10-27
scope note: Collection of facts NLCS
type: Class
subclass of: NLCS_Object
subclass of: Restriction
  author at start life: Marinus Vonhof
  date of start life: 2018-10-27
  on class: Besturingskast
  on property: is represented by (inverse)
  max qualified cardinality: 1

Regelinrichting
author of change: Marinus Vonhof
date of change: 2025-01-16
definition: [IMBOR] Een samenhangend geheel van meetinstrumenten, kabels en besturingskasten.
author at start life: Marinus Vonhof
date of start life: 2020-04-17
scope note: Collection of facts BAS
type: Class
subclass of: Systeem
subclass of: Restriction
  author at start life: Marinus Vonhof
  date of start life: 2020-04-17
  on class: Besturingskast
  on property: has as part
  min qualified cardinality: 0
subclass of: Restriction
  author at start life: Marinus Vonhof
  date of start life: 2020-04-17
  on class: Kabel
  on property: has as part
  min qualified cardinality: 0
subclass of: Restriction
  author at start life: Marinus Vonhof
  date of start life: 2020-04-17
  on class: Meetinstrument
  on property: has as part
  min qualified cardinality: 0
subclass of: Restriction
  on property: heeft Uitvoering
  has value: GeheelVanRegelapparatuur

Pompput
author of change: Finy Teitsma (Oranjewoud)
author of change: Johan Post
date of change: 2026-05-01
date of change: 2007-11-12
date of change: 2026-05-18
definition: Een rioolput met een inrichting bestemd voor het verpompen van afvalwater.
definition: [NEN 3300:1996] rioolput met een inrichting voor het verpompen van afvalwater
author at start life: Finy Teitsma (Oranjewoud)
date of start life: 2006-02-20
scope note: Collection of facts TOP
type: Class
subclass of: Rioolput
subclass of: Restriction
  author of change: Marinus Vonhof
  date of change: 2016-04-15
  author at start life: Finy Teitsma (Oranjewoud)
  date of start life: 2006-02-25
  comment: per definitie
  on class: Pomp
  on property: has as part
  min qualified cardinality: 1
subclass of: Restriction
  author at start life: Johan Post
  date of start life: 2026-05-01
  on class: Besturingskast
  on property: has as part
  max qualified cardinality: 1
subclass of: Restriction
  author at start life: Marinus Vonhof
  date of start life: 2015-07-28
  on class: Hijsinrichting
  on property: has as part
  min qualified cardinality: 0
subclass of: Restriction
  author at start life: Marinus Vonhof
  date of start life: 2018-05-03
  on class: Stankfilter
  on property: has as part
  max qualified cardinality: 1
subclass of: Restriction
  author at start life: Marinus Vonhof
  date of start life: 2018-05-03
  on class: Veiligheidsrooster
  on property: has as part
  max qualified cardinality: 1
subclass of: Restriction
  author at start life: Marinus Vonhof
  date of start life: 2018-10-27
  on class: NLCS_GWA_RIOOLPUT_POMPPUT
  on property: is represented by
  max qualified cardinality: 1
subclass of: Restriction
  author at start life: Marinus Vonhof
  date of start life: 2018-10-27
  on class: NLCS_HWA_RIOOLPUT_POMPPUT
  on property: is represented by
  max qualified cardinality: 1
subclass of: Restriction
  author at start life: Marinus Vonhof
  date of start life: 2018-10-27
  on class: NLCS_ITR_RIOOLPUT_POMPPUT
  on property: is represented by
  max qualified cardinality: 1
subclass of: Restriction
  author at start life: Marinus Vonhof
  date of start life: 2018-10-27
  on class: NLCS_PERSLEIDING_RIOOLPUT_POMPPUT
  on property: is represented by
  max qualified cardinality: 1
subclass of: Restriction
  author at start life: Marinus Vonhof
  date of start life: 2018-10-27
  on class: NLCS_SWA_RIOOLPUT_POMPPUT
  on property: is represented by
  max qualified cardinality: 1
subclass of: Restriction
  author at start life: Marinus Vonhof
  date of start life: 2018-10-27
  on class: NLCS_VACUUMLEIDING_RIOOLPUT_POMPPUT
  on property: is represented by
  max qualified cardinality: 1
subclass of: Restriction
  author at start life: Marinus Vonhof
  date of start life: 2018-10-27
  on class: NLCS_VWA_RIOOLPUT_POMPPUT
  on property: is represented by
  max qualified cardinality: 1
subclass of: Restriction
  author at start life: Marinus Vonhof
  date of start life: 2018-11-07
  on class: Sym_Pompput
  on property: is represented by
  max qualified cardinality: 1
subclass of: Restriction
  author at start life: Marinus Vonhof
  date of start life: 2019-07-11
  on class: Pompschakeling
  on property: has as aspect
  max qualified cardinality: 1
subclass of: Restriction
  author at start life: Marinus Vonhof
  date of start life: 2024-05-16
  on class: Compartiment
  on property: has as part
  min qualified cardinality: 0
subclass of: Restriction
  on property: heeft Functie
  has value: VerpompenVanAfvalwater
subclass of: Restriction
  on class: Drainagestelsel
  on property: has as part (inverse)
  max qualified cardinality: 1
subclass of: Restriction
  on class: Rioolstelsel
  on property: has as part (inverse)
  max qualified cardinality: 1

Materiaal fundering (coll)
validity context: 1d 10d
comment: [is coll]
scope note: Collection of facts BAS
scope note: Collection of facts RGM
type: Class
subclass of: Verzameling soorten
subclass of: Class
  one of: Beton
  one of: Hout

Materie
author of change: Marinus Vonhof
date of change: 2024-05-16
date of change: 2024-12-23
author at start life: Wouter Johan Eric
date of start life: 2021-08-30
validity context: *d
scope note: Collection of facts TOP
type: Class

Betongevulde put
definition: Een put die buiten gebruik is, maar vol beton gezet is om problemen zoals ongedierte, gasvorming, en verzakkingen te voorkomen.
author at start life: Johan Post
date of start life: 2026-05-18
scope note: Collection of facts REV
scope note: Collection of facts BAS
type: Class
subclass of: Loze put
subclass of: Restriction
  on property: heeft Uitvoering
  has value: Betongevuld

Loze put
definition: Put is buiten gebruik, bijvoorbeeld vanwege doorlopende lining
author at start life: Marinus Vonhof
date of start life: 2019-05-15
scope note: Collection of facts REV
scope note: Collection of facts BAS
type: Class
subclass of: Put
subclass of: Restriction
  on property: heeft Functie
  has value: GeenFunctie

Structuur
author of change: Marinus Vonhof
date of change: 2021-01-09
definition: Onderscheidende beschrijving van topologie, afmetingen, opbouw (delen)
author at start life: Marinus Vonhof
date of start life: 2013-09-29
validity context: 6d
comment: Onderscheidend kenmerk
comment: [is aspect]
scope note: Collection of facts TOP
type: Class
subclass of: Onderscheidend kenmerk

Bezinkbassin
author of change: Wouter van Riel
date of change: 2021-09-23
definition: [NEN 3300:1996] reservoir waardoor afvalwater wordt gevoerd en waarin slibafzetting plaatsvindt, met een voorziening om het slib te kunnen verwijderen
author at start life: Marinus Vonhof
date of start life: 2012-04-29
scope note: Collection of facts MDS
scope note: Collection of facts HYD
scope note: Collection of facts RGM
type: Class
subclass of: Reservoir
subclass of: Restriction
  author of change: Marinus Vonhof
  date of change: 2016-04-24
  author at start life: Finy Teitsma (Oranjewoud)
  date of start life: 2007-10-23
  on class: Gemengd rioolstelsel
  on property: has as part (inverse)
  qualified cardinality: 1
subclass of: Restriction
  author at start life: Marinus Vonhof
  date of start life: 2015-05-29
  on class: Ledigingsvoorziening
  on property: has as part
  max qualified cardinality: 1
subclass of: Restriction
  author at start life: Marinus Vonhof
  date of start life: 2015-05-29
  on class: Spoelvoorziening
  on property: has as part
  max qualified cardinality: 1
subclass of: Restriction
  author at start life: Marinus Vonhof
  date of start life: 2017-05-30
  on class: Fundering
  on property: has as part
  max qualified cardinality: 1
subclass of: Restriction
  author at start life: Marinus Vonhof
  date of start life: 2018-11-10
  on class: Sym_Bergbezinkbassin
  on property: is represented by
  max qualified cardinality: 1
subclass of: Restriction
  author at start life: Marinus Vonhof
  date of start life: 2020-04-17
  on class: Verbeterd hemelwaterstelsel
  on property: has as part (inverse)
  max qualified cardinality: 1
subclass of: Restriction
  author at start life: Wouter van Riel
  date of start life: 2021-09-23
  on property: heeft Functie
  has value: BezinkenStoffen
subclass of: Restriction
  author at start life: Wouter van Riel
  date of start life: 2021-09-23
  on property: heeft Functie
  has value: RegelingVanDeAfvoerVanHetAfvalwater
subclass of: Restriction
  author at start life: Wouter van Riel
  date of start life: 2021-09-23
  on property: heeft Functie
  has value: TijdelijkeBergingVanAfvalwater
subclass of: Restriction
  author at start life: Wouter van Riel
  date of start life: 2021-09-23
  on property: heeft Doel
  has value: VerminderenVuilbelastingVanOppervlaktewater
subclass of: Restriction
  author at start life: Wouter van Riel
  date of start life: 2021-09-23
  on property: heeft Doel
  has value: VerwijderenBezinksel

Biezenveld
definition: [NEN 3300:1996] Een afgescheiden gebied, ingeplant met biezen, waarin afvalwater horizontaal circuleert langs bovengrondse plantendelen en door beluchting, bezinking en afzetting van deeltjes het afvalwater (gedeeltelijk) wordt gezuiverd
author at start life: Marinus Vonhof
date of start life: 2022-09-30
validity context: *d
scope note: Collection of facts BAS
type: Class
subclass of: NEN 3300 Term

Bijzondere putconstructie
author of change: Marinus Vonhof
author of change: Johan Post
date of change: 2025-01-16
date of change: 2021-10-01
definition: Put met een constructie die niet onder bekend type is onder te brengen
author at start life: Marinus Vonhof
date of start life: 2014-04-29
scope note: Collection of facts MDS
scope note: Collection of facts REV
scope note: Collection of facts HYD
type: Class
subclass of: Rioolput
subclass of: Restriction
  author of change: Marinus Vonhof
  date of change: 2016-04-13
  author at start life: Marinus Vonhof
  date of start life: 2014-04-29
  on class: Wand
  on property: has as part
  min qualified cardinality: 0
subclass of: Restriction
  author of change: Marinus Vonhof
  date of change: 2018-05-03
  author at start life: Marinus Vonhof
  date of start life: 2014-04-29
  on class: Compartiment
  on property: has as part
  min qualified cardinality: 0
subclass of: Restriction
  author of change: Marinus Vonhof
  date of change: 2019-05-16
  author at start life: Marinus Vonhof
  date of start life: 2014-04-29
  on class: Mechanische afsluiter
  on property: has as part
  min qualified cardinality: 0
subclass of: Restriction
  author at start life: Marinus Vonhof
  date of start life: 2014-04-29
  on class: Pomp
  on property: has as part
  min qualified cardinality: 0
subclass of: Restriction
  on property: heeft Uitvoering
  has value: PutMetSpecialeVoorzieningen
subclass of: Restriction
  on class: Sym_BijzonderePutconstructie
  on property: is represented by
  max qualified cardinality: 1

Wand
author of change: Marinus Vonhof
date of change: 2019-04-05
date of change: 2022-10-01
date of change: 2025-03-19
author at start life: Marinus Vonhof
date of start life: 2012-04-24
validity context: *f
scope note: Collection of facts MDS
scope note: Collection of facts REV
scope note: Collection of facts HYD
scope note: Collection of facts DMO
type: Class
subclass of: Constructieonderdeel
subclass of: Restriction
  author of change: Marinus Vonhof
  date of change: 2015-06-08
  author at start life: Marinus Vonhof
  date of start life: 2012-04-22
  validity context: 5t 11t 14t
  on class: Onderdeeloriëntatie
  on property: has as aspect
  max qualified cardinality: 1
subclass of: Restriction
  author of change: Marinus Vonhof
  date of change: 2016-04-13
  author at start life: Marinus Vonhof
  date of start life: 2014-04-29
  on class: Bijzondere putconstructie
  on property: has as part (inverse)
  max qualified cardinality: 1
subclass of: Restriction
  on property: heeft Technologie
  has value: Statisch

Sym_BijzonderePutconstructie
author at start life: Johan Post
date of start life: 2021-10-01
scope note: Collection of facts NLCS
type: Class
subclass of: Geo-symbool
subclass of: Restriction
  author at start life: Marinus Vonhof
  date of start life: 2018-11-07
  on class: Bijzondere putconstructie
  on property: is represented by (inverse)
  max qualified cardinality: 1

Diameter leiding
author of change: Marinus Vonhof
date of change: 2019-01-24
definition: De lengte van de middellijn van de cirkel die de binnen- of de buitenzijde van de leidingdoorsnede beschrijft. Gehanteerd wordt de handelsmaat (de nominale diameter). Voor kunststof is deze lengte de buitenmaat, voor de overige materialen de binnenmaat. Dat geldt ook voor (de kunststof) Polypropyleen (PP), hoewel daarvoor in andere praktijken soms de binnenmaat wordt gebruikt.
author at start life: Marinus Vonhof
date of start life: 2013-10-01
units of measurements: mm
comment: Intrinsiek aspect
comment: In datasets kan voor de afmeting van ronde leidingen zowel de diameter, hoogte of breedte als kenmerk worden gebruikt
comment: [is aspect]
scope note: Collection of facts MDS
scope note: Collection of facts PLI
scope note: Collection of facts HYD
scope note: Collection of facts DMO
type: Class
subclass of: Diameter
subclass of: Restriction
  author of change: Marinus Vonhof
  date of change: 2015-09-20
  author at start life: Marinus Vonhof
  date of start life: 2013-10-01
  on class: Leiding
  on property: has as aspect (inverse)
  max qualified cardinality: 1
subclass of: Restriction
  author at start life: Marinus Vonhof
  date of start life: 2024-05-16
  on class: Inwinning
  on property: has as aspect
  max qualified cardinality: 1
subclass of: Restriction
  on property: has as value
  all values from: Diameter leiding (datatype)

Binnenonderkant buis
author of change: Marinus Vonhof
date of change: 2015-06-01
definition: Hoogteligging t.o.v. NAP van de binnen-onderkant-buis van de leiding
author at start life: Marinus Vonhof
date of start life: 2014-11-28
units of measurements: m
see also: [IRIS-RIOKEN:2012] Binnonderkant buis
alternative label: B.o.b.
alternative label: B.o.k.
comment: [is aspect]
scope note: Collection of facts TOP
type: Class
subclass of: Hoogte t.o.v. NAP
subclass of: Restriction
  author of change: Marinus Vonhof
  date of change: 2018-11-11
  author at start life: Marinus Vonhof
  date of start life: 2018-10-27
  on class: NLCS_BOB
  on property: is represented by
  max qualified cardinality: 1
subclass of: Restriction
  author at start life: Marinus Vonhof
  date of start life: 2018-10-27
  on class: NLCS_DRAINAGE_BOB
  on property: is represented by
  max qualified cardinality: 1
subclass of: Restriction
  author at start life: Marinus Vonhof
  date of start life: 2018-10-27
  on class: NLCS_GWA_BOB
  on property: is represented by
  max qualified cardinality: 1
subclass of: Restriction
  author at start life: Marinus Vonhof
  date of start life: 2018-10-27
  on class: NLCS_HWA_BOB
  on property: is represented by
  max qualified cardinality: 1
subclass of: Restriction
  author at start life: Marinus Vonhof
  date of start life: 2018-10-27
  on class: NLCS_ITR_BOB
  on property: is represented by
  max qualified cardinality: 1
subclass of: Restriction
  author at start life: Marinus Vonhof
  date of start life: 2018-10-27
  on class: NLCS_PERSLEIDING_BOB
  on property: is represented by
  max qualified cardinality: 1
subclass of: Restriction
  author at start life: Marinus Vonhof
  date of start life: 2018-10-27
  on class: NLCS_SWA_BOB
  on property: is represented by
  max qualified cardinality: 1
subclass of: Restriction
  author at start life: Marinus Vonhof
  date of start life: 2018-10-27
  on class: NLCS_VACUUMLEIDING_BOB
  on property: is represented by
  max qualified cardinality: 1
subclass of: Restriction
  author at start life: Marinus Vonhof
  date of start life: 2018-10-27
  on class: NLCS_VWA_BOB
  on property: is represented by
  max qualified cardinality: 1
subclass of: Restriction
  on property: has as value
  all values from: decimal

NLCS_BOB
author of change: Marinus Vonhof
date of change: 2018-11-07
definition: Lijntype: CONTINUOUS
notation: 1634
author at start life: Marinus Vonhof
date of start life: 2018-10-27
scope note: Collection of facts NLCS
type: Class
subclass of: NLCS_Object
subclass of: Restriction
  author of change: Marinus Vonhof
  date of change: 2018-11-11
  author at start life: Marinus Vonhof
  date of start life: 2018-10-27
  on class: Binnenonderkant buis
  on property: is represented by (inverse)
  max qualified cardinality: 1

NLCS_DRAINAGE_BOB
author of change: Marinus Vonhof
date of change: 2018-11-07
definition: Lijntype: CONTINUOUS / Symbool: 968 - BOB
notation: 1637
author at start life: Marinus Vonhof
date of start life: 2018-10-27
scope note: Collection of facts NLCS
type: Class
subclass of: NLCS_Object
subclass of: Restriction
  author at start life: Marinus Vonhof
  date of start life: 2018-10-27
  on class: Binnenonderkant buis
  on property: is represented by (inverse)
  max qualified cardinality: 1

NLCS_GWA_BOB
author of change: Marinus Vonhof
date of change: 2018-11-07
definition: Lijntype: CONTINUOUS / Symbool: 968 - BOB
notation: 1665
author at start life: Marinus Vonhof
date of start life: 2018-10-27
scope note: Collection of facts NLCS
type: Class
subclass of: NLCS_Object
subclass of: Restriction
  author at start life: Marinus Vonhof
  date of start life: 2018-10-27
  on class: Binnenonderkant buis
  on property: is represented by (inverse)
  max qualified cardinality: 1

NLCS_HWA_BOB
author of change: Marinus Vonhof
date of change: 2018-11-07
definition: Lijntype: CONTINUOUS / Symbool: 968 - BOB
notation: 1787
author at start life: Marinus Vonhof
date of start life: 2018-10-27
scope note: Collection of facts NLCS
type: Class
subclass of: NLCS_Object
subclass of: Restriction
  author at start life: Marinus Vonhof
  date of start life: 2018-10-27
  on class: Binnenonderkant buis
  on property: is represented by (inverse)
  max qualified cardinality: 1

NLCS_ITR_BOB
author of change: Marinus Vonhof
date of change: 2018-11-07
definition: Lijntype: CONTINUOUS / Symbool: 968 - BOB
notation: 1945
author at start life: Marinus Vonhof
date of start life: 2018-10-27
scope note: Collection of facts NLCS
type: Class
subclass of: NLCS_Object
subclass of: Restriction
  author at start life: Marinus Vonhof
  date of start life: 2018-10-27
  on class: Binnenonderkant buis
  on property: is represented by (inverse)
  max qualified cardinality: 1

NLCS_PERSLEIDING_BOB
author of change: Marinus Vonhof
date of change: 2018-11-07
definition: Lijntype: CONTINUOUS / Symbool: 968 - BOB
notation: 2064
author at start life: Marinus Vonhof
date of start life: 2018-10-27
scope note: Collection of facts NLCS
type: Class
subclass of: NLCS_Object
subclass of: Restriction
  author at start life: Marinus Vonhof
  date of start life: 2018-10-27
  on class: Binnenonderkant buis
  on property: is represented by (inverse)
  max qualified cardinality: 1

NLCS_SWA_BOB
author of change: Marinus Vonhof
date of change: 2018-11-07
definition: Lijntype: CONTINUOUS / Symbool: 968 - BOB
notation: 2084
author at start life: Marinus Vonhof
date of start life: 2018-10-27
scope note: Collection of facts NLCS
type: Class
subclass of: NLCS_Object
subclass of: Restriction
  author at start life: Marinus Vonhof
  date of start life: 2018-10-27
  on class: Binnenonderkant buis
  on property: is represented by (inverse)
  max qualified cardinality: 1

NLCS_VACUUMLEIDING_BOB
author of change: Marinus Vonhof
date of change: 2018-11-07
definition: Lijntype: CONTINUOUS / Symbool: 968 - BOB
notation: 2204
author at start life: Marinus Vonhof
date of start life: 2018-10-27
scope note: Collection of facts NLCS
type: Class
subclass of: NLCS_Object
subclass of: Restriction
  author at start life: Marinus Vonhof
  date of start life: 2018-10-27
  on class: Binnenonderkant buis
  on property: is represented by (inverse)
  max qualified cardinality: 1

NLCS_VWA_BOB
author of change: Marinus Vonhof
date of change: 2018-11-07
definition: Lijntype: CONTINUOUS / Symbool: 968 - BOB
notation: 2225
author at start life: Marinus Vonhof
date of start life: 2018-10-27
scope note: Collection of facts NLCS
type: Class
subclass of: NLCS_Object
subclass of: Restriction
  author at start life: Marinus Vonhof
  date of start life: 2018-10-27
  on class: Binnenonderkant buis
  on property: is represented by (inverse)
  max qualified cardinality: 1

Eindpunt onderdeel
author of change: Marinus Vonhof
date of change: 2017-12-12
definition: Als het eindpunt ontbreekt bij het onderdeel (doorlaat, pomp, wand) wordt uitgegaan van externe lozing. Het transport verdwijnt uit het stelsel
author at start life: Marinus Vonhof
date of start life: 2012-04-22
scope note: Collection of facts MDS
scope note: Collection of facts REV
scope note: Collection of facts HYD
type: Class
subclass of: Vertex
subclass of: Restriction
  author of change: Marinus Vonhof
  date of change: 2017-12-07
  author at start life: Marinus Vonhof
  date of start life: 2012-04-22
  on class: Onderdeeloriëntatie
  on property: has as part (inverse)
  qualified cardinality: 1
subclass of: Restriction
  author of change: Marinus Vonhof
  date of change: 2019-08-12
  author at start life: Marinus Vonhof
  date of start life: 2017-05-17
  on class: Binnenonderkant onderdeel
  on property: has as aspect
  max qualified cardinality: 1
subclass of: Restriction
  author at start life: Marinus Vonhof
  date of start life: 2017-12-12
  validity context: 5t 11t
  on class: Knooppunt
  on property: is connected to
  max qualified cardinality: 1

Biofilter
definition: [Wikipedia] Een reactor waarbij micro-organismen in een vast bed dienen voor luchtzuivering of waterzuivering
author at start life: Marinus Vonhof
date of start life: 2016-04-22
scope note: Collection of facts BAS
type: Class
subclass of: Zuiveringsreservoir
subclass of: Restriction
  on property: heeft Functie
  has value: LuchtEnWaterZuiveren

Zuiveringsreservoir
author of change: Eric van Gorkom
date of change: 2024-05-13
date of change: 2021-09-23
definition: Een reservoir voor het zuiveren van afvalwater
author at start life: Marinus Vonhof
date of start life: 2016-04-20
validity context: *f
scope note: Collection of facts BAS
type: Class
subclass of: Reservoir
subclass of: Restriction
  author of change: Marinus Vonhof
  date of change: 2016-04-24
  author at start life: Marinus Vonhof
  date of start life: 2015-07-23
  on class: Kwetsbaar gebied
  on property: has as part (inverse)
  max qualified cardinality: 1
subclass of: Restriction
  on property: heeft Technologie
  has value: BiologischReinigen
subclass of: Restriction
  on property: heeft Doel
  has value: VerminderenVuilbelastingVanOppervlaktewater
subclass of: Restriction
  on property: heeft Functie
  has value: ZuiverenAfvalwater
subclass of: Restriction
  on class: Putdeksel
  on property: has as part
  min qualified cardinality: 0

Waterdeel
author of change: Marinus Vonhof
author of change: Johan Post
date of change: 2024-04-30
date of change: 2017-05-31
author at start life: Marinus Vonhof
date of start life: 2013-03-31
see also: [IHW:20130706] Kleinste functioneel onafhankelijk stukje water met gelijkblijvende, homogene eigenschappen en relaties dat er binnen het objecttype Water van NEN (bron: BGT)
see also: [NEN 3610] Kleinste functioneel onafhankelijk stukje water met gelijkblijvende, homogene eigenschappen en relaties dat er binnen een water wordt onderscheiden
scope note: Collection of facts BAS
type: Class
subclass of: Oppervlaktewater
subclass of: Restriction
  author of change: Finy Teitsma (Oranjewoud)
  date of change: 2006-03-23
  author at start life: Finy Teitsma (Oranjewoud)
  date of start life: 2006-02-25
  on class: WaterpeilWinter
  on property: has as aspect
  max qualified cardinality: 1
subclass of: Restriction
  author of change: Finy Teitsma (Oranjewoud)
  date of change: 2006-03-23
  author at start life: Finy Teitsma (Oranjewoud)
  date of start life: 2006-02-25
  on class: WaterpeilZomer
  on property: has as aspect
  max qualified cardinality: 1
subclass of: Restriction
  author of change: Marinus Vonhof
  date of change: 2017-03-28
  author at start life: Finy Teitsma (Oranjewoud)
  date of start life: 2006-02-25
  on class: Uitlaat (punt)
  on property: is connected to
  min qualified cardinality: 0
subclass of: Restriction
  author of change: Marinus Vonhof
  date of change: 2018-12-12
  author at start life: Finy Teitsma (Oranjewoud)
  date of start life: 2006-02-25
  comment: Temporeel kenmerk, met kenmerk Inwinning
  on class: Waterpeil
  on property: has as aspect
  min qualified cardinality: 0
subclass of: Restriction
  author of change: Marinus Vonhof
  date of change: 2014-04-10
  author at start life: Marinus Vonhof
  date of start life: 2012-04-29
  on class: Waterloop
  on property: has as part (inverse)
  max qualified cardinality: 1
subclass of: Restriction
  author of change: Marinus Vonhof
  date of change: 2015-04-20
  author at start life: Marinus Vonhof
  date of start life: 2014-12-02
  on class: Risicogebied
  on property: has as part (inverse)
  max qualified cardinality: 1
subclass of: Restriction
  author at start life: Marinus Vonhof
  date of start life: 2014-07-25
  on class: Lozingspunt
  on property: has as part
  min qualified cardinality: 0
subclass of: Restriction
  author at start life: Marinus Vonhof
  date of start life: 2019-05-15
  on class: Profiel open leiding
  on property: has as aspect
  max qualified cardinality: 1
subclass of: Restriction
  on property: heeft Functie
  has value: OpslagVanOppervlaktewater
subclass of: Restriction
  on property: heeft Functie
  has value: TransportVanOppervlaktewater

Blinde inlaat
author of change: Marinus Vonhof
date of change: 2025-01-16
definition: Een afgedopte inlaat, zonder aansluiting
author at start life: Marinus Vonhof
date of start life: 2021-08-06
scope note: Collection of facts MDS
scope note: Collection of facts LDR
scope note: Collection of facts REV
type: Class
subclass of: Inlaat
subclass of: Restriction
  on property: heeft Toepassing
  has value: AansluitingOntbreekt
subclass of: Restriction
  on property: heeft Uitvoering
  has value: Afgedopt

Blinde put
author of change: Marinus Vonhof
author of change: Eric van Gorkom
date of change: 2022-09-27
date of change: 2015-07-09
author at start life: Marinus Vonhof
date of start life: 2012-05-01
scope note: Collection of facts REV
scope note: Collection of facts BAS
scope note: Collection of facts HYD
type: Class
subclass of: Put
subclass of: Extra objecttype (rol)
subclass of: Restriction
  author at start life: Marinus Vonhof
  date of start life: 2018-10-27
  on class: NLCS_DRAINAGE_PUT_BLINDEPUT
  on property: is represented by
  max qualified cardinality: 1
subclass of: Restriction
  author at start life: Marinus Vonhof
  date of start life: 2018-10-27
  on class: NLCS_GWA_RIOOLPUT_BLINDEPUT
  on property: is represented by
  max qualified cardinality: 1
subclass of: Restriction
  author at start life: Marinus Vonhof
  date of start life: 2018-10-27
  on class: NLCS_HWA_RIOOLPUT_BLINDEPUT
  on property: is represented by
  max qualified cardinality: 1
subclass of: Restriction
  author at start life: Marinus Vonhof
  date of start life: 2018-10-27
  on class: NLCS_ITR_RIOOLPUT_BLINDEPUT
  on property: is represented by
  max qualified cardinality: 1
subclass of: Restriction
  author at start life: Marinus Vonhof
  date of start life: 2018-10-27
  on class: NLCS_SWA_RIOOLPUT_BLINDEPUT
  on property: is represented by
  max qualified cardinality: 1
subclass of: Restriction
  author at start life: Marinus Vonhof
  date of start life: 2018-10-27
  on class: NLCS_VWA_RIOOLPUT_BLINDEPUT
  on property: is represented by
  max qualified cardinality: 1
subclass of: Restriction
  on property: heeft Uitvoering
  has value: GeenOpeningAanDeBovenzijde

NLCS_DRAINAGE_PUT_BLINDEPUT
author of change: Marinus Vonhof
date of change: 2018-11-07
definition: Lijntype: CONTINUOUS
notation: 3497
author at start life: Marinus Vonhof
date of start life: 2018-10-27
scope note: Collection of facts NLCS
type: Class
subclass of: NLCS_Object
subclass of: Restriction
  author at start life: Marinus Vonhof
  date of start life: 2018-10-27
  on class: Blinde put
  on property: is represented by (inverse)
  max qualified cardinality: 1

NLCS_GWA_RIOOLPUT_BLINDEPUT
author of change: Marinus Vonhof
date of change: 2018-11-07
definition: Lijntype: CONTINUOUS / Symbool: 1002 - PUT_BLINDEPUT
notation: 1705
author at start life: Marinus Vonhof
date of start life: 2018-10-27
scope note: Collection of facts NLCS
type: Class
subclass of: NLCS_Object
subclass of: Restriction
  author at start life: Marinus Vonhof
  date of start life: 2018-10-27
  on class: Blinde put
  on property: is represented by (inverse)
  max qualified cardinality: 1

NLCS_HWA_RIOOLPUT_BLINDEPUT
author of change: Marinus Vonhof
date of change: 2018-11-07
definition: Lijntype: CONTINUOUS / Symbool: 1002 - PUT_BLINDEPUT
notation: 1834
author at start life: Marinus Vonhof
date of start life: 2018-10-27
scope note: Collection of facts NLCS
type: Class
subclass of: NLCS_Object
subclass of: Restriction
  author at start life: Marinus Vonhof
  date of start life: 2018-10-27
  on class: Blinde put
  on property: is represented by (inverse)
  max qualified cardinality: 1

NLCS_ITR_RIOOLPUT_BLINDEPUT
author of change: Marinus Vonhof
date of change: 2018-11-07
definition: Lijntype: CONTINUOUS / Symbool: 1002 - PUT_BLINDEPUT
notation: 1991
author at start life: Marinus Vonhof
date of start life: 2018-10-27
scope note: Collection of facts NLCS
type: Class
subclass of: NLCS_Object
subclass of: Restriction
  author at start life: Marinus Vonhof
  date of start life: 2018-10-27
  on class: Blinde put
  on property: is represented by (inverse)
  max qualified cardinality: 1

NLCS_SWA_RIOOLPUT_BLINDEPUT
author of change: Marinus Vonhof
date of change: 2018-11-07
definition: Lijntype: CONTINUOUS / Symbool: 1002 - PUT_BLINDEPUT
notation: 2112
author at start life: Marinus Vonhof
date of start life: 2018-10-27
scope note: Collection of facts NLCS
type: Class
subclass of: NLCS_Object
subclass of: Restriction
  author at start life: Marinus Vonhof
  date of start life: 2018-10-27
  on class: Blinde put
  on property: is represented by (inverse)
  max qualified cardinality: 1

NLCS_VWA_RIOOLPUT_BLINDEPUT
author of change: Marinus Vonhof
date of change: 2018-11-07
definition: Lijntype: CONTINUOUS / Symbool: 1002 - PUT_BLINDEPUT
notation: 2252
author at start life: Marinus Vonhof
date of start life: 2018-10-27
scope note: Collection of facts NLCS
type: Class
subclass of: NLCS_Object
subclass of: Restriction
  author at start life: Marinus Vonhof
  date of start life: 2018-10-27
  on class: Blinde put
  on property: is represented by (inverse)
  max qualified cardinality: 1

Blusriool
definition: Permanent gevulde rioolleiding, verbonden met open water, voor het leveren van bluswater
author at start life: Marinus Vonhof
date of start life: 2018-12-05
alternative label: Brandriool
scope note: Collection of facts MDS
type: Class
subclass of: Vrijverval rioolleiding
subclass of: Restriction
  on property: heeft Functie
  has value: BluswaterLeveren

Bluswatervijver
definition: Een reservoir voor het leveren van bluswater
author at start life: Marinus Vonhof
date of start life: 2018-12-06
scope note: Collection of facts BAS
type: Class
subclass of: Vijver
subclass of: Restriction
  on property: heeft Functie
  has value: BluswaterLeveren

Vijver
author of change: Marinus Vonhof
date of change: 2025-01-16
definition: [IMBOR] Een aangelegde vorm van oppervlaktewater.
author at start life: Marinus Vonhof
date of start life: 2017-05-31
validity context: 1d 3d 10d 12d 14d
scope note: Collection of facts MDS
type: Class
subclass of: Watervlakte
subclass of: Restriction
  on property: heeft Uitvoering
  has value: AangelegdEnKlein

B.o.b. eindpunt leiding
definition: Binnenonderkant buis ter plaatse van het eindpunt
notation: AXH
notation: GXH
author at start life: Marinus Vonhof
date of start life: 2013-03-26
units of measurements: m
alternative label: B.o.b. bij eindknoop t.o.v. NAP
comment: [is aspect]
scope note: Collection of facts TOP
type: Class
subclass of: Binnenonderkant buis
subclass of: Restriction
  author of change: Marinus Vonhof
  date of change: 2018-12-06
  author at start life: Marinus Vonhof
  date of start life: 2016-11-09
  validity context: *t
  on class: Eindpunt leiding
  on property: has as aspect (inverse)
  max qualified cardinality: 1
subclass of: Restriction
  author at start life: Marinus Vonhof
  date of start life: 2015-10-29
  on class: Inwinning
  on property: has as aspect
  max qualified cardinality: 1
subclass of: Restriction
  on property: has as value
  all values from: decimal

Bochtstuk
author of change: Marinus Vonhof
date of change: 2017-12-13
definition: Een buis of buisstuk in de vorm van een bocht.
author at start life: Finy Teitsma (Oranjewoud)
date of start life: 2006-05-23
scope note: Collection of facts MDS
scope note: Collection of facts LDR
scope note: Collection of facts REV
scope note: Collection of facts PLI
scope note: Collection of facts HYD
type: Class
subclass of: Verbindingsstuk
subclass of: Restriction
  on property: heeft Uitvoering
  has value: BuisInGebogenVorm
subclass of: Restriction
  on property: heeft Functie
  has value: VerbindenVanLeidingenInEenHoek

Leidingvlak
definition: Overkoepelende term waar de boven-, onder- en zijkanten van een leiding onder vallen
author at start life: Johan Post
date of start life: 2026-05-13
scope note: Collection of facts BAS
type: Class
subclass of: Constructieonderdeel
subclass of: Restriction
  author of change: Marinus Vonhof
  date of change: 2019-04-04
  date of change: 2022-10-01
  author at start life: Marinus Vonhof
  date of start life: 2014-04-29
  on class: Rioolleiding
  on property: has as part (inverse)
  max qualified cardinality: 1
subclass of: Restriction
  author of change: Marinus Vonhof
  date of change: 2022-10-01
  on class: Transportleiding
  on property: has as part (inverse)
  max qualified cardinality: 1
subclass of: Restriction
  on property: heeft Toepassing
  has value: OpbouwLeiding
subclass of: Restriction
  on class: Materiaal leiding
  on property: has as aspect
  max qualified cardinality: 1
subclass of: Restriction
  on class: Wanddikte
  on property: has as aspect
  min qualified cardinality: 0

Bodembedreigend afvalwater
definition: Afvalwater met daarin stoffen die een bedreiging voor de bodem vormen, zoals opgenomen in de Nederlandse Richtlijn Bodembescherming
author at start life: Wouter van Riel
date of start life: 2024-04-22
scope note: Collection of facts BAS
scope note: Collection of facts DMO
type: Class
subclass of: Afvalwater

Bodemprofiel
author of change: Marinus Vonhof
date of change: 2024-07-15
definition: Een regelvoorziening voor het geleiden van de afvoer van afvalwater.
definition: [NEN 3300:1996] beloop voor geleiding van de afvoer van water
author at start life: Johan Post
date of start life: 2024-04-30
alternative label: Stroomprofiel
comment: [is aspect]
scope note: Collection of facts REV
scope note: Collection of facts BAS
type: Class
subclass of: Vorm
subclass of: Restriction
  on property: has as reference (qualification)
  all values from: Bodemprofiel (coll)
subclass of: Restriction
  on property: heeft Functie
  has value: GeleidenVanDeAfvoerVanHetAfvalwater
subclass of: Restriction
  on class: Rioolput
  on property: has as aspect (inverse)
  max qualified cardinality: 1

Vorm
author of change: Marinus Vonhof
date of change: 2025-01-16
definition: Geometrische omschrijving
definition: [IMBOR] Kwalitatieve aanduiding van de contouren van een beheerobject.
author at start life: Marinus Vonhof
date of start life: 2016-04-23
validity context: 15d
comment: [is aspect]
scope note: Collection of facts TOP
type: Class
subclass of: Kenmerk

Bodemprofiel (coll)
comment: [is coll]
scope note: Collection of facts REV
scope note: Collection of facts BAS
type: Class
subclass of: Verzameling soorten
subclass of: Class
  one of: Geulprofiel
  one of: Bolprofiel
  one of: VlakkeBodem
  one of: VlakkeBodemBanken

Boomstructuur
definition: [NEN 3300:1996] opbouw van een rioolstelsel, in de vorm van een boom met takken, waarbij voor elke hoeveelheid afvalwater vaststaat langs welke weg het afvalwater naar het gemaal zal afvloeien
author at start life: Marinus Vonhof
date of start life: 2022-09-30
validity context: *d
scope note: Collection of facts BAS
type: Class
subclass of: NEN 3300 Term

Boorkern nemen
author of change: Marinus Vonhof
date of change: 2019-03-14
author at start life: Marinus Vonhof
date of start life: 2014-12-02
validity context: 6d
scope note: Collection of facts BAS
scope note: Collection of facts MTR
type: Class
subclass of: Onderzoeken
subclass of: Restriction
  author at start life: Marinus Vonhof
  date of start life: 2019-03-14
  on class: Rioolput
  on property: has as input
  max qualified cardinality: 1
subclass of: Restriction
  author at start life: Marinus Vonhof
  date of start life: 2019-03-14
  on class: Vrijverval rioolleiding
  on property: has as input
  max qualified cardinality: 1

Onderzoeken
author of change: Marinus Vonhof
date of change: 2015-08-24
definition: [NEN 3300:1996] Verzamelen, ordenen, analyseren en verwerken van gegevens, zodat informatie kan worden afgeleid over de toestand en het functioneren van de buitenriolering
author at start life: Marinus Vonhof
date of start life: 2013-03-26
validity context: 1f 3f 5d 10f 11d 12f 14f
scope note: Collection of facts TOP
type: Class
subclass of: Maatregel

Boostergemaal
author of change: Marinus Vonhof
date of change: 2018-05-03
definition: Een gemaal voor het verhogen van de vloeistofdruk door het afvalwater rechtstreeks van een pompinstallatie naar de volgende te persen
author at start life: Finy Teitsma (Oranjewoud)
date of start life: 2007-10-23
scope note: Collection of facts MDS
scope note: Collection of facts HYD
scope note: Collection of facts RGM
scope note: Collection of facts DMO
type: Class
subclass of: Rioolgemaal
subclass of: Restriction
  on property: heeft Technologie
  has value: DirectTransportDoorPompenZonderOpvangInOntvput

Rioolgemaal
author of change: Marinus Vonhof
author of change: Johan Post
date of change: 2024-04-30
date of change: 2017-08-19
definition: Een gemaal voor het verpompen van afvalwater.
definition: [NEN 3300:1996] een inrichting voor het verpompen van afvalwater
definition: [NEN-EN 752:2008] geheel van gebouw, constructies en apparatuur dat wordt gebruikt om afvalwater via een persleiding te transporteren of om het afvalwater op andere wijze omhoog te brengen
author at start life: Marinus Vonhof
date of start life: 2012-04-29
see also: [IRIS-RIOKEN:2012] Civiel werk waarin alle technische voorzieningen zijn ondergebracht die benodigd zijn voor het verpompen van rioolwater. Voor het waterschap zijn in principe alleen de riooleindgemalen interessant, waar overdracht van afvalwater plaatsvindt naar een stelsel dat onder beheer van dit waterschap is.
see also: [IRIS-RIOKEN:2012] Influentgemaal is synoniem van Rioolgemaal
alternative label: Influentgemaal
scope note: Collection of facts TOP
type: Class
subclass of: Gemaal
subclass of: Restriction
  author of change: Marinus Vonhof
  date of change: 2016-08-05
  author at start life: Marinus Vonhof
  date of start life: 2016-04-28
  on class: Onderbemaling
  on property: has as part (inverse)
  qualified cardinality: 1
subclass of: Restriction
  author of change: Marinus Vonhof
  date of change: 2019-07-10
  author at start life: Marinus Vonhof
  date of start life: 2014-10-14
  on class: Transportstelsel
  on property: has as part (inverse)
  max qualified cardinality: 1
subclass of: Restriction
  author of change: Marinus Vonhof
  date of change: 2017-03-06
  author at start life: Nic Roest (Idoro)
  date of start life: 2007-11-29
  on class: Persleiding
  on property: is connected to
  min qualified cardinality: 0
subclass of: Restriction
  author at start life: Marinus Vonhof
  date of start life: 2014-12-02
  on class: Persleidingstelsel
  on property: has as part (inverse)
  qualified cardinality: 1
subclass of: Restriction
  author at start life: Marinus Vonhof
  date of start life: 2018-10-27
  on class: NLCS_PERSLEIDING_GEMAAL
  on property: is represented by
  max qualified cardinality: 1
subclass of: Restriction
  author at start life: Marinus Vonhof
  date of start life: 2018-11-07
  on class: Sym_Rioolgemaal
  on property: is represented by
  max qualified cardinality: 1
subclass of: Restriction
  author at start life: Marinus Vonhof
  date of start life: 2020-05-26
  on class: Gemengd rioolstelsel
  on property: has as part (inverse)
  max qualified cardinality: 1
subclass of: Restriction
  author at start life: Marinus Vonhof
  date of start life: 2020-05-26
  on class: Verbeterd hemelwaterstelsel
  on property: has as part (inverse)
  max qualified cardinality: 1
subclass of: Restriction
  author at start life: Marinus Vonhof
  date of start life: 2020-05-26
  on class: Vuilwaterstelsel
  on property: has as part (inverse)
  max qualified cardinality: 1
subclass of: Restriction
  author at start life: Marinus Vonhof
  date of start life: 2024-07-15
  on class: Overstortbemaling
  on property: has as part
  min qualified cardinality: 0
subclass of: Restriction
  on property: heeft Functie
  has value: VerpompenVanAfvalwater

Bouwblokdrainage
author of change: Marinus Vonhof
author of change: Eric van Gorkom
date of change: 2025-01-16
date of change: 2022-12-24
definition: Drainage die is gelegen onder, nabij of rondom woonblokken
author at start life: Marinus Vonhof
date of start life: 2020-04-17
alternative label: Blokdrainage
alternative label: RIngdrainage
scope note: Collection of facts BAS
type: Class
subclass of: Drainagestelsel
subclass of: Restriction
  on property: heeft Toepassing
  has value: NabijWoonblokken

Bouwkundig onderhoud
author of change: Marinus Vonhof
date of change: 2019-04-05
definition: Onderhoud aan een bouwwerk, voor zover niet vallend onder de EN13508-2 en het geen rioolleiding of rioolput betreft.
author at start life: Marinus Vonhof
date of start life: 2013-02-05
validity context: 6d
scope note: Collection of facts BAS
scope note: Collection of facts MTR
scope note: Collection of facts RGM
type: Class
subclass of: Onderhouden
subclass of: Restriction
  author of change: Marinus Vonhof
  date of change: 2019-03-14
  author at start life: Marinus Vonhof
  date of start life: 2016-04-24
  on class: Gebouw
  on property: has as input
  qualified cardinality: 1

Onderhouden
label: Maintenance @en
author of change: Marinus Vonhof
date of change: 2020-10-28
definition: [EN 16323:2014] routine work undertaken to ensure the continuing performance of an asset @en
definition: [NEN 3300:1996] herstel van het oorspronkelijke functioneren, waarbij de toestand van objecten ongewijzigd gehandhaafd wordt
definition: [NEN-EN 752:2008] activiteiten die routinematig worden uitgevoerd om ervoor te zorgen dat de riolering goed blijft functioneren
author at start life: Marinus Vonhof
date of start life: 2013-02-05
validity context: 1f 3f 5d 10f 11d 12f 14f 16d
see also: [EN ISO 11298-1:2018] routine work undertaken to ensure the existing performance of an asset
scope note: Collection of facts TOP
type: Class
subclass of: Maatregel
subclass of: Restriction
  on property: heeft Doel
  has value: GoedBlijvenFunctioneren
subclass of: Restriction
  on property: heeft Functie
  has value: ZonderToestandswijziging

Breedte bouwwerk
author of change: Marinus Vonhof
date of change: 2024-05-16
date of change: 2017-08-21
definition: De inwendige breedte van het bouwwerk
author at start life: Nic Roest (Idoro)
date of start life: 2006-02-21
units of measurements: mm
comment: Intrinsiek aspect
comment: [is aspect]
scope note: Collection of facts MDS
scope note: Collection of facts REV
scope note: Collection of facts HYD
scope note: Collection of facts RGM
type: Class
subclass of: Breedte
subclass of: Restriction
  author of change: Marinus Vonhof
  date of change: 2017-08-21
  author at start life: Finy Teitsma (Oranjewoud)
  date of start life: 2006-02-25
  validity context: 5t 11t
  on class: Bouwwerk
  on property: has as aspect (inverse)
  max qualified cardinality: 1
subclass of: Restriction
  on property: has as value
  all values from: Breedte bouwwerk (datatype)

Lengte bouwwerk
author of change: Marinus Vonhof
date of change: 2024-05-16
date of change: 2017-08-21
definition: De inwendige lengte van het bouwwerk
author at start life: Nic Roest (Idoro)
date of start life: 2006-02-21
units of measurements: mm
validity context: 15d
comment: [is aspect]
scope note: Collection of facts MDS
scope note: Collection of facts REV
scope note: Collection of facts HYD
scope note: Collection of facts RGM
type: Class
subclass of: Lengte
subclass of: Restriction
  author of change: Marinus Vonhof
  date of change: 2017-08-21
  author at start life: Finy Teitsma (Oranjewoud)
  date of start life: 2006-02-25
  validity context: 5t 11t
  on class: Bouwwerk
  on property: has as aspect (inverse)
  max qualified cardinality: 1
subclass of: Restriction
  on property: has as value
  all values from: Lengte bouwwerk (datatype)

Vorm bouwwerk
author of change: Marinus Vonhof
date of change: 2013-09-20
author at start life: Marinus Vonhof
date of start life: 2012-05-01
comment: Intrinsiek aspect
alternative label: Bouwwerkvorm
comment: [is aspect]
scope note: Collection of facts MDS
scope note: Collection of facts REV
scope note: Collection of facts HYD
scope note: Collection of facts RGM
type: Class
subclass of: Vorm
subclass of: Restriction
  author of change: Marinus Vonhof
  date of change: 2017-08-21
  author at start life: Finy Teitsma (Oranjewoud)
  date of start life: 2006-02-25
  validity context: 5t 11t
  on class: Bouwwerk
  on property: has as aspect (inverse)
  max qualified cardinality: 1
subclass of: Restriction
  on property: has as reference (qualification)
  all values from: Vorm put (coll)

Hoogte bouwwerk
author of change: Marinus Vonhof
date of change: 2024-05-16
date of change: 2017-08-21
definition: De inwendige hoogte van het bouwwerk
author at start life: Nic Roest (Idoro)
date of start life: 2006-02-21
units of measurements: mm
validity context: 5t 11t
comment: Intrinsiek aspect
comment: [is aspect]
scope note: Collection of facts MDS
scope note: Collection of facts REV
scope note: Collection of facts HYD
type: Class
subclass of: Hoogte
subclass of: Restriction
  author of change: Marinus Vonhof
  date of change: 2017-08-21
  author at start life: Finy Teitsma (Oranjewoud)
  date of start life: 2006-02-25
  on class: Bouwwerk
  on property: has as aspect (inverse)
  max qualified cardinality: 1
subclass of: Restriction
  on property: has as value
  all values from: Hoogte bouwwerk (datatype)

Bouwwerkoriëntatie
author of change: Marinus Vonhof
date of change: 2018-12-05
definition: Een topologisch element dat de contouren (edge) of het zwaartepunt (vertex) van een bouwwerk beschrijft
author at start life: Marinus Vonhof
date of start life: 2017-12-12
scope note: Collection of facts TOP
type: Class
subclass of: Knooppunt
subclass of: Restriction
  author of change: Marinus Vonhof
  date of change: 2017-08-21
  author at start life: Marinus Vonhof
  date of start life: 2017-08-19
  on class: Maaiveldoriëntatie
  on property: is connected to
  max qualified cardinality: 1
subclass of: Restriction
  author of change: Marinus Vonhof
  date of change: 2018-05-03
  author at start life: Marinus Vonhof
  date of start life: 2017-08-19
  validity context: 5t 11t
  on class: Bouwwerk
  on property: has as aspect (inverse)
  max qualified cardinality: 1
subclass of: Restriction
  author of change: Marinus Vonhof
  date of change: 2020-04-18
  date of change: 2026-07-24
  author at start life: Marinus Vonhof
  date of start life: 2016-11-09
  comment: Temporeel kenmerk, met kenmerk Inwinning
  on class: Buitengrens
  on property: has as aspect
  max qualified cardinality: 1

Status functioneren
author of change: Marinus Vonhof
date of change: 2018-05-03
author at start life: Marinus Vonhof
date of start life: 2014-12-02
validity context: 6d 15d
comment: [is aspect]
scope note: Collection of facts REV
scope note: Collection of facts BAS
scope note: Collection of facts RGM
scope note: Collection of facts DMO
type: Class
subclass of: Kenmerk
subclass of: Restriction
  author of change: Marinus Vonhof
  date of change: 2018-12-06
  author at start life: Marinus Vonhof
  date of start life: 2014-12-02
  on class: Bouwwerk
  on property: has as aspect (inverse)
  max qualified cardinality: 1
subclass of: Restriction
  author at start life: Marinus Vonhof
  date of start life: 2014-12-02
  on class: Leiding
  on property: has as aspect (inverse)
  max qualified cardinality: 1
subclass of: Restriction
  author at start life: Marinus Vonhof
  date of start life: 2014-12-02
  on class: Put
  on property: has as aspect (inverse)
  max qualified cardinality: 1
subclass of: Restriction
  author at start life: Marinus Vonhof
  date of start life: 2023-01-10
  on class: Inwinning
  on property: has as aspect
  max qualified cardinality: 1
subclass of: Restriction
  author at start life: Marinus Vonhof
  date of start life: 2026-07-24
  on class: Infiltratievoorziening
  on property: has as aspect (inverse)
  max qualified cardinality: 1
subclass of: Restriction
  on property: has as reference (qualification)
  all values from: Status functioneren (coll)

Revisietekening
author of change: Marinus Vonhof
date of change: 2025-01-16
date of change: 2025-07-23
definition: [IMBOR] Een bouwtekening die de veranderingen ten opzichte van de oorspronkelijke tekening zichtbaar maakt.
definition: [NEN 3300:1996] een tekening, die na aanleg, op basis van de bestekstekening, is opgesteld en in detail de aangelegde situatie weergeeft
author at start life: Marinus Vonhof
date of start life: 2013-03-29
scope note: Collection of facts BAS
type: Class
subclass of: Informatiedrager
subclass of: Restriction
  author of change: Marinus Vonhof
  date of change: 2021-08-06
  date of change: 2026-07-23
  author at start life: Marinus Vonhof
  date of start life: 2018-12-12
  on class: Bouwwerk
  on property: is represented by (inverse)
  min qualified cardinality: 0
subclass of: Restriction
  author of change: Marinus Vonhof
  date of change: 2021-08-06
  date of change: 2026-07-23
  author at start life: Marinus Vonhof
  date of start life: 2018-12-12
  on class: Kabel
  on property: is represented by (inverse)
  min qualified cardinality: 0
subclass of: Restriction
  author of change: Marinus Vonhof
  date of change: 2021-08-06
  date of change: 2026-07-23
  author at start life: Marinus Vonhof
  date of start life: 2018-12-12
  on class: Leiding
  on property: is represented by (inverse)
  min qualified cardinality: 0
subclass of: Restriction
  author of change: Marinus Vonhof
  date of change: 2021-08-06
  date of change: 2026-07-23
  author at start life: Marinus Vonhof
  date of start life: 2018-12-12
  on class: Put
  on property: is represented by (inverse)
  min qualified cardinality: 0
subclass of: Restriction
  author at start life: Marinus Vonhof
  date of start life: 2014-04-29
  on class: Revisietekeningnummer
  on property: has as aspect
  max qualified cardinality: 1
subclass of: Restriction
  author at start life: Marinus Vonhof
  date of start life: 2026-07-24
  on class: Infiltratievoorziening
  on property: is represented by (inverse)
  min qualified cardinality: 0

Materiaal bouwwerk
author at start life: Marinus Vonhof
date of start life: 2015-05-29
comment: Intrinsiek aspect
comment: [is aspect]
scope note: Collection of facts MDS
scope note: Collection of facts REV
scope note: Collection of facts HYD
scope note: Collection of facts RGM
type: Class
subclass of: Materiaal
subclass of: Restriction
  author at start life: Marinus Vonhof
  date of start life: 2017-08-21
  validity context: 5t 11t
  on class: Bouwwerk
  on property: has as aspect (inverse)
  max qualified cardinality: 1
subclass of: Restriction
  on property: has as reference (qualification)
  all values from: Materiaal put (coll)

Buitengrens
author of change: Marinus Vonhof
date of change: 2024-07-17
date of change: 2020-11-24
date of change: 2024-12-07
definition: Het vlak dat de buitengrens beschrijft van de ruimte of de bovenkant van de constructie (topini: outer boundary/1661)
author at start life: Marinus Vonhof
date of start life: 2013-09-03
units of measurements: gml
comment: [is aspect]
scope note: Collection of facts TOP
type: Class
subclass of: Vlak
subclass of: Restriction
  author of change: Marinus Vonhof
  date of change: 2020-04-18
  author at start life: Marinus Vonhof
  date of start life: 2012-11-23
  on class: Putoriëntatie
  on property: has as aspect (inverse)
  max qualified cardinality: 1
subclass of: Restriction
  author of change: Marinus Vonhof
  date of change: 2020-04-18
  author at start life: Marinus Vonhof
  date of start life: 2016-11-09
  on class: Bouwwerkoriëntatie
  on property: has as aspect (inverse)
  max qualified cardinality: 1
subclass of: Restriction
  author of change: Marinus Vonhof
  date of change: 2020-04-18
  author at start life: Marinus Vonhof
  date of start life: 2016-11-09
  on class: Gebiedsoriëntatie
  on property: has as aspect (inverse)
  max qualified cardinality: 1
subclass of: Restriction
  on property: has as value
  all values from: gmlLiteral

Bovendrempelberging
definition: [NEN 3300:1996] De hoeveelheid water (in m3 of mm ten opzichte van het afvoerend oppervlak) die in een rioolstelsel boven het niveau van de laagste overstortdrempel geborgen kan worden zonder aanleiding te geven tot overstorting of water op straat
author at start life: Marinus Vonhof
date of start life: 2022-09-30
validity context: *d
scope note: Collection of facts BAS
type: Class
subclass of: NEN 3300 Term

Bovengrond
author of change: Marinus Vonhof
author of change: Johan Post
date of change: 2015-06-01
date of change: 2026-04-30
author at start life: Marinus Vonhof
date of start life: 2013-10-05
validity context: *f 16d
scope note: Collection of facts TOP
type: Class
subclass of: Ruimte
subclass of: Restriction
  author at start life: Johan Post
  date of start life: 2026-04-30
  on class: Leiding
  on property: has as part
  min qualified cardinality: 0
subclass of: Restriction
  author at start life: Johan Post
  date of start life: 2026-04-30
  on class: Put
  on property: has as part
  min qualified cardinality: 0
subclass of: Restriction
  author at start life: Marinus Vonhof
  date of start life: 2013-10-05
  on class: Inrichting bovengrond
  on property: has as aspect
  max qualified cardinality: 1

Ruimte
author of change: Marinus Vonhof
date of change: 2017-11-16
definition: [Gellish] Is an inanimate physical object (a physical object that is not capable of life) that is volumetric and is enclosed by physical or imaginary boundaries and exists in time. This is distinguished from a volumetric spatial aspect and from a volume as a property. @en
author at start life: Marinus Vonhof
date of start life: 2013-09-03
validity context: *f 15d
comment: 2 of meer
scope note: Collection of facts TOP
type: Class
subclass of: Restriction
  on property: has as part
  all values from: Class
    union of: Ruimte
    union of: Fysiek object
disjoint with: Fysiek object

Inrichting bovengrond
author at start life: Marinus Vonhof
date of start life: 2013-10-05
validity context: 6d
comment: [is aspect]
scope note: Collection of facts BAS
scope note: Collection of facts DMO
type: Class
subclass of: Kenmerk
subclass of: Restriction
  author of change: Marinus Vonhof
  date of change: 2020-04-18
  author at start life: Marinus Vonhof
  date of start life: 2013-10-05
  on class: Bovengrond
  on property: has as aspect (inverse)
  max qualified cardinality: 1
subclass of: Restriction
  on property: has as reference (qualification)
  all values from: Inrichting bovengrond (coll)

Inrichting bovengrond (coll)
validity context: 6d
comment: [is coll]
scope note: Collection of facts BAS
scope note: Collection of facts DMO
type: Class
subclass of: Verzameling soorten
subclass of: Class
  one of: OpenbaarGroen
  one of: InDeWeg
  one of: Trottoir Fietspad
  one of: ParticuliereGrond
  one of: InDeWegkant
  one of: BraakTerrein

Brandput
definition: Put, in de grond geslagen tot aan een watervoerende laag
author at start life: Marinus Vonhof
date of start life: 2018-12-06
validity context: 1d 3d
alternative label: Nortonpijp
alternative label: Nortonput
scope note: Collection of facts BAS
type: Class
subclass of: Put
subclass of: Restriction
  on property: heeft Functie
  has value: BluswaterLeveren

Breedte
author of change: Marinus Vonhof
date of change: 2015-05-29
definition: In zelfde vlak als lengte, haaks op lengtemeting
author at start life: Nic Roest (Idoro)
date of start life: 2006-02-21
validity context: 15d
comment: [is aspect]
scope note: Collection of facts TOP
type: Class
subclass of: Afstand

Buisdeel
label: Pipe unit @en
author of change: Marinus Vonhof
author of change: Johan Post
date of change: 2025-01-16
date of change: 2022-09-29
date of change: 2024-07-26
definition: Het buisdeel dat samen met andere buisdelen de leiding vormt
definition: [EN 16323:2014] component part of a drain or sewer manufactured as a single entity and intended to be joined with other pipe units @en
author at start life: Marinus Vonhof
date of start life: 2011-12-02
validity context: 10d
alternative label: Buis
scope note: Collection of facts RRB
scope note: Collection of facts LDR
scope note: Collection of facts BAS
scope note: Collection of facts PLI
scope note: Collection of facts MTR
type: Class
subclass of: Constructieonderdeel
subclass of: Restriction
  author of change: Marinus Vonhof
  date of change: 2019-04-04
  date of change: 2022-10-01
  author at start life: Marinus Vonhof
  date of start life: 2014-04-29
  on class: Rioolleiding
  on property: has as part (inverse)
  max qualified cardinality: 1
subclass of: Restriction
  author of change: Marinus Vonhof
  date of change: 2022-10-01
  on class: Transportleiding
  on property: has as part (inverse)
  max qualified cardinality: 1
subclass of: Restriction
  author at start life: Marinus Vonhof
  date of start life: 2013-03-29
  on class: Lengte buisdeel
  on property: has as aspect
  max qualified cardinality: 1
subclass of: Restriction
  on property: heeft Toepassing
  has value: OpbouwLeiding
subclass of: Restriction
  on class: Constructieonderdeeloriëntatie
  on property: has as aspect
  max qualified cardinality: 1
subclass of: Restriction
  on class: Verbindingstype
  on property: has as aspect
  max qualified cardinality: 1
subclass of: Restriction
  on class: Wanddikte
  on property: has as aspect
  min qualified cardinality: 0

Breedte compartiment
author at start life: Marinus Vonhof
date of start life: 2011-12-15
units of measurements: mm
comment: Intrinsiek aspect
comment: [is aspect]
scope note: Collection of facts MDS
scope note: Collection of facts HYD
type: Class
subclass of: Breedte
subclass of: Restriction
  author of change: Marinus Vonhof
  date of change: 2018-05-03
  author at start life: Marinus Vonhof
  date of start life: 2011-12-15
  validity context: 5t 11t
  on class: Compartiment
  on property: has as aspect (inverse)
  max qualified cardinality: 1
subclass of: Restriction
  on property: has as value
  all values from: integer

Breedte hulpstuk
definition: De bij het materiaal gebruikelijke aanduiding van de breedte van een hulpstuk.
author at start life: Johan Post
date of start life: 2026-05-18
units of measurements: mm
comment: Intrinsiek aspect
comment: [is aspect]
scope note: Collection of facts BAS
scope note: Collection of facts PLI
type: Class
subclass of: Breedte
subclass of: Restriction
  on property: has as value
  all values from: Breedte hulpstuk (datatype)
subclass of: Restriction
  on class: Hulpstuk
  on property: has as aspect (inverse)
  max qualified cardinality: 1

Breedte kast
author of change: Nic Roest (Idoro)
date of change: 2006-11-23
definition: De uitwendige breedte van een elektriciteitskast
author at start life: Nic Roest (Idoro)
date of start life: 2006-02-21
units of measurements: mm
comment: Intrinsiek aspect
comment: [is aspect]
scope note: Collection of facts MDS
scope note: Collection of facts RGM
type: Class
subclass of: Breedte
subclass of: Restriction
  author of change: Marinus Vonhof
  date of change: 2018-05-03
  author at start life: Finy Teitsma (Oranjewoud)
  date of start life: 2006-02-25
  on class: Elektriciteitskast
  on property: has as aspect (inverse)
  max qualified cardinality: 1
subclass of: Restriction
  on property: has as value
  all values from: integer

Breedte opening
author of change: Marinus Vonhof
date of change: 2015-06-01
author at start life: Marinus Vonhof
date of start life: 2011-12-15
units of measurements: mm
comment: Intrinsiek aspect
comment: [is aspect]
scope note: Collection of facts MDS
scope note: Collection of facts REV
scope note: Collection of facts HYD
type: Class
subclass of: Breedte
subclass of: Restriction
  author of change: Marinus Vonhof
  date of change: 2017-12-07
  author at start life: Marinus Vonhof
  date of start life: 2011-12-15
  validity context: 5t 11t
  on class: Doorlaat
  on property: has as aspect (inverse)
  max qualified cardinality: 1
subclass of: Restriction
  on property: has as value
  all values from: integer

Doorlaat
author of change: Marinus Vonhof
date of change: 2018-12-13
definition: Een regelvoorziening voor de stroming van het afvalwater.
notation: DRL
author at start life: Marinus Vonhof
date of start life: 2012-05-05
validity context: *f
scope note: Collection of facts MDS
scope note: Collection of facts REV
scope note: Collection of facts PLI
scope note: Collection of facts HYD
scope note: Collection of facts DMO
type: Class
subclass of: Constructieonderdeel
subclass of: Restriction
  author of change: Marinus Vonhof
  date of change: 2016-04-15
  author at start life: Marinus Vonhof
  date of start life: 2011-12-15
  validity context: 5t 11t 14t
  on class: Contractiecoëfficiënt doorlaatprofiel
  on property: has as aspect
  max qualified cardinality: 1
subclass of: Restriction
  author of change: Marinus Vonhof
  date of change: 2017-09-06
  author at start life: Marinus Vonhof
  date of start life: 2011-12-15
  validity context: 5t 11t 14t
  on class: Maximale capaciteit doorlaat
  on property: has as aspect
  max qualified cardinality: 1
subclass of: Restriction
  author of change: Marinus Vonhof
  date of change: 2017-12-07
  author at start life: Marinus Vonhof
  date of start life: 2011-12-15
  validity context: 11t 14t
  on class: Hoogte opening
  on property: has as aspect
  max qualified cardinality: 1
subclass of: Restriction
  author of change: Marinus Vonhof
  date of change: 2017-12-07
  author at start life: Marinus Vonhof
  date of start life: 2011-12-15
  validity context: 5t 11t 14t
  on class: Breedte opening
  on property: has as aspect
  max qualified cardinality: 1
subclass of: Restriction
  author of change: Marinus Vonhof
  date of change: 2017-12-07
  author at start life: Marinus Vonhof
  date of start life: 2011-12-15
  validity context: 5t 11t 14t
  on class: Vorm opening
  on property: has as aspect
  max qualified cardinality: 1
subclass of: Restriction
  author of change: Marinus Vonhof
  date of change: 2017-12-07
  author at start life: Marinus Vonhof
  date of start life: 2017-08-31
  on class: Diameter opening
  on property: has as aspect
  max qualified cardinality: 1
subclass of: Restriction
  author at start life: Marinus Vonhof
  date of start life: 2011-12-15
  on property: has as aspect
  some values from: Breedte opening
subclass of: Restriction
  author at start life: Marinus Vonhof
  date of start life: 2011-12-15
  on property: has as aspect
  some values from: Hoogte opening
subclass of: Restriction
  author at start life: Marinus Vonhof
  date of start life: 2011-12-15
  on property: has as aspect
  some values from: Vorm opening
subclass of: Restriction
  author at start life: Marinus Vonhof
  date of start life: 2012-04-22
  validity context: 5t 11t 14t
  on class: Onderdeeloriëntatie
  on property: has as aspect
  max qualified cardinality: 1
subclass of: Restriction
  author at start life: Marinus Vonhof
  date of start life: 2017-08-31
  on property: has as aspect
  some values from: Diameter opening
subclass of: Restriction
  author at start life: Marinus Vonhof
  date of start life: 2017-09-06
  validity context: 5t 11t 14t
  on class: Stromingsrichting
  on property: has as aspect
  max qualified cardinality: 1
subclass of: Restriction
  author at start life: Marinus Vonhof
  date of start life: 2017-12-07
  validity context: 5t 11t 14t
  on class: Doorlaatniveau
  on property: has as aspect
  max qualified cardinality: 1
subclass of: Restriction
  author at start life: Marinus Vonhof
  date of start life: 2026-07-20
  on class: Rioolleiding
  on property: has as part (inverse)
  max qualified cardinality: 1
subclass of: Restriction
  author at start life: Marinus Vonhof
  date of start life: 2026-07-20
  on class: Transportleiding
  on property: has as part (inverse)
  max qualified cardinality: 1
subclass of: Restriction
  on property: heeft Functie
  has value: BeperkenDebiet

Breedte put
author of change: Marinus Vonhof
author of change: Johan Post
date of change: 2021-08-06
date of change: 2026-05-01
definition: De inwendige breedte (horizontaal, uit het bovenaanzicht). Indien aanwezig de breedte van de onderbak - zie afbeelding dc (bron EN13508-2)
author at start life: Marinus Vonhof
date of start life: 2018-10-17
units of measurements: mm
comment: Intrinsiek aspect
comment: [is aspect]
scope note: Collection of facts TOP
type: Class
subclass of: Breedte
subclass of: Restriction
  author of change: Marinus Vonhof
  date of change: 2014-08-01
  author at start life: Finy Teitsma (Oranjewoud)
  date of start life: 2006-02-25
  validity context: *t
  on class: Put
  on property: has as aspect (inverse)
  max qualified cardinality: 1
subclass of: Restriction
  on property: has as value
  all values from: Breedte put (datatype)

Breedte toegang
author of change: Marinus Vonhof
author of change: Nic Roest (Idoro)
author of change: Johan Post
date of change: 2025-01-16
date of change: 2026-05-01
date of change: 2006-11-23
definition: [IMBOR] De kleinste afmeting in het horizontale vlak dat toegang geeft tot het object. - zie afbeelding da (bron EN13508-2)
notation: JCC
author at start life: Nic Roest (Idoro)
date of start life: 2006-03-23
units of measurements: mm
comment: Intrinsiek aspect
comment: [is aspect]
scope note: Collection of facts RRB
scope note: Collection of facts LDR
scope note: Collection of facts BAS
scope note: Collection of facts DMO
type: Class
subclass of: Breedte
subclass of: Restriction
  author of change: Marinus Vonhof
  date of change: 2018-05-03
  author at start life: Finy Teitsma (Oranjewoud)
  date of start life: 2006-02-25
  on class: Rioolput
  on property: has as aspect (inverse)
  max qualified cardinality: 1
subclass of: Restriction
  author at start life: Marinus Vonhof
  date of start life: 2015-02-02
  on class: Reinigen rioolput
  on property: has as output (inverse)
  max qualified cardinality: 1
subclass of: Restriction
  on property: has as value
  all values from: integer

Bron
author of change: Marinus Vonhof
date of change: 2025-01-16
definition: [IMBOR] Watervlakte waar water uit de grond ontspringt.
author at start life: Marinus Vonhof
date of start life: 2017-05-31
validity context: 1d 3d 10d 12d 14d
scope note: Collection of facts MDS
type: Class
subclass of: Waterloop
subclass of: Restriction
  on property: heeft Toepassing
  has value: OntspringtUitDeGrond

Bronneringswater
author of change: Marinus Vonhof
date of change: 2018-12-10
author at start life: Marinus Vonhof
date of start life: 2014-11-28
see also: [IRIS-RIOKEN:2012] Opgepompt ondiep grondwater
scope note: Collection of facts BAS
type: Class
subclass of: Grondwater

Grondwater
label: Groundwater @en
author of change: Marinus Vonhof
author of change: Johan Post
date of change: 2024-04-30
date of change: 2020-03-17
definition: [Waterwet] Soort afvalwater
definition: Is een soort afvalwater als het overtollig is
definition: Water afkomstig uit de ondergrond
definition: [EN 16323:2014] All water which is below the surface of the ground in the saturation zone and in direct contact with the ground or subsoil @en
definition: [Waterwet] Water dat vrij onder het aardoppervlak voorkomt, met de daarin aanwezige stoffen
author at start life: Marinus Vonhof
author at start life: Nic Roest (Idoro)
date of start life: 2007-11-29
scope note: Collection of facts BAS
type: Class
subclass of: Afvalwater
subclass of: Water
subclass of: Restriction
  author at start life: Marinus Vonhof
  date of start life: 2020-04-17
  on class: Grondwatersamenstellingsonderzoek
  on property: has as input (inverse)
  qualified cardinality: 1

Bruin afvalwater
definition: Fecaliën met spoelwater, afgescheiden van urine in urinescheidingstoiletten
author at start life: Marinus Vonhof
date of start life: 2016-04-15
scope note: Collection of facts BAS
type: Class
subclass of: Afvalwater

Gemeentelijk gebied
author of change: Marinus Vonhof
date of change: 2015-05-27
author at start life: Marinus Vonhof
date of start life: 2014-11-30
validity context: 1d 3d 10d 12d 14d
comment: [VervallenLink http://definities.geostandaarden.nl/concepten/imgeo/doc/begrip/Gemeente]
see also: [IMGeo:1.0/2007] Een gedeelte van het grondgebied van Nederland, ingesteld op basis van Artikel 123 van de Grondwet.
alternative label: Gemeentegrens
scope note: Collection of facts BAS
scope note: Collection of facts DMO
type: Class
subclass of: Registratief gebied
subclass of: Restriction
  author of change: Marinus Vonhof
  date of change: 2015-05-27
  author at start life: Marinus Vonhof
  date of start life: 2014-11-30
  on class: Kern
  on property: has as part
  min qualified cardinality: 1
subclass of: Restriction
  author of change: Marinus Vonhof
  date of change: 2015-07-08
  author at start life: Marinus Vonhof
  date of start life: 2014-12-02
  on class: Rioleringsgebied
  on property: has as part
  min qualified cardinality: 0
subclass of: Restriction
  author of change: Marinus Vonhof
  date of change: 2015-10-26
  author at start life: Marinus Vonhof
  date of start life: 2014-11-30
  on class: Gemeente
  on property: is connected to
  qualified cardinality: 1

Overstortput
label: Combined sewer overflow @en
author of change: Marinus Vonhof
author of change: Wouter van Riel
date of change: 2024-04-20
date of change: 2024-05-17
definition: Een rioolput voorzien van een overstortdrempel met een ontworpen drempellengte en -hoogte.
definition: [EN 16323:2014] device on a combined system that relieves the system of excess flow @en
definition: [NEN 3300:1996] rioolput voorzien van een overstortdrempel
definition: [Omgevingswet] Een kunstwerk waarmee rioolwater op het oppervlaktewater wordt geloosd, zodra het riool door te grote neerslaghoeveelheden niet al het rioolwater kan verwerken
author at start life: Finy Teitsma (Oranjewoud)
date of start life: 2006-02-20
validity context: 3f 10f 11f 14f
see also: [IRIS-RIOKEN:2012] Een inzamelknooppunt, uitgevoerd als voorziening met drempel, voor het onder bepaalde omstandigheden lozen van afvalwater uit het rioleringsnetwerk naar een ander rioleringsnetwerk of oppervlaktewater in de zin van de Wet verontreiniging oppervlaktewateren. Een riooloverstort is dus een voorziening door middel waarvan bij de neerslag van hemelwater het teveel aan hemelwater, al of niet vermengd met afvalwater dat niet in het stelsel wordt geborgen, kan worden geloosd op oppervlaktewater.
alternative label: Overstort
alternative label: Riooloverstort
scope note: Collection of facts TOP
type: Class
subclass of: Rioolput
subclass of: Restriction
  author of change: Finy Teitsma (Oranjewoud)
  date of change: 2007-11-29
  author at start life: Finy Teitsma (Oranjewoud)
  date of start life: 2006-07-12
  on class: Duikschot
  on property: has as part
  max qualified cardinality: 1
subclass of: Restriction
  author of change: Marinus Vonhof
  date of change: 2021-08-06
  author at start life: Finy Teitsma (Oranjewoud)
  date of start life: 2006-02-25
  comment: per definitie
  on class: Overstortdrempel
  on property: has as part
  min qualified cardinality: 1
subclass of: Restriction
  author of change: Wouter van Riel
  date of change: 2022-09-26
  author at start life: Marinus Vonhof
  date of start life: 2014-04-29
  comment: per definitie
  on class: Keerklep
  on property: has as part
  min qualified cardinality: 0
subclass of: Restriction
  author of change: Wouter van Riel
  date of change: 2024-04-20
  author at start life: Marinus Vonhof
  date of start life: 2014-04-29
  on class: Compartiment
  on property: has as part
  min qualified cardinality: 1
subclass of: Restriction
  author at start life: Marinus Vonhof
  date of start life: 2018-10-27
  on class: NLCS_GWA_RIOOLPUT_OVERSTORTPUT
  on property: is represented by
  max qualified cardinality: 1
subclass of: Restriction
  author at start life: Marinus Vonhof
  date of start life: 2018-10-27
  on class: NLCS_HWA_RIOOLPUT_OVERSTORTPUT
  on property: is represented by
  max qualified cardinality: 1
subclass of: Restriction
  author at start life: Marinus Vonhof
  date of start life: 2018-10-27
  on class: NLCS_ITR_RIOOLPUT_OVERSTORTPUT
  on property: is represented by
  max qualified cardinality: 1
subclass of: Restriction
  author at start life: Marinus Vonhof
  date of start life: 2018-10-27
  on class: NLCS_SWA_RIOOLPUT_OVERSTORTPUT
  on property: is represented by
  max qualified cardinality: 1
subclass of: Restriction
  author at start life: Marinus Vonhof
  date of start life: 2018-10-27
  on class: NLCS_VWA_RIOOLPUT_OVERSTORTPUT
  on property: is represented by
  max qualified cardinality: 1
subclass of: Restriction
  author at start life: Marinus Vonhof
  date of start life: 2018-11-07
  on class: Sym_Overstortput
  on property: is represented by
  max qualified cardinality: 1
subclass of: Restriction
  author at start life: Marinus Vonhof
  date of start life: 2024-05-17
  on class: Overstortbemaling
  on property: has as part
  min qualified cardinality: 0
subclass of: Restriction
  on property: heeft Toepassing
  has value: Calamiteit
subclass of: Restriction
  on property: heeft Functie
  has value: OvertolligAfvalwaterLatenWegstromen

Kathodische bescherming
author of change: Marinus Vonhof
author of change: Johan Post
date of change: 2025-01-16
date of change: 2026-05-21
definition: [IMBOR] Aanduiding of er sprake is van corrosiebestrijding door middel van potentiaalverlaging.
author at start life: Marinus Vonhof
date of start life: 2014-12-02
validity context: 15d
comment: [is aspect]
scope note: Collection of facts BAS
scope note: Collection of facts PLI
type: Class
subclass of: Kenmerk
subclass of: Restriction
  author at start life: Marinus Vonhof
  date of start life: 2024-05-16
  on class: Transportleiding
  on property: has as aspect (inverse)
  max qualified cardinality: 1
subclass of: Restriction
  on class: Bufferput
  on property: has as aspect (inverse)
  max qualified cardinality: 1
subclass of: Restriction
  on class: Vacuümopslagtank
  on property: has as aspect (inverse)
  max qualified cardinality: 1

Meetinstrument
author of change: Marinus Vonhof
author of change: Johan Post
author of change: Eric van Gorkom
author of change: Wouter van Riel
date of change: 2026-05-01
date of change: 2022-12-24
date of change: 2026-05-21
date of change: 2024-04-22
date of change: 2021-09-23
date of change: 2022-10-01
definition: Een instrument bestemd voor het verrichten van metingen.
author at start life: Nic Roest (Idoro)
date of start life: 2006-03-23
validity context: 1d 3d 10d 12d 14f
scope note: Collection of facts BAS
type: Class
subclass of: Apparatuur
subclass of: Restriction
  author of change: Marinus Vonhof
  date of change: 2018-11-06
  author at start life: Marinus Vonhof
  date of start life: 2014-11-30
  on class: Stelsel
  on property: has as part (inverse)
  max qualified cardinality: 1
subclass of: Restriction
  author at start life: Finy Teitsma (Oranjewoud)
  date of start life: 2007-11-29
  on class: Frequentie-omvormer
  on property: is connected to
  max qualified cardinality: 1
subclass of: Restriction
  author at start life: Finy Teitsma (Oranjewoud)
  date of start life: 2007-11-30
  on class: PLC
  on property: is connected to
  max qualified cardinality: 1
subclass of: Restriction
  author at start life: Johan Post
  date of start life: 2026-05-01
  on class: Leiding
  on property: has as part (inverse)
  max qualified cardinality: 1
subclass of: Restriction
  author at start life: Johan Post
  date of start life: 2026-05-01
  on class: Put
  on property: has as part (inverse)
  max qualified cardinality: 1
subclass of: Restriction
  author at start life: Marinus Vonhof
  date of start life: 2015-07-09
  on class: Meetpunt
  on property: has as aspect
  max qualified cardinality: 1
subclass of: Restriction
  author at start life: Marinus Vonhof
  date of start life: 2015-07-28
  on class: Elektriciteitskast
  on property: is connected to
  max qualified cardinality: 1
subclass of: Restriction
  author at start life: Marinus Vonhof
  date of start life: 2018-12-06
  on class: Hoofdpost
  on property: is connected to
  max qualified cardinality: 1
subclass of: Restriction
  author at start life: Marinus Vonhof
  date of start life: 2020-04-17
  on class: Meetinrichting
  on property: has as part (inverse)
  max qualified cardinality: 1
subclass of: Restriction
  author at start life: Marinus Vonhof
  date of start life: 2020-04-17
  on class: Regelinrichting
  on property: has as part (inverse)
  max qualified cardinality: 1
subclass of: Restriction
  on property: heeft Functie
  has value: MetenFunctie
subclass of: Restriction
  on class: Sensor
  on property: has as part
  min qualified cardinality: 0

Vacuümklep
definition: Automatische klep die afvalwater en lucht in een vacuümriool laat instromen en het vacuüm onderhoudt.
author at start life: Johan Post
date of start life: 2026-05-21
scope note: Collection of facts BAS
type: Class
subclass of: Mechanische afsluiter
subclass of: Restriction
  on property: heeft Functie
  has value: AfsluitenInTweeStroomrichtingen
subclass of: Restriction
  on class: Bufferput
  on property: has as part (inverse)
  qualified cardinality: 1

Buffertoren
author of change: Marinus Vonhof
author of change: Wouter van Riel
date of change: 2025-01-16
date of change: 2024-04-23
definition: [NEN 3300:1996] Wateropslagvoorziening in de vorm van een toren
author at start life: Marinus Vonhof
date of start life: 2022-09-30
validity context: *d
scope note: Collection of facts BAS
scope note: Collection of facts PLI
type: Class
subclass of: NEN 3300 Term
subclass of: Waterslagvoorziening
subclass of: Restriction
  on property: heeft Uitvoering
  has value: VormVanEenToren

Lining met afzonderlijke buizen
label: Lining with discrete pipes @en
author of change: Marinus Vonhof
date of change: 2025-01-16
definition: [IMBOR] Lining door middel van een geheel nieuwe buisleiding bestaande uit meerdere stukken, die in een bestaande leiding worden aangebracht.
notation: E
author at start life: Marinus Vonhof
date of start life: 2018-12-12
scope note: Collection of facts MDS
scope note: Collection of facts LDR
scope note: Collection of facts MTR
type: Class
subclass of: Lining
subclass of: Restriction
  on property: heeft Uitvoering
  has value: BuisUitMeerdereStukken

Vorm drempel in bovenaanzicht (coll)
author of change: Marinus Vonhof
date of change: 2026-07-13
author at start life: Johan Post
date of start life: 2026-07-02
comment: [is coll]
scope note: Collection of facts BAS
type: Class
subclass of: Verzameling soorten

Constructieonderdeeloriëntatie
author of change: Marinus Vonhof
date of change: 2024-07-30
definition: Een topologisch element dat de ligging van het constructieonderdeel beschrijft, de bijbehorend geometrie kan een punt of lijn zijn. Bij een buisvormig deel (deelliner, buisdeel) beschrijft de geometrie (punt of lijn) het midden van de binnenonderkant
author at start life: Wouter van Riel
date of start life: 2024-04-22
scope note: Collection of facts BAS
scope note: Collection of facts PLI
scope note: Collection of facts HYD
type: Class
subclass of: Representatie fysiek object
subclass of: Restriction
  author at start life: Marinus Vonhof
  date of start life: 2024-07-30
  on class: Buisdeel
  on property: has as aspect (inverse)
  max qualified cardinality: 1
subclass of: Restriction
  author at start life: Marinus Vonhof
  date of start life: 2024-07-30
  on class: Punt
  on property: has as aspect
  max qualified cardinality: 1
subclass of: Restriction
  author at start life: Marinus Vonhof
  date of start life: 2024-07-30
  on class: Reparatie
  on property: has as aspect (inverse)
  max qualified cardinality: 1
subclass of: Restriction
  author at start life: Marinus Vonhof
  date of start life: 2024-07-30
  on class: Wand
  on property: has as aspect (inverse)
  max qualified cardinality: 1
subclass of: Restriction
  author at start life: Wouter van Riel
  date of start life: 2024-04-22
  on class: Lijn
  on property: has as aspect
  max qualified cardinality: 1

Verbindingstype
label: Joint @en
author of change: Marinus Vonhof
date of change: 2018-12-05
definition: De wijze waarop de buizen binnen een leiding zijn verbonden
definition: [EN 16323:2014] connection between the adjacent ends of two components including the means of sealing @en
notation: AXF
notation: GXF
author at start life: Nic Roest (Idoro)
date of start life: 2006-02-21
validity context: 15d
comment: [is aspect]
scope note: Collection of facts MDS
scope note: Collection of facts RRB
scope note: Collection of facts LDR
scope note: Collection of facts PLI
type: Class
subclass of: Kenmerk
subclass of: Restriction
  author of change: Marinus Vonhof
  date of change: 2018-12-05
  author at start life: Finy Teitsma (Oranjewoud)
  date of start life: 2006-02-25
  on class: Leiding
  on property: has as aspect (inverse)
  max qualified cardinality: 1
subclass of: Restriction
  on property: has as reference (qualification)
  all values from: Verbindingstype (coll)
subclass of: Restriction
  on class: Buisdeel
  on property: has as aspect (inverse)
  max qualified cardinality: 1

Wanddikte
author of change: Marinus Vonhof
author of change: Johan Post
date of change: 2024-05-02
date of change: 2019-09-02
definition: Dikte van de wand van de constructie
notation: AXE
notation: CXE
author at start life: Nic Roest (Idoro)
date of start life: 2006-02-21
units of measurements: mm
comment: [is aspect]
scope note: Collection of facts MDS
scope note: Collection of facts EN
scope note: Collection of facts RRB
scope note: Collection of facts PLI
scope note: Collection of facts HYD
type: Class
subclass of: Dikte
subclass of: Restriction
  author of change: Marinus Vonhof
  date of change: 2019-09-02
  author at start life: Finy Teitsma (Oranjewoud)
  date of start life: 2006-02-25
  on class: Leiding
  on property: has as aspect (inverse)
  max qualified cardinality: 1
subclass of: Restriction
  author at start life: Marinus Vonhof
  date of start life: 2015-10-21
  on class: Put
  on property: has as aspect (inverse)
  max qualified cardinality: 1
subclass of: Restriction
  on property: has as value
  all values from: integer
subclass of: Restriction
  on class: Buisdeel
  on property: has as aspect (inverse)
  max qualified cardinality: 1

Status functioneren (coll)
validity context: 6d
comment: [is coll]
scope note: Collection of facts REV
scope note: Collection of facts BAS
scope note: Collection of facts DMO
type: Class
subclass of: Verzameling soorten
subclass of: Class
  one of: InOntwerp
  one of: InGebruik
  one of: InAanleg
  one of: BuitenGebruik

Vlak
author of change: Marinus Vonhof
date of change: 2019-05-15
definition: Tweedimensionaal geometrisch element. Voor geografische beschrijvingen conform coordinatenstelsel EPSG:7415 (x/y conform EPSG:28992, optioneel z conform EPSG:5709).
author at start life: Marinus Vonhof
date of start life: 2016-11-09
units of measurements: gml
comment: [is aspect]
scope note: Collection of facts TOP
type: Class
subclass of: Geometrie
subclass of: Restriction
  on property: has as value
  all values from: gmlLiteral

Putoriëntatie
author of change: Marinus Vonhof
date of change: 2018-12-10
definition: Een topologisch element dat het zwaartepunt (vertex) van de bovenkant putbodem en/of de contouren van de constructie (edge) beschrijft.
author at start life: Marinus Vonhof
date of start life: 2017-12-12
scope note: Collection of facts TOP
type: Class
subclass of: Knooppunt
subclass of: Restriction
  author of change: Marinus Vonhof
  date of change: 2017-12-12
  author at start life: Marinus Vonhof
  date of start life: 2013-03-26
  on class: Grondwatermeetpunt
  on property: is connected to
  max qualified cardinality: 1
subclass of: Restriction
  author of change: Marinus Vonhof
  date of change: 2017-12-12
  author at start life: Marinus Vonhof
  date of start life: 2015-11-07
  validity context: 5t 11t
  on class: Maaiveldoriëntatie
  on property: is connected to
  max qualified cardinality: 1
subclass of: Restriction
  author of change: Marinus Vonhof
  date of change: 2020-04-18
  author at start life: Marinus Vonhof
  date of start life: 2012-11-23
  comment: Temporeel kenmerk, met kenmerk Inwinning
  on class: Buitengrens
  on property: has as aspect
  min qualified cardinality: 0
subclass of: Restriction
  author of change: Marinus Vonhof
  date of change: 2020-11-25
  author at start life: Marinus Vonhof
  date of start life: 2014-05-02
  on class: Hydraulisch rioleringsmodel
  on property: has as part (inverse)
  qualified cardinality: 1
subclass of: Restriction
  author at start life: Marinus Vonhof
  date of start life: 2012-04-22
  validity context: *t
  on class: Put
  on property: has as aspect (inverse)
  max qualified cardinality: 1

Gebiedsoriëntatie
author of change: Marinus Vonhof
date of change: 2020-11-24
definition: Een topologisch element dat (de contouren van) het gebied, systeem of stelsel beschrijft
author at start life: Marinus Vonhof
date of start life: 2016-11-09
scope note: Collection of facts MDS
scope note: Collection of facts HYD
scope note: Collection of facts DMO
type: Class
subclass of: Representatie fysiek object
subclass of: Restriction
  author of change: Marinus Vonhof
  date of change: 2016-11-09
  author at start life: Marinus Vonhof
  date of start life: 2015-07-28
  on class: Gebied
  on property: has as aspect (inverse)
  max qualified cardinality: 1
subclass of: Restriction
  author of change: Marinus Vonhof
  date of change: 2020-04-18
  author at start life: Marinus Vonhof
  date of start life: 2016-11-09
  comment: Temporeel kenmerk, met kenmerk Inwinning
  on class: Buitengrens
  on property: has as aspect
  min qualified cardinality: 0
subclass of: Restriction
  author at start life: Marinus Vonhof
  date of start life: 2020-04-20
  on class: Stelsel
  on property: has as aspect (inverse)
  max qualified cardinality: 1
subclass of: Restriction
  author at start life: Marinus Vonhof
  date of start life: 2020-04-20
  on class: Systeem
  on property: has as aspect (inverse)
  max qualified cardinality: 1

Buitenopstellingskast
author of change: Marinus Vonhof
date of change: 2018-05-03
definition: Een elektriciteitskast die in de buitenlucht is opgesteld.
author at start life: Finy Teitsma (Oranjewoud)
date of start life: 2006-03-23
validity context: 1d 3d
alternative label: Terreinkast
scope note: Collection of facts MDS
scope note: Collection of facts RGM
type: Class
subclass of: Elektriciteitskast
subclass of: Restriction
  author at start life: Marinus Vonhof
  date of start life: 2018-10-27
  on class: NLCS_TERREINKAST
  on property: is represented by
  max qualified cardinality: 1
subclass of: Restriction
  on property: heeft Uitvoering
  has value: OpgesteldInDeBuitenlucht

NLCS_TERREINKAST
author of change: Marinus Vonhof
date of change: 2018-11-07
definition: Lijntype: CONTINUOUS / Symbool: 2148 - TERREINKAST
notation: 3049
author at start life: Marinus Vonhof
date of start life: 2018-10-27
scope note: Collection of facts NLCS
type: Class
subclass of: NLCS_Object
subclass of: Restriction
  author at start life: Marinus Vonhof
  date of start life: 2018-10-27
  on class: Buitenopstellingskast
  on property: is represented by (inverse)
  max qualified cardinality: 1

Buitenriolering
definition: [NEN 3300:1996] Verzameling van objecten bedoeld voor de inzameling en het transport van afvalwater met uitsluiting van binnenriolering
author at start life: Marinus Vonhof
date of start life: 2022-09-30
validity context: *d
scope note: Collection of facts BAS
type: Class
subclass of: NEN 3300 Term

Buurt
author at start life: Wouter van Riel
date of start life: 2021-11-19
see also: [CBS] Onderdeel van een gemeente, dat vanuit bebouwingsoogpunt of sociaaleconomische structuur homogeen is afgebakend.
scope note: Collection of facts BAS
scope note: Collection of facts DMO
type: Class
subclass of: Registratief gebied
subclass of: Restriction
  author of change: Marinus Vonhof
  date of change: 2021-12-29
  author at start life: Wouter van Riel
  date of start life: 2021-11-19
  on class: District
  on property: has as part (inverse)
  qualified cardinality: 1

District
label: District (EN) @en
definition: [EN13508-2+A1] De naam van de wijk zoals gespecificeerd door de bevoegde instantie
definition: [EN13508-2+A1] The name of the district as specified by the employing authority @en
notation: AAO
notation: CAO
notation: EAO
notation: GAO
notation: JAO
author at start life: Marinus Vonhof
date of start life: 2015-10-30
validity context: *d
see also: Vervallen link: https://imgeo.geostandaarden.nl/def/imgeo-object/wijk
see also: [IMGeo:1.0/2007] Een aaneengesloten gedeelte van het grondgebied van een gemeente, waarvan de grenzen zoveel mogelijk zijn gebaseerd op sociaal-geografische kenmerken.
alternative label: Wijk
scope note: Collection of facts BAS
scope note: Collection of facts DMO
type: Class
subclass of: Registratief gebied
subclass of: Restriction
  author of change: Marinus Vonhof
  date of change: 2016-04-24
  author at start life: Marinus Vonhof
  date of start life: 2014-12-01
  on class: Kern
  on property: has as part (inverse)
  qualified cardinality: 1
subclass of: Restriction
  author at start life: Wouter van Riel
  date of start life: 2021-11-19
  on class: Buurt
  on property: has as part
  min qualified cardinality: 0

Materiaal put
label: Material (manhole) @en
author of change: Marinus Vonhof
date of change: 2014-12-17
definition: [EN13508-2+A1] The material of the fabric of the manhole or inspection chamber in accordance with Table C.4. @en
notation: CCD
notation: ECD
notation: JCD
author at start life: Marinus Vonhof
date of start life: 2012-05-01
comment: Intrinsiek aspect
alternative label: Putmateriaal
comment: [is aspect]
scope note: Collection of facts TOP
type: Class
subclass of: Materiaal
subclass of: Restriction
  author of change: Marinus Vonhof
  date of change: 2015-06-01
  author at start life: Finy Teitsma (Oranjewoud)
  date of start life: 2007-10-24
  validity context: *t
  on class: Put
  on property: has as aspect (inverse)
  max qualified cardinality: 1
subclass of: Restriction
  on property: has as reference (qualification)
  all values from: Materiaal put (coll)

Reinigen
label: Cleaning @en
author of change: Marinus Vonhof
date of change: 2018-05-01
definition: [EN 16323:2014] operation consisting of removing deposited solid matter or obstructions @en
author at start life: Marinus Vonhof
date of start life: 2016-04-24
validity context: 1f 3f 5d 10f 11d 12f 14f
scope note: Collection of facts TOP
type: Class
subclass of: Onderhouden

Reinigingsproject riolering
author of change: Marinus Vonhof
date of change: 2015-10-30
definition: Een project dat tot doel heeft het rioleringssysteem te reinigen.
author at start life: Marinus Vonhof
date of start life: 2014-12-23
validity context: 3d 14d
scope note: Collection of facts MDS
scope note: Collection of facts RRB
type: Class
subclass of: Project
subclass of: Restriction
  author at start life: Marinus Vonhof
  date of start life: 2014-12-23
  on class: Reinigen rioolput
  on property: has as part
  min qualified cardinality: 0
subclass of: Restriction
  author at start life: Marinus Vonhof
  date of start life: 2014-12-23
  on class: Reinigen vrijverval leiding
  on property: has as part
  min qualified cardinality: 0
subclass of: Restriction
  author at start life: Marinus Vonhof
  date of start life: 2018-12-13
  on class: Reinigingsplan
  on property: has as output (inverse)
  max qualified cardinality: 1

Capaciteit gemaal
author of change: Johan Post
date of change: 2022-11-25
definition: De in de praktijk maximaal leverbare hoeveelheid per tijdseenheid (de capaciteit kan variëren door wisselende drukhoogte en pompschakeling)
author at start life: Marinus Vonhof
date of start life: 2015-05-29
units of measurements: m3/h
alternative label: Gemaalcapaciteit
alternative label: Geïnstalleerde capaciteit gemaal
comment: [is aspect]
scope note: Collection of facts BAS
scope note: Collection of facts HYD
scope note: Collection of facts RGM
scope note: Collection of facts DMO
type: Class
subclass of: Capaciteit
subclass of: Restriction
  author of change: Marinus Vonhof
  date of change: 2018-12-12
  author at start life: Marinus Vonhof
  date of start life: 2018-12-06
  on class: Gemaal
  on property: has as aspect (inverse)
  qualified cardinality: 1
subclass of: Restriction
  on property: has as value
  all values from: decimal

Centrale verdeelkast
author of change: Marinus Vonhof
date of change: 2025-01-16
date of change: 2019-05-15
definition: Een elektriciteitskast voor de besturing en voeding van meerdere regelvoorzieningen
definition: [IMBOR] Een verdeelinrichting, verdeelkast of groepenkast is de plek van waaruit de elektrische energie beveiligd en verdeeld wordt over de elektrische installatie in een gebouw.
author at start life: Finy Teitsma (Oranjewoud)
date of start life: 2006-03-23
validity context: 1d 3d
scope note: Collection of facts MDS
scope note: Collection of facts RGM
type: Class
subclass of: Elektriciteitskast
subclass of: Restriction
  author at start life: Marinus Vonhof
  date of start life: 2018-05-03
  on class: Drukriolering
  on property: has as part (inverse)
  max qualified cardinality: 1
subclass of: Restriction
  author at start life: Marinus Vonhof
  date of start life: 2020-04-17
  on class: Hybride drukriolering
  on property: has as part (inverse)
  max qualified cardinality: 1
subclass of: Restriction
  author at start life: Marinus Vonhof
  date of start life: 2020-04-17
  on class: Luchtpersriolering
  on property: has as part (inverse)
  max qualified cardinality: 1
subclass of: Restriction
  author at start life: Marinus Vonhof
  date of start life: 2020-04-17
  on class: Vacuümriolering
  on property: has as part (inverse)
  max qualified cardinality: 1
subclass of: Restriction
  on property: heeft Functie
  has value: BedienenVanMeerderePompunits

Hybride drukriolering
author of change: Marinus Vonhof
author of change: Johan Post
date of change: 2024-04-30
date of change: 2024-05-18
date of change: 2026-05-18
definition: Een drukrioleringsstelsel waarbij kleine hoeveelheden lucht in het stelsel wordt geïnjecteerd. De luchtinjectie-unit vervangt op strategische plaatsen een bestaande pomp (6 tot 10 % van de pompunits), zorgt voor transport van afvalwater door de persleiding onder luchtdruk en voegt lucht toe aan het rioolwater
author at start life: Marinus Vonhof
date of start life: 2020-04-17
validity context: 1d
alternative label: Hybride systeem
scope note: Collection of facts BAS
scope note: Collection of facts RGM
scope note: Collection of facts DMO
type: Class
subclass of: Mechanisch rioolstelsel
subclass of: Restriction
  author of change: Marinus Vonhof
  date of change: 2021-08-05
  author at start life: Marinus Vonhof
  date of start life: 2020-04-17
  on class: Drukleiding
  on property: has as part
  min qualified cardinality: 1
subclass of: Restriction
  author at start life: Marinus Vonhof
  date of start life: 2020-04-17
  on class: Centrale verdeelkast
  on property: has as part
  max qualified cardinality: 1
subclass of: Restriction
  author at start life: Marinus Vonhof
  date of start life: 2020-04-17
  on class: Luchtinjectie-unit
  on property: has as part
  min qualified cardinality: 1
subclass of: Restriction
  author at start life: Marinus Vonhof
  date of start life: 2020-04-17
  on class: Pompunit
  on property: has as part
  qualified cardinality: 1
subclass of: Restriction
  on property: heeft Technologie
  has value: TransportOnderOverdruk

Centrale voedingskast
author of change: Marinus Vonhof
date of change: 2025-01-16
definition: Een elektriciteitskast voor de voeding van meerdere regelvoorzieningen
author at start life: Marinus Vonhof
date of start life: 2019-05-15
validity context: 1d 3d
scope note: Collection of facts BAS
scope note: Collection of facts RGM
type: Class
subclass of: Elektriciteitskast
subclass of: Restriction
  on property: heeft Doel
  has value: VoedingVanMeerdereRegelvoorzieningen

Centrifugaalpomp
author of change: Finy Teitsma (Oranjewoud)
date of change: 2007-10-25
definition: Een pomp waarbij de vloeistof wordt verpompt met een draaiend rad (rotor of waaier).
author at start life: Finy Teitsma (Oranjewoud)
date of start life: 2007-10-24
scope note: Collection of facts BAS
scope note: Collection of facts HYD
scope note: Collection of facts RGM
scope note: Collection of facts DMO
type: Class
subclass of: Pomp
subclass of: Restriction
  on property: heeft Technologie
  has value: VerplaatsingDoorMiddelVanEenDraaiendRad

Omtreklocatie
label: Circumferential location @en
author of change: Marinus Vonhof
date of change: 2025-01-16
date of change: 2013-09-03
definition: Beschrijving van omtreklocatie
definition: [EN13508-2+A1] Drains and sewers - The clockface is determined from the angle subtended at the centre of the cross section (the point defined by half the height and half the width between the observation and the soffit of the pipeline. Where an observation require only a single clockface reference this shall relate to the centre of the observation. @en
definition: [EN13508-2+A1] Manholes and inspection-chambers - The clockface is determined from the angle subtended at the centre of the cross-section (the point defined by half the two horizontal dimensions of the cross section between the observation and the circumferential location of the lowest outgoing pipeline from the manhole or inspection chamber. By defining the circumferential reference point, the employing authority determines whether the lowest outgoing pipeline is described as being at 6 o’clock or 12 o’clock. @en
definition: [IMBOR] Radiale afstand.
author at start life: Marinus Vonhof
date of start life: 2013-02-05
units of measurements: h
alternative label: Klokwaarde
alternative label: Radiale afstand
comment: [is aspect]
scope note: Collection of facts EN
scope note: Collection of facts RRB
scope note: Collection of facts BAS
scope note: Collection of facts PLI
type: Class
subclass of: Kenmerk
subclass of: Restriction
  author at start life: Marinus Vonhof
  date of start life: 2013-02-05
  on class: Inlaat
  on property: has as aspect (inverse)
  max qualified cardinality: 1
subclass of: Restriction
  on property: has as value
  all values from: integer

Classificatie
definition: [NEN 3300:1996] De indeling van toestandsaspecten in klassen
author at start life: Marinus Vonhof
date of start life: 2022-09-30
validity context: *d
scope note: Collection of facts BAS
type: Class
subclass of: NEN 3300 Term

Classificatietabel voor visuele inspectie van riolen
definition: [NEN 3300:1996] Een standaard referentietabel, met eenduidige omschrijvingen van toestandsaspecten
author at start life: Marinus Vonhof
date of start life: 2022-09-30
validity context: *d
scope note: Collection of facts BAS
type: Class
subclass of: NEN 3300 Term

Close fit lining
author of change: Marinus Vonhof
date of change: 2025-01-16
definition: [IMBOR] Nieuwe, zeer nauw op de bestaande leiding aansluitende bekleding of geheel nieuwe leiding die in een bestaande leiding wordt aangebracht.
notation: G
author at start life: Marinus Vonhof
date of start life: 2018-12-12
scope note: Collection of facts MDS
scope note: Collection of facts LDR
scope note: Collection of facts MTR
type: Class
subclass of: Lining
subclass of: Restriction
  on property: heeft Uitvoering
  has value: ZeerNauwAansluitendOpBinnenwand

Lining
author of change: Marinus Vonhof
author of change: Johan Post
date of change: 2025-01-16
date of change: 2026-05-01
date of change: 2018-09-03
definition: [IMBOR] Nieuwe bekleding of een geheel nieuwe leiding die in een bestaande leiding wordt aangebracht.
author at start life: Marinus Vonhof
date of start life: 2015-02-28
validity context: 10d
alternative label: Liner
alternative label: Relining
scope note: Collection of facts MDS
scope note: Collection of facts LDR
scope note: Collection of facts PLI
scope note: Collection of facts MTR
type: Class
subclass of: Constructieonderdeel
subclass of: Restriction
  author of change: Marinus Vonhof
  date of change: 2018-09-03
  author at start life: Finy Teitsma (Oranjewoud)
  date of start life: 2006-02-25
  on class: Dikte lining
  on property: has as aspect
  max qualified cardinality: 1
subclass of: Restriction
  author of change: Marinus Vonhof
  date of change: 2018-09-03
  author at start life: Finy Teitsma (Oranjewoud)
  date of start life: 2006-02-25
  on class: Vrijverval rioolleiding
  on property: has as part (inverse)
  max qualified cardinality: 1
subclass of: Restriction
  author of change: Marinus Vonhof
  date of change: 2018-09-03
  author at start life: Marinus Vonhof
  date of start life: 2015-07-28
  on class: Vrijverval transportleiding
  on property: has as part (inverse)
  max qualified cardinality: 1
subclass of: Restriction
  author of change: Marinus Vonhof
  date of change: 2018-12-12
  author at start life: Marinus Vonhof
  date of start life: 2013-09-20
  on class: Materiaal lining
  on property: has as aspect
  max qualified cardinality: 1
subclass of: Restriction
  author at start life: Johan Post
  date of start life: 2026-05-01
  on class: Rioolput
  on property: has as part (inverse)
  max qualified cardinality: 1
subclass of: Restriction
  author at start life: Marinus Vonhof
  date of start life: 2018-10-27
  on class: NLCS_RELINEN
  on property: is represented by
  max qualified cardinality: 1
subclass of: Restriction
  on property: heeft Uitvoering
  has value: BuisAanBinnenzijdeLeiding

Coating
author of change: Marinus Vonhof
author of change: Wouter van Riel
date of change: 2025-01-16
date of change: 2024-04-23
author at start life: Marinus Vonhof
date of start life: 2018-05-03
comment: [is aspect]
scope note: Collection of facts BAS
scope note: Collection of facts PLI
scope note: Collection of facts MTR
type: Class
subclass of: Bescherming
subclass of: Restriction
  author of change: Marinus Vonhof
  date of change: 2024-07-16
  author at start life: Wouter van Riel
  date of start life: 2024-04-23
  on class: Transportleiding
  on property: has as part (inverse)
  max qualified cardinality: 1
subclass of: Restriction
  author at start life: Marinus Vonhof
  date of start life: 2018-05-03
  on class: Rioolput
  on property: has as part (inverse)
  max qualified cardinality: 1
subclass of: Restriction
  on property: heeft Uitvoering
  has value: KunststofLaag

Feitencollectie
label: Collection of facts @en
author of change: Marinus Vonhof
date of change: 2021-02-16
date of change: 2025-11-29
definition: Een verzameling feiten (term uit Gellish, vergelijkbaar met RDF-triples), ingedeeld voor een discipline of model-onderdeel.
author at start life: Marinus Vonhof
date of start life: 2020-12-14
alternative label: CoF
scope note: Collection of facts BAS
type: Class
subclass of: Informatiedrager

Deelmodel Basis
author of change: Marinus Vonhof
date of change: 2021-02-17
definition: Bevat de concepten die generiek in beheersystemen voorkomen
author at start life: Marinus Vonhof
date of start life: 2021-01-28
scope note: Collection of facts BAS
type: Class
subclass of: GWSW Deelmodel
subclass of: Restriction
  author of change: Marinus Vonhof
  date of change: 2021-02-17
  author at start life: Marinus Vonhof
  date of start life: 2021-01-28
  on class: Collection of facts TOP
  on property: has as part
  qualified cardinality: 1
subclass of: Restriction
  author at start life: Marinus Vonhof
  date of start life: 2021-01-28
  on class: Collection of facts BAS
  on property: has as part
  qualified cardinality: 1
subclass of: Restriction
  author at start life: Marinus Vonhof
  date of start life: 2021-01-28
  on class: Collection of facts HYD
  on property: has as part
  qualified cardinality: 1
subclass of: Restriction
  author at start life: Marinus Vonhof
  date of start life: 2021-01-28
  on class: Collection of facts MDS
  on property: has as part
  qualified cardinality: 1
subclass of: Restriction
  author at start life: Marinus Vonhof
  date of start life: 2021-01-28
  on class: Collection of facts NLCS
  on property: has as part
  qualified cardinality: 1

Deelmodel Dataset
author of change: Marinus Vonhof
date of change: 2025-05-19
date of change: 2021-02-01
definition: Het generieke deelmodel voor combinatie met datasets. Dit deelmodel bevat alle concepten die in datasets worden gebruikt. Is gelijk aan GWSW-Basis, exclusief CoF NLCS
author at start life: Marinus Vonhof
date of start life: 2021-01-28
scope note: Collection of facts BAS
type: Class
subclass of: GWSW Deelmodel
subclass of: Restriction
  author at start life: Marinus Vonhof
  date of start life: 2021-01-28
  on class: Collection of facts BAS
  on property: has as part
  qualified cardinality: 1
subclass of: Restriction
  author at start life: Marinus Vonhof
  date of start life: 2021-01-28
  on class: Collection of facts HYD
  on property: has as part
  qualified cardinality: 1
subclass of: Restriction
  author at start life: Marinus Vonhof
  date of start life: 2021-01-28
  on class: Collection of facts MDS
  on property: has as part
  qualified cardinality: 1
subclass of: Restriction
  author at start life: Marinus Vonhof
  date of start life: 2021-01-28
  on class: Collection of facts TOP
  on property: has as part
  qualified cardinality: 1
subclass of: Restriction
  author at start life: Marinus Vonhof
  date of start life: 2022-10-03
  on class: Collection of facts DMO
  on property: has as part
  qualified cardinality: 1
subclass of: Restriction
  author at start life: Marinus Vonhof
  date of start life: 2024-10-25
  on class: Collection of facts PLI
  on property: has as part
  qualified cardinality: 1
subclass of: Restriction
  author at start life: Marinus Vonhof
  date of start life: 2025-05-18
  on class: Collection of facts REV
  on property: has as part
  qualified cardinality: 1

Deelmodel Totaal
author of change: Marinus Vonhof
date of change: 2021-09-17
date of change: 2025-12-03
definition: Bevat alle vastgestelde GWSW-deelmodellen en de concept-deelmodellen die ter visie liggen. Die GWSW-deelmodellen beschrijven de ligging en uitvoering voor voorzieningen, het uitvoeren van inspectie- en reinigingsprojecten, het uitvoeren van revisie/inmeet-projecten, de netwerken voor hydraulische modellering, afvoerscenario's en kengetallen, de NLCS-symbolen voor geo-toepassingen.
author at start life: Marinus Vonhof
date of start life: 2021-01-28
comment: 20251129/mv: PLI, REV toegevoegd, ook tbv SWchat
comment: [type=combi]
scope note: Collection of facts BAS
type: Class
subclass of: GWSW Deelmodel
subclass of: Restriction
  author at start life: Marinus Vonhof
  date of start life: 2021-01-28
  on class: Collection of facts BAS
  on property: has as part
  qualified cardinality: 1
subclass of: Restriction
  author at start life: Marinus Vonhof
  date of start life: 2021-01-28
  on class: Collection of facts HYD
  on property: has as part
  qualified cardinality: 1
subclass of: Restriction
  author at start life: Marinus Vonhof
  date of start life: 2021-01-28
  on class: Collection of facts LDR
  on property: has as part
  qualified cardinality: 1
subclass of: Restriction
  author at start life: Marinus Vonhof
  date of start life: 2021-01-28
  on class: Collection of facts MDS
  on property: has as part
  qualified cardinality: 1
subclass of: Restriction
  author at start life: Marinus Vonhof
  date of start life: 2021-01-28
  on class: Collection of facts NLCS
  on property: has as part
  qualified cardinality: 1
subclass of: Restriction
  author at start life: Marinus Vonhof
  date of start life: 2021-01-28
  on class: Collection of facts RRB
  on property: has as part
  qualified cardinality: 1
subclass of: Restriction
  author at start life: Marinus Vonhof
  date of start life: 2021-01-28
  on class: Collection of facts TOP
  on property: has as part
  qualified cardinality: 1
subclass of: Restriction
  author at start life: Marinus Vonhof
  date of start life: 2021-01-30
  on class: Collection of facts EN
  on property: has as part
  qualified cardinality: 1
subclass of: Restriction
  author at start life: Marinus Vonhof
  date of start life: 2022-10-03
  on class: Collection of facts DMO
  on property: has as part
  qualified cardinality: 1
subclass of: Restriction
  author at start life: Marinus Vonhof
  date of start life: 2024-10-29
  on class: Collection of facts PLI
  on property: has as part
  qualified cardinality: 1
subclass of: Restriction
  author at start life: Marinus Vonhof
  date of start life: 2025-11-29
  on class: Collection of facts REV
  on property: has as part
  qualified cardinality: 1

Deelmodel IMBOR-SW
definition: Het deelmodel met IMBOR Stedelijk Water (IMBOR-SW) concepten. Het model is een conformiteitsklasse, gebaseerd op de GWSW-Dataset, exclusief CoF DMO (kengetallen)
author at start life: Marinus Vonhof
date of start life: 2024-10-31
comment: [cfk=6]
scope note: Collection of facts BAS
type: Class
subclass of: GWSW Deelmodel
subclass of: Restriction
  author at start life: Marinus Vonhof
  date of start life: 2024-10-31
  on class: Collection of facts BAS
  on property: has as part
  qualified cardinality: 1
subclass of: Restriction
  author at start life: Marinus Vonhof
  date of start life: 2024-10-31
  on class: Collection of facts HYD
  on property: has as part
  qualified cardinality: 1
subclass of: Restriction
  author at start life: Marinus Vonhof
  date of start life: 2024-10-31
  on class: Collection of facts MDS
  on property: has as part
  qualified cardinality: 1
subclass of: Restriction
  author at start life: Marinus Vonhof
  date of start life: 2024-10-31
  on class: Collection of facts TOP
  on property: has as part
  qualified cardinality: 1

Deelmodel Kengetallen
author of change: Marinus Vonhof
date of change: 2021-09-17
definition: Deelmodel voor afvoerscenario's en kengetallen. Bevat het rioleringsnetwerk (deelmodel Hyd), het afvoernetwerk (verbindingen tussen stelsels) en gemeentelijke planvorming (niet de projecten) voor optimaliseren afvalwaterketen
author at start life: Marinus Vonhof
date of start life: 2021-01-28
comment: De beschrijving van rioleringsstelsel blijft beperkt tot de globale (rand)voorzieningen
scope note: Collection of facts BAS
type: Class
subclass of: GWSW Deelmodel
subclass of: Restriction
  author at start life: Marinus Vonhof
  date of start life: 2021-01-28
  on class: Collection of facts DMO
  on property: has as part
  qualified cardinality: 1
subclass of: Restriction
  author at start life: Marinus Vonhof
  date of start life: 2021-01-28
  on class: Collection of facts TOP
  on property: has as part
  qualified cardinality: 1

Deelmodel RibHeen
author of change: Marinus Vonhof
date of change: 2021-09-17
definition: Conformiteitsklasse voor toetsing van het vooraf ingevulde RibX-bestand
author at start life: Marinus Vonhof
date of start life: 2021-01-28
comment: [type=formaat] [cfk=2]
scope note: Collection of facts BAS
type: Class
subclass of: GWSW Deelmodel
subclass of: Restriction
  author of change: Marinus Vonhof
  date of change: 2021-09-17
  author at start life: Marinus Vonhof
  date of start life: 2021-01-28
  on class: Collection of facts TOP
  on property: has as part
  qualified cardinality: 1
subclass of: Restriction
  author of change: Marinus Vonhof
  date of change: 2021-09-17
  author at start life: Marinus Vonhof
  date of start life: 2021-01-30
  on class: Collection of facts EN
  on property: has as part
  qualified cardinality: 1
subclass of: Restriction
  author at start life: Marinus Vonhof
  date of start life: 2021-01-28
  on class: Collection of facts LDR
  on property: has as part
  qualified cardinality: 1
subclass of: Restriction
  author at start life: Marinus Vonhof
  date of start life: 2021-01-28
  on class: Collection of facts RBX
  on property: has as part
  qualified cardinality: 1
subclass of: Restriction
  author at start life: Marinus Vonhof
  date of start life: 2021-01-28
  on class: Collection of facts RRB
  on property: has as part
  qualified cardinality: 1

Deelmodel RibTerug
author of change: Marinus Vonhof
date of change: 2021-09-17
definition: Conformiteitsklasse voor toetsing van het teruggeleverde RibX-bestand
author at start life: Marinus Vonhof
date of start life: 2021-01-28
comment: [type=formaat]
scope note: Collection of facts BAS
type: Class
subclass of: GWSW Deelmodel
subclass of: Restriction
  author at start life: Marinus Vonhof
  date of start life: 2021-01-28
  on class: Collection of facts LDR
  on property: has as part
  qualified cardinality: 1
subclass of: Restriction
  author at start life: Marinus Vonhof
  date of start life: 2021-01-28
  on class: Collection of facts RBX
  on property: has as part
  qualified cardinality: 1
subclass of: Restriction
  author at start life: Marinus Vonhof
  date of start life: 2021-01-28
  on class: Collection of facts RRB
  on property: has as part
  qualified cardinality: 1
subclass of: Restriction
  author at start life: Marinus Vonhof
  date of start life: 2021-01-28
  on class: Collection of facts TOP
  on property: has as part
  qualified cardinality: 1
subclass of: Restriction
  author at start life: Marinus Vonhof
  date of start life: 2021-01-30
  on class: Collection of facts EN
  on property: has as part
  qualified cardinality: 1

Deelmodel Maatregelen
author of change: Marinus Vonhof
date of change: 2021-09-17
definition: Deelmodel (concept) met de beschrijving van renovatie maatregelen. Toegespitst op leidingrenovaties. Verwijst naar de toestandsaspecten in de EN13500-2
author at start life: Marinus Vonhof
date of start life: 2021-01-28
scope note: Collection of facts BAS
type: Class
subclass of: GWSW Deelmodel
subclass of: Restriction
  author at start life: Marinus Vonhof
  date of start life: 2021-01-28
  on class: Collection of facts MTR
  on property: has as part
  qualified cardinality: 1
subclass of: Restriction
  author at start life: Marinus Vonhof
  date of start life: 2021-01-28
  on class: Collection of facts TOP
  on property: has as part
  qualified cardinality: 1
subclass of: Restriction
  author at start life: Marinus Vonhof
  date of start life: 2021-01-31
  on class: Collection of facts EN
  on property: has as part
  qualified cardinality: 1

Deelmodel HydX
definition: Beschrijft het uitwisselformaat HydX
author at start life: Marinus Vonhof
date of start life: 2021-01-28
comment: [type=formaat]
scope note: Collection of facts BAS
type: Class
subclass of: GWSW Deelmodel
subclass of: Restriction
  author at start life: Marinus Vonhof
  date of start life: 2021-01-28
  on class: Collection of facts HDX
  on property: has as part
  qualified cardinality: 1
subclass of: Restriction
  author at start life: Marinus Vonhof
  date of start life: 2021-01-28
  on class: Collection of facts HYD
  on property: has as part
  qualified cardinality: 1
subclass of: Restriction
  author at start life: Marinus Vonhof
  date of start life: 2021-01-28
  on class: Collection of facts TOP
  on property: has as part
  qualified cardinality: 1

Deelmodel Hyd
author of change: Marinus Vonhof
date of change: 2021-09-17
definition: Deelmodel met definitie rioleringsnetwerk. Het netwerk wordt opgebouwd uit de topologische elementen Knooppunt en Verbinding
author at start life: Marinus Vonhof
date of start life: 2021-01-28
comment: Het model is de basis voor een dynamische berekening, statische voorzieningen zoals Rioolafsluiter of Schuif vallen buiten het model
comment: [cfk=5]
scope note: Collection of facts BAS
type: Class
subclass of: GWSW Deelmodel
subclass of: Restriction
  author at start life: Marinus Vonhof
  date of start life: 2021-01-28
  on class: Collection of facts HYD
  on property: has as part
  qualified cardinality: 1
subclass of: Restriction
  author at start life: Marinus Vonhof
  date of start life: 2021-01-28
  on class: Collection of facts TOP
  on property: has as part
  qualified cardinality: 1

Collection of facts IMSW
author of change: Wouter van Riel
date of change: 2021-11-19
definition: Bevat informatiemodel stedelijk water (Geonovum). Niet recentelijk onderhouden (concept). Is aanvullend op feitencollectie TOP.
author at start life: Marinus Vonhof
date of start life: 2020-12-15
scope note: Collection of facts BAS
type: Class
subclass of: Feitencollectie

Deelmodel MdsProj
author of change: Marinus Vonhof
date of change: 2021-09-17
definition: Conformiteitsklasse voor toetsing gegevens projecten inspectie en reiniging
author at start life: Marinus Vonhof
date of start life: 2021-01-28
comment: [cfk=1]
scope note: Collection of facts BAS
type: Class
subclass of: GWSW Deelmodel
subclass of: Restriction
  author of change: Marinus Vonhof
  date of change: 2021-09-17
  author at start life: Marinus Vonhof
  date of start life: 2021-01-28
  on class: Collection of facts MDS
  on property: has as part
  qualified cardinality: 1
subclass of: Restriction
  author of change: Marinus Vonhof
  date of change: 2021-09-17
  author at start life: Marinus Vonhof
  date of start life: 2021-01-28
  on class: Collection of facts TOP
  on property: has as part
  qualified cardinality: 1

Deelmodel MdsPlan
author of change: Marinus Vonhof
date of change: 2021-09-17
definition: Conformiteitsklasse voor toetsing gegevens operationele plannen
author at start life: Marinus Vonhof
date of start life: 2021-01-28
comment: [cfk=3]
scope note: Collection of facts BAS
type: Class
subclass of: GWSW Deelmodel
subclass of: Restriction
  author at start life: Marinus Vonhof
  date of start life: 2021-01-28
  on class: Collection of facts MDS
  on property: has as part
  qualified cardinality: 1
subclass of: Restriction
  author at start life: Marinus Vonhof
  date of start life: 2021-01-28
  on class: Collection of facts TOP
  on property: has as part
  qualified cardinality: 1

Collection of facts NLCS
author of change: Wouter van Riel
date of change: 2021-11-19
definition: Bevat symbolen Nederlandse CAD Standaard en de symbolen van GWSW Geo, toegepast in GIS systemen. Is aanvullend op feitencollectie TOP.
author at start life: Marinus Vonhof
date of start life: 2020-12-15
scope note: Collection of facts BAS
type: Class
subclass of: Feitencollectie
subclass of: Restriction
  author at start life: Marinus Vonhof
  date of start life: 2021-01-28
  on class: Deelmodel Basis
  on property: has as part (inverse)
  qualified cardinality: 1
subclass of: Restriction
  author at start life: Marinus Vonhof
  date of start life: 2021-01-28
  on class: Deelmodel Totaal
  on property: has as part (inverse)
  qualified cardinality: 1

Deelmodel Persleidingen
definition: Registratie persleidingincidenten
author at start life: Marinus Vonhof
date of start life: 2021-01-28
scope note: Collection of facts BAS
type: Class
subclass of: GWSW Deelmodel
subclass of: Restriction
  author at start life: Marinus Vonhof
  date of start life: 2021-01-28
  on class: Collection of facts PLI
  on property: has as part
  qualified cardinality: 1
subclass of: Restriction
  author at start life: Marinus Vonhof
  date of start life: 2021-04-07
  on class: Collection of facts TOP
  on property: has as part
  qualified cardinality: 1

Collection of facts RBX
author of change: Wouter van Riel
date of change: 2021-11-19
definition: Model met uitwisselformaat RibX voor uitwisseling inspectie- en reinigingsprojecten. Is aanvullend op feitencollectie TOP.
author at start life: Marinus Vonhof
date of start life: 2020-12-15
scope note: Collection of facts BAS
type: Class
subclass of: Feitencollectie
subclass of: Restriction
  author at start life: Marinus Vonhof
  date of start life: 2021-01-28
  on class: Deelmodel RibHeen
  on property: has as part (inverse)
  qualified cardinality: 1
subclass of: Restriction
  author at start life: Marinus Vonhof
  date of start life: 2021-01-28
  on class: Deelmodel RibTerug
  on property: has as part (inverse)
  qualified cardinality: 1

Deelmodel Revisies
author of change: Marinus Vonhof
date of change: 2025-10-07
date of change: 2025-12-22
definition: Registratie revisies en inmetingen. De term 'revisie' wordt gebruikt voor het inmeten van de objectgegevens na de aanleg (de realisatie van het ontwerp). GWSW Revisies heeft een bredere scope, ook het inmeten van al langer in gebruik zijnde objecten is een toepassing van dit deelmodel.
author at start life: Johan Post
date of start life: 2024-09-10
comment: [cfk=16]
scope note: Collection of facts REV
scope note: Collection of facts BAS
type: Class
subclass of: GWSW Deelmodel
subclass of: Restriction
  on class: Collection of facts REV
  on property: has as part
  qualified cardinality: 1
subclass of: Restriction
  on class: Collection of facts TOP
  on property: has as part
  qualified cardinality: 1

Deelmodel Gemalen
definition: Bevat details rioolgemalen (concept)
author at start life: Marinus Vonhof
date of start life: 2021-01-28
scope note: Collection of facts BAS
type: Class
subclass of: GWSW Deelmodel
subclass of: Restriction
  author at start life: Marinus Vonhof
  date of start life: 2021-01-28
  on class: Collection of facts RGM
  on property: has as part
  qualified cardinality: 1
subclass of: Restriction
  author at start life: Marinus Vonhof
  date of start life: 2021-01-28
  on class: Collection of facts TOP
  on property: has as part
  qualified cardinality: 1

Communicatie-apparatuur
definition: Apparaat voor elektronische communicatie.
author at start life: Marinus Vonhof
date of start life: 2026-07-15
scope note: Collection of facts BAS
scope note: Collection of facts RGM
type: Class
subclass of: Apparatuur
subclass of: Restriction
  on property: heeft Functie
  has value: Communiceren

Communicatie-unit
definition: Een eenheid voor het verzorgen van (elektronische) communicatie.
author at start life: Marinus Vonhof
date of start life: 2026-07-15
scope note: Collection of facts BAS
scope note: Collection of facts RGM
type: Class
subclass of: Communicatie-apparatuur
subclass of: Restriction
  validity context: *t
  on class: Voeding
  on property: has as part
  min qualified cardinality: 1
subclass of: Restriction
  on property: heeft Uitvoering
  has value: CombinatieVanApparaten
subclass of: Restriction
  on class: Gemaal
  on property: has as part (inverse)
  max qualified cardinality: 1
subclass of: Restriction
  on class: Modem
  on property: has as part
  min qualified cardinality: 0

Voeding
definition: Een apparaat voor het regelen en leveren van elektriciteit.
author at start life: Marinus Vonhof
date of start life: 2026-07-15
alternative label: Transformator
scope note: Collection of facts BAS
scope note: Collection of facts RGM
type: Class
subclass of: Apparatuur
subclass of: Restriction
  on property: heeft Functie
  has value: LeverenElektriciteit
subclass of: Restriction
  on class: Communicatie-unit
  on property: has as part (inverse)
  max qualified cardinality: 1

Modem
definition: [IMBOR] Een apparaat met als functie het opzetten en in stand houden van een internetnetwerk.
author at start life: Marinus Vonhof
date of start life: 2026-07-15
scope note: Collection of facts BAS
scope note: Collection of facts RGM
type: Class
subclass of: Communicatie-apparatuur
subclass of: Restriction
  on property: heeft Functie
  has value: MakenNetwerkverbinding
subclass of: Restriction
  on class: Communicatie-unit
  on property: has as part (inverse)
  max qualified cardinality: 1

Lengte compartiment
author at start life: Marinus Vonhof
date of start life: 2011-12-15
units of measurements: mm
comment: [is aspect]
scope note: Collection of facts MDS
scope note: Collection of facts HYD
type: Class
subclass of: Lengte
subclass of: Restriction
  author of change: Marinus Vonhof
  date of change: 2015-07-28
  author at start life: Marinus Vonhof
  date of start life: 2011-12-15
  on class: Compartiment
  on property: has as aspect (inverse)
  max qualified cardinality: 1
subclass of: Restriction
  on property: has as value
  all values from: integer

Stuwput
author of change: Marinus Vonhof
date of change: 2015-02-28
date of change: 2026-07-20
definition: Een rioolput voorzien van een wand met opening of bijvoorbeeld een wervelventiel om de bergingscapaciteit van het bovenstroomse rioolstelsel te benutten.
definition: [NEN 3300:1996] Rioolput voorzien van een afvoerbeperking
author at start life: Finy Teitsma (Oranjewoud)
date of start life: 2006-02-20
comment: 20151014: NEN3300-definitie aangepast
scope note: Collection of facts MDS
scope note: Collection of facts RRB
scope note: Collection of facts LDR
scope note: Collection of facts REV
scope note: Collection of facts HYD
type: Class
subclass of: Rioolput
subclass of: Restriction
  author of change: Marinus Vonhof
  date of change: 2016-04-22
  author at start life: Marinus Vonhof
  date of start life: 2014-04-29
  comment: per definitie
  on class: Compartiment
  on property: has as part
  min qualified cardinality: 2
subclass of: Restriction
  author of change: Marinus Vonhof
  date of change: 2018-12-12
  author at start life: Marinus Vonhof
  date of start life: 2017-12-07
  on class: Opening in wand
  on property: has as part
  max qualified cardinality: 1
subclass of: Restriction
  author of change: Marinus Vonhof
  date of change: 2020-04-17
  author at start life: Marinus Vonhof
  date of start life: 2017-12-07
  on class: Stuwklep
  on property: has as part
  max qualified cardinality: 1
subclass of: Restriction
  author at start life: Marinus Vonhof
  date of start life: 2017-12-07
  on class: Stuwmuur
  on property: has as part
  max qualified cardinality: 1
subclass of: Restriction
  author at start life: Marinus Vonhof
  date of start life: 2018-10-27
  on class: NLCS_GWA_RIOOLPUT_STUWPUT
  on property: is represented by
  max qualified cardinality: 1
subclass of: Restriction
  author at start life: Marinus Vonhof
  date of start life: 2018-10-27
  on class: NLCS_HWA_RIOOLPUT_STUWPUT
  on property: is represented by
  max qualified cardinality: 1
subclass of: Restriction
  author at start life: Marinus Vonhof
  date of start life: 2018-10-27
  on class: NLCS_ITR_RIOOLPUT_STUWPUT
  on property: is represented by
  max qualified cardinality: 1
subclass of: Restriction
  author at start life: Marinus Vonhof
  date of start life: 2018-10-27
  on class: NLCS_PERSLEIDING_RIOOLPUT_STUWPUT
  on property: is represented by
  max qualified cardinality: 1
subclass of: Restriction
  author at start life: Marinus Vonhof
  date of start life: 2018-10-27
  on class: NLCS_SWA_RIOOLPUT_STUWPUT
  on property: is represented by
  max qualified cardinality: 1
subclass of: Restriction
  author at start life: Marinus Vonhof
  date of start life: 2018-10-27
  on class: NLCS_VACUUMLEIDING_RIOOLPUT_STUWPUT
  on property: is represented by
  max qualified cardinality: 1
subclass of: Restriction
  author at start life: Marinus Vonhof
  date of start life: 2018-10-27
  on class: NLCS_VWA_RIOOLPUT_STUWPUT
  on property: is represented by
  max qualified cardinality: 1
subclass of: Restriction
  author at start life: Marinus Vonhof
  date of start life: 2018-11-07
  on class: Sym_Stuwput
  on property: is represented by
  max qualified cardinality: 1
subclass of: Restriction
  author at start life: Marinus Vonhof
  date of start life: 2018-12-12
  on class: Wervelventiel
  on property: has as part
  max qualified cardinality: 1
subclass of: Restriction
  on property: heeft Functie
  has value: WaterniveauInStelselRegelen

Compartimentoriëntatie
author of change: Marinus Vonhof
date of change: 2018-12-05
definition: Een topologisch element dat het zwaartepunt (vertex) van de bovenkant compartimentbodem beschrijft
author at start life: Marinus Vonhof
date of start life: 2017-12-12
validity context: 1d
scope note: Collection of facts BAS
scope note: Collection of facts HYD
type: Class
subclass of: Knooppunt
subclass of: Restriction
  author of change: Marinus Vonhof
  date of change: 2018-05-03
  author at start life: Marinus Vonhof
  date of start life: 2012-04-22
  validity context: 5t 11t
  on class: Compartiment
  on property: has as aspect (inverse)
  max qualified cardinality: 1
subclass of: Restriction
  author at start life: Marinus Vonhof
  date of start life: 2026-07-24
  on class: Buitengrens
  on property: has as aspect
  max qualified cardinality: 1
subclass of: Restriction
  author at start life: Marinus Vonhof
  date of start life: 2026-07-24
  on class: Infiltratiecompartiment
  on property: has as aspect (inverse)
  max qualified cardinality: 1

Vorm compartiment
author at start life: Marinus Vonhof
date of start life: 2015-11-06
comment: Intrinsiek aspect
comment: [is aspect]
scope note: Collection of facts HYD
scope note: Collection of facts RGM
type: Class
subclass of: Vorm
subclass of: Restriction
  author of change: Marinus Vonhof
  date of change: 2017-08-31
  author at start life: Marinus Vonhof
  date of start life: 2015-11-06
  validity context: 5t 11t
  on class: Compartiment
  on property: has as aspect (inverse)
  max qualified cardinality: 1
subclass of: Restriction
  date of change: 2017-05-17
  author at start life: Marinus Vonhof
  date of start life: 2015-11-06
  on class: Inwinning
  on property: has as aspect
  max qualified cardinality: 1
subclass of: Restriction
  on property: has as reference (qualification)
  all values from: Vorm put (coll)

Lateraal afvoerend oppervlak
definition: HWA aansluiting vanuit ander rioolstelsel. Uitgedrukt in de equivalente hoeveelheid van het oppervlaktype Gesloten Verhard Oppervlak Vlak
author at start life: Marinus Vonhof
date of start life: 2017-08-31
units of measurements: m2
scope note: Collection of facts HYD
type: Class
subclass of: Bovengrond
subclass of: Restriction
  author of change: Marinus Vonhof
  date of change: 2018-05-03
  author at start life: Marinus Vonhof
  date of start life: 2017-08-31
  on class: Rioolput
  on property: has as aspect (inverse)
  max qualified cardinality: 1
subclass of: Restriction
  author at start life: Marinus Vonhof
  date of start life: 2017-08-31
  on class: Compartiment
  on property: has as aspect (inverse)
  max qualified cardinality: 1
subclass of: Restriction
  author at start life: Marinus Vonhof
  date of start life: 2017-08-31
  on class: Gemengd riool
  on property: has as aspect (inverse)
  max qualified cardinality: 1
subclass of: Restriction
  author at start life: Marinus Vonhof
  date of start life: 2017-08-31
  on class: Hemelwaterriool
  on property: has as aspect (inverse)
  max qualified cardinality: 1
subclass of: Restriction
  on property: has as value
  all values from: decimal

Lateraal debiet
author of change: Johan Post
date of change: 2022-11-25
definition: Lozingsdebiet vanuit ander rioolstelsel
author at start life: Marinus Vonhof
date of start life: 2017-08-31
units of measurements: m3/h
comment: [is aspect]
scope note: Collection of facts HYD
type: Class
subclass of: Lozingsdebiet
subclass of: Restriction
  author of change: Marinus Vonhof
  date of change: 2018-05-03
  author at start life: Marinus Vonhof
  date of start life: 2017-08-31
  on class: Rioolput
  on property: has as aspect (inverse)
  max qualified cardinality: 1
subclass of: Restriction
  author at start life: Marinus Vonhof
  date of start life: 2017-08-31
  on class: Compartiment
  on property: has as aspect (inverse)
  max qualified cardinality: 1
subclass of: Restriction
  author at start life: Marinus Vonhof
  date of start life: 2017-08-31
  on class: Gemengd riool
  on property: has as aspect (inverse)
  max qualified cardinality: 1
subclass of: Restriction
  on property: has as value
  all values from: decimal

Pompunit
author of change: Marinus Vonhof
author of change: Johan Post
date of change: 2024-05-16
date of change: 2022-10-02
date of change: 2017-05-30
date of change: 2026-05-18
definition: Pompput in een drukrioleringsstelsel
author at start life: Marinus Vonhof
date of start life: 2012-04-24
validity context: 12d
see also: [Waterkring West] Onderdeel van een mechanisch rioolstelsel
alternative label: Drukrioleringsunit
alternative label: Minigemaal
scope note: Collection of facts MDS
scope note: Collection of facts REV
scope note: Collection of facts RGM
scope note: Collection of facts DMO
type: Class
subclass of: Rioolput
subclass of: Restriction
  author of change: Marinus Vonhof
  date of change: 2015-06-01
  author at start life: Marinus Vonhof
  date of start life: 2014-05-03
  on class: Drukrioleringspomp
  on property: has as part
  min qualified cardinality: 1
subclass of: Restriction
  author of change: Marinus Vonhof
  date of change: 2020-04-17
  author at start life: Marinus Vonhof
  date of start life: 2013-09-14
  on class: Drukriolering
  on property: has as part (inverse)
  qualified cardinality: 1
subclass of: Restriction
  author of change: Marinus Vonhof
  date of change: 2022-10-02
  author at start life: Marinus Vonhof
  date of start life: 2020-04-17
  on class: Hybride drukriolering
  on property: has as part (inverse)
  max qualified cardinality: 1
subclass of: Restriction
  author at start life: Johan Post
  date of start life: 2026-05-01
  on class: Elektriciteitskast
  on property: has as part
  max qualified cardinality: 1
subclass of: Restriction
  author at start life: Marinus Vonhof
  date of start life: 2018-11-07
  on class: Sym_Pompput
  on property: is represented by
  max qualified cardinality: 1
subclass of: Restriction
  author at start life: Marinus Vonhof
  date of start life: 2022-10-02
  on class: Stankfilter
  on property: has as part
  max qualified cardinality: 1
subclass of: Restriction
  author at start life: Marinus Vonhof
  date of start life: 2022-10-02
  on class: Veiligheidsrooster
  on property: has as part
  max qualified cardinality: 1
subclass of: Restriction
  author at start life: Marinus Vonhof
  date of start life: 2022-10-02
  on class: Hijsinrichting
  on property: has as part
  min qualified cardinality: 0
subclass of: Restriction
  author at start life: Marinus Vonhof
  date of start life: 2024-05-16
  on class: Compartiment
  on property: has as part
  min qualified cardinality: 0
subclass of: Restriction
  on property: heeft Functie
  has value: InzamelingVanAfvalwater
subclass of: Restriction
  on property: heeft Functie
  has value: VerpompenVanAfvalwater

Hoogte compartiment
definition: De inwendige hoogte van het compartiment
author at start life: Wouter van Riel
date of start life: 2024-04-22
units of measurements: mm
comment: Intrinsiek aspect
comment: [is aspect]
scope note: Collection of facts MDS
scope note: Collection of facts HYD
type: Class
subclass of: Hoogte
subclass of: Restriction
  author at start life: Wouter van Riel
  date of start life: 2024-04-22
  on class: Compartiment
  on property: has as aspect (inverse)
  max qualified cardinality: 1
subclass of: Restriction
  on property: has as value
  all values from: integer

Klimijzer
author of change: Marinus Vonhof
date of change: 2025-01-16
definition: [IMBOR] Ingestorte stalen of aluminium staven in een beton- of baksteenconstructie die gebruikt kan worden als ladderconstructie.
author at start life: Marinus Vonhof
date of start life: 2018-03-20
validity context: 10d 14d
scope note: Collection of facts LDR
scope note: Collection of facts REV
scope note: Collection of facts BAS
scope note: Collection of facts MTR
type: Class
subclass of: Constructieonderdeel
subclass of: Restriction
  author at start life: Marinus Vonhof
  date of start life: 2019-05-15
  on class: Rioolput
  on property: has as part (inverse)
  max qualified cardinality: 1
subclass of: Restriction
  on property: heeft Uitvoering
  has value: MetalenBeugel

T-stuk
author of change: Marinus Vonhof
date of change: 2025-01-16
date of change: 2018-10-17
definition: Een verbindingsstuk dat drie leidingen onder een rechte hoek (haaks) verbindt
definition: [IMBOR] Een verbindingsstuk in de vorm van een T-splitsing.
author at start life: Marinus Vonhof
date of start life: 2012-04-24
validity context: 1d
scope note: Collection of facts MDS
scope note: Collection of facts LDR
scope note: Collection of facts REV
scope note: Collection of facts PLI
scope note: Collection of facts HYD
type: Class
subclass of: Verbindingsstuk
subclass of: Restriction
  author at start life: Marinus Vonhof
  date of start life: 2018-10-27
  on class: NLCS_DRAINAGE_HULPSTUK_T STUK
  on property: is represented by
  max qualified cardinality: 1
subclass of: Restriction
  on property: heeft Functie
  has value: VerbindenVanDrieLeidingen

Continue lozing
author of change: Johan Post
date of change: 2022-11-25
date of change: 2024-10-21
definition: Lozing met een constant debiet zonder verloop. Denk hierbij aan de inloop van rioolvreemdwater of een proceswaterlozing waarbij geen sprake is van een dagvariatie.
author at start life: Marinus Vonhof
date of start life: 2011-12-15
units of measurements: m3/h
comment: [is aspect]
scope note: Collection of facts HYD
type: Class
subclass of: Kenmerk
subclass of: Restriction
  author of change: Marinus Vonhof
  date of change: 2018-05-03
  author at start life: Marinus Vonhof
  date of start life: 2011-12-15
  on class: Rioolput
  on property: has as aspect (inverse)
  max qualified cardinality: 1
subclass of: Restriction
  on property: has as value
  all values from: Continue lozing (datatype)
subclass of: Restriction
  on class: Vrijverval rioolleiding
  on property: has as aspect (inverse)
  max qualified cardinality: 1

Contractiecoëfficiënt doorlaatprofiel
author of change: Marinus Vonhof
date of change: 2025-01-16
date of change: 2015-09-20
definition: [IMBOR] De verhouding in een bepaalde dwarsdoorsnede tussen het stroomvoerende en het geometrische profiel van een opening in een wand.
author at start life: Marinus Vonhof
date of start life: 2011-12-15
comment: [is aspect]
scope note: Collection of facts HYD
type: Class
subclass of: Kenmerk
subclass of: Restriction
  author of change: Marinus Vonhof
  date of change: 2016-04-15
  author at start life: Marinus Vonhof
  date of start life: 2011-12-15
  validity context: 5t 11t
  on class: Doorlaat
  on property: has as aspect (inverse)
  max qualified cardinality: 1
subclass of: Restriction
  on property: has as value
  all values from: Contractiecoëfficiënt doorlaatprofiel (datatype)

Cunetdrainage
author of change: Marinus Vonhof
date of change: 2025-01-16
date of change: 2020-04-17
definition: Drainage die langs de weg aan de zijkanten van het cunet ligt
definition: [IMBOR] Een drainagestelsel aangebracht aan beide zijden van een cunet, een uitgegraven gedeelte van een grondlaag die niet draagkrachtig is en gebruikt wordt om aardebanen in aan te leggen.
author at start life: Nic Roest (Idoro)
date of start life: 2007-11-29
scope note: Collection of facts BAS
type: Class
subclass of: Drainagestelsel
subclass of: Restriction
  on property: heeft Uitvoering
  has value: InCunet

Valleiding
author of change: Marinus Vonhof
date of change: 2025-01-16
date of change: 2024-05-16
date of change: 2024-07-17
definition: Een leiding die snel daalt richting een put
notation: C
author at start life: Marinus Vonhof
date of start life: 2018-12-05
alternative label: Backdrop @en
scope note: Collection of facts EN
scope note: Collection of facts BAS
type: Class
subclass of: Leiding
subclass of: Restriction
  on property: heeft Structuur
  has value: SnelDalendeAansluitingOpPut

Geïnjecteerde specie (put)
label: Injection of sealing material @en
author of change: Marinus Vonhof
date of change: 2025-01-16
notation: C
author at start life: Marinus Vonhof
date of start life: 2018-12-13
scope note: Collection of facts EN
scope note: Collection of facts BAS
scope note: Collection of facts MTR
type: Class
subclass of: Reparatie
subclass of: Restriction
  on property: heeft Uitvoering
  has value: SpecieGeinjecteerd

Gerepareerd gat (put)
label: Hole repaired (manhole) @en
author of change: Marinus Vonhof
date of change: 2025-01-16
notation: D
author at start life: Marinus Vonhof
date of start life: 2018-12-13
scope note: Collection of facts EN
scope note: Collection of facts BAS
scope note: Collection of facts MTR
type: Class
subclass of: Reparatie
subclass of: Restriction
  on property: heeft Uitvoering
  has value: GatGedicht

DIT-riool
author of change: Marinus Vonhof
author of change: Johan Post
date of change: 2021-08-05
date of change: 2026-05-01
date of change: 2026-05-18
definition: Een rioolleiding met waterdoorlatende wanden bestemd voor de inzameling en transport van grondwater en hemelwater. Het grondwaterpeil wordt afgevlakt door infiltratie van hemelwater of exfiltratie van grondwater (drainage).
author at start life: Marinus Vonhof
date of start life: 2018-12-06
alternative label: Drainage infiltratie transportriool
scope note: Collection of facts MDS
scope note: Collection of facts HYD
type: Class
subclass of: Vrijverval rioolleiding
subclass of: Restriction
  author of change: Marinus Vonhof
  date of change: 2026-07-13
  author at start life: Marinus Vonhof
  date of start life: 2018-12-06
  on class: Omhulling
  on property: has as part
  max qualified cardinality: 1
subclass of: Restriction
  author at start life: Marinus Vonhof
  date of start life: 2020-04-18
  on class: Hemelwaterstelsel
  on property: has as part (inverse)
  max qualified cardinality: 1
subclass of: Restriction
  author at start life: Marinus Vonhof
  date of start life: 2026-07-24
  on class: Infiltratievoorziening
  on property: has as part (inverse)
  max qualified cardinality: 1
subclass of: Restriction
  author at start life: Wouter van Riel
  date of start life: 2021-11-19
  on property: heeft Functie
  has value: AfvoerenHemelwaterNaarDeOndergrond
subclass of: Restriction
  author at start life: Wouter van Riel
  date of start life: 2021-11-19
  on property: heeft Functie
  has value: InzamelenHemelwaterEnAfgifteAanOndergrond
subclass of: Restriction
  author at start life: Wouter van Riel
  date of start life: 2021-11-19
  on property: heeft Functie
  has value: InzamelingVanGrondwater
subclass of: Restriction
  author at start life: Wouter van Riel
  date of start life: 2021-11-19
  on property: heeft Functie
  has value: InzamelingVanHemelwater
subclass of: Restriction
  author at start life: Wouter van Riel
  date of start life: 2021-11-19
  on property: heeft Functie
  has value: TransportVanGrondwater
subclass of: Restriction
  author at start life: Wouter van Riel
  date of start life: 2021-11-19
  on property: heeft Functie
  has value: TransportVanHemelwater
subclass of: Restriction
  author at start life: Wouter van Riel
  date of start life: 2022-09-26
  on class: Drainage/infiltratie transportstelsel
  on property: has as part (inverse)
  max qualified cardinality: 1
subclass of: Restriction
  on class: Doorlaatbaarheid
  on property: has as aspect
  max qualified cardinality: 1
subclass of: Restriction
  on class: Drainagestelsel
  on property: has as part (inverse)
  max qualified cardinality: 1

Omhulling
author of change: Marinus Vonhof
date of change: 2026-07-13
definition: Bekleding van de buitenzijde
author at start life: Marinus Vonhof
date of start life: 2026-07-13
comment: Was Leidingomhulling, wordt meer algemeen. URI gewijzigd vanaf versie 1.7.0
alternative label: Bekleding
alternative label: Mantel
scope note: Collection of facts MDS
scope note: Collection of facts HYD
type: Class
subclass of: Constructieonderdeel
subclass of: Restriction
  author at start life: Marinus Vonhof
  date of start life: 2018-12-06
  on class: DT-riool
  on property: has as part (inverse)
  max qualified cardinality: 1
subclass of: Restriction
  author at start life: Marinus Vonhof
  date of start life: 2018-12-06
  on class: Drain
  on property: has as part (inverse)
  max qualified cardinality: 1
subclass of: Restriction
  author at start life: Marinus Vonhof
  date of start life: 2018-12-06
  on class: Infiltratieriool
  on property: has as part (inverse)
  max qualified cardinality: 1
subclass of: Restriction
  author at start life: Marinus Vonhof
  date of start life: 2018-12-06
  on class: Materiaal omhulling
  on property: has as aspect
  max qualified cardinality: 1
subclass of: Restriction
  author at start life: Marinus Vonhof
  date of start life: 2026-07-13
  on class: DIT-riool
  on property: has as part (inverse)
  max qualified cardinality: 1
subclass of: Restriction
  author at start life: Marinus Vonhof
  date of start life: 2026-07-13
  on class: Infiltratiekoffer
  on property: has as part (inverse)
  max qualified cardinality: 1
subclass of: Restriction
  author at start life: Marinus Vonhof
  date of start life: 2026-07-13
  on class: Infiltratiekolk
  on property: has as part (inverse)
  max qualified cardinality: 1
subclass of: Restriction
  author at start life: Marinus Vonhof
  date of start life: 2026-07-13
  on class: Infiltratiekrat
  on property: has as part (inverse)
  max qualified cardinality: 1
subclass of: Restriction
  author at start life: Marinus Vonhof
  date of start life: 2026-07-13
  on class: Infiltratieput
  on property: has as part (inverse)
  max qualified cardinality: 1
subclass of: Restriction
  author at start life: Marinus Vonhof
  date of start life: 2026-07-16
  on class: O90-waarde
  on property: has as aspect
  max qualified cardinality: 1
subclass of: Restriction
  on property: heeft Uitvoering
  has value: BekledingBuitenzijde

Drainage/infiltratie transportstelsel
author of change: Marinus Vonhof
author of change: Johan Post
date of change: 2025-01-16
date of change: 2026-05-01
date of change: 2026-06-30
definition: Een stelsel van hemelwaterriolen en geperforeerde buizen dat, afhankelijk van de grondwaterstand, een drainerende of infiltrerende werking heeft, en dat tevens dient voor het transport van overtollig water hemel- en grondwater
author at start life: Wouter van Riel
date of start life: 2022-09-26
alternative label: DIT-stelsel
alternative label: Gecombineerd infiltratiestelsel
scope note: Collection of facts BAS
scope note: Collection of facts HYD
type: Class
subclass of: Infiltratiestelsel
subclass of: Restriction
  author of change: Johan Post
  date of change: 2026-06-30
  author at start life: Johan Post
  date of start life: 2026-05-01
  on class: DIT-riool
  on property: has as part
  min qualified cardinality: 1
subclass of: Restriction
  author at start life: Wouter van Riel
  date of start life: 2022-09-26
  on class: DT-riool
  on property: has as part
  min qualified cardinality: 0
subclass of: Restriction
  author at start life: Wouter van Riel
  date of start life: 2022-09-26
  on class: Drain
  on property: has as part
  min qualified cardinality: 0
subclass of: Restriction
  author at start life: Wouter van Riel
  date of start life: 2022-09-26
  on class: Hemelwaterriool
  on property: has as part
  min qualified cardinality: 0
subclass of: Restriction
  on property: heeft Functie
  has value: DrainageEnTransportVanHemel EnGrondwater
subclass of: Restriction
  on property: heeft Uitvoering
  has value: GeheelVanVerbondenDITRiolen DrainsEnHemel

Doorlaatbaarheid
label: Permeability @en
author of change: Johan Post
date of change: 2026-05-01
definition: De mate van doorlaatbaarheid
definition: [EN 16323:2014] property of a material characterizing its ability to selectively permit substances to pass through it @en
author at start life: Johan Post
date of start life: 2024-05-01
units of measurements: m/dag
validity context: 15d
comment: Eenheid m/dag = m/etmaal
alternative label: Infiltratiesnelheid
alternative label: Permeabiliteit
comment: [is aspect]
scope note: Collection of facts MDS
scope note: Collection of facts RRB
scope note: Collection of facts LDR
type: Class
subclass of: Kenmerk
subclass of: Restriction
  author of change: Marinus Vonhof
  date of change: 2017-05-20
  author at start life: Nic Roest (Idoro)
  date of start life: 2007-11-29
  on class: Infiltratieput
  on property: has as aspect (inverse)
  max qualified cardinality: 1
subclass of: Restriction
  author of change: Marinus Vonhof
  date of change: 2017-05-20
  author at start life: Nic Roest (Idoro)
  date of start life: 2007-11-29
  on class: Infiltratieriool
  on property: has as aspect (inverse)
  max qualified cardinality: 1
subclass of: Restriction
  author at start life: Marinus Vonhof
  date of start life: 2016-04-20
  on class: Drain
  on property: has as aspect (inverse)
  max qualified cardinality: 1
subclass of: Restriction
  author at start life: Marinus Vonhof
  date of start life: 2026-07-24
  on class: Infiltratiekrat
  on property: has as aspect (inverse)
  max qualified cardinality: 1
subclass of: Restriction
  author at start life: Marinus Vonhof
  date of start life: 2026-07-26
  on class: Inwinning
  on property: has as aspect
  max qualified cardinality: 1
subclass of: Restriction
  author at start life: Nic Roest (Idoro)
  date of start life: 2007-11-29
  on class: Infiltratiekoffer
  on property: has as aspect (inverse)
  max qualified cardinality: 1
subclass of: Restriction
  author at start life: Nic Roest (Idoro)
  date of start life: 2007-11-29
  on class: Infiltratiekolk
  on property: has as aspect (inverse)
  max qualified cardinality: 1
subclass of: Restriction
  on property: has as value
  all values from: decimal
subclass of: Restriction
  on class: DIT-riool
  on property: has as aspect (inverse)
  max qualified cardinality: 1
subclass of: Restriction
  on class: DT-riool
  on property: has as aspect (inverse)
  max qualified cardinality: 1

DT-riool
author of change: Marinus Vonhof
author of change: Johan Post
author of change: Eric van Gorkom
date of change: 2021-08-06
date of change: 2026-05-01
date of change: 2024-05-13
date of change: 2026-05-18
definition: Een rioolleiding met waterdoorlatende wanden bestemd voor de inzameling en transport van grondwater en eventueel ook hemelwater, waarbij grondwater via de wanden kan intreden
author at start life: Marinus Vonhof
date of start life: 2018-12-06
alternative label: Drainage transportriool
alternative label: Exfiltratieriool
scope note: Collection of facts MDS
scope note: Collection of facts HYD
type: Class
subclass of: Vrijverval rioolleiding
subclass of: Restriction
  author of change: Marinus Vonhof
  date of change: 2026-07-13
  author at start life: Marinus Vonhof
  date of start life: 2018-12-06
  on class: Omhulling
  on property: has as part
  max qualified cardinality: 1
subclass of: Restriction
  author at start life: Marinus Vonhof
  date of start life: 2020-04-18
  on class: Hemelwaterstelsel
  on property: has as part (inverse)
  max qualified cardinality: 1
subclass of: Restriction
  author at start life: Marinus Vonhof
  date of start life: 2024-08-01
  on property: heeft Functie
  has value: InzamelingVanGrondwater
subclass of: Restriction
  author at start life: Marinus Vonhof
  date of start life: 2024-08-01
  on property: heeft Functie
  has value: InzamelingVanHemelwater
subclass of: Restriction
  author at start life: Marinus Vonhof
  date of start life: 2024-08-01
  on property: heeft Functie
  has value: TransportVanGrondwater
subclass of: Restriction
  author at start life: Marinus Vonhof
  date of start life: 2024-08-01
  on property: heeft Functie
  has value: TransportVanHemelwater
subclass of: Restriction
  author at start life: Marinus Vonhof
  date of start life: 2026-07-24
  on class: Infiltratievoorziening
  on property: has as part (inverse)
  max qualified cardinality: 1
subclass of: Restriction
  author at start life: Wouter van Riel
  date of start life: 2022-09-26
  on class: Drainage transportstelsel
  on property: has as part (inverse)
  max qualified cardinality: 1
subclass of: Restriction
  on class: Doorlaatbaarheid
  on property: has as aspect
  max qualified cardinality: 1
subclass of: Restriction
  on class: Drainagestelsel
  on property: has as part (inverse)
  max qualified cardinality: 1

Drainage transportstelsel
author of change: Marinus Vonhof
author of change: Johan Post
date of change: 2025-01-16
date of change: 2026-06-30
definition: Een stelsel bestaande uit DT riolen, drains en hemelwaterriolen, bestemd voor drainage en transport van hemel- en grondwater
author at start life: Wouter van Riel
date of start life: 2022-09-26
alternative label: DT-stelsel
scope note: Collection of facts BAS
type: Class
subclass of: Drainagestelsel
subclass of: Restriction
  author at start life: Wouter van Riel
  date of start life: 2022-09-26
  on class: Hemelwaterriool
  on property: has as part
  min qualified cardinality: 0
subclass of: Restriction
  author at start life: Wouter van Riel
  date of start life: 2022-09-26
  on class: DT-riool
  on property: has as part
  min qualified cardinality: 1
subclass of: Restriction
  on property: heeft Functie
  has value: DrainageEnTransportVanHemel EnGrondwater
subclass of: Restriction
  on property: heeft Uitvoering
  has value: GeheelVanVerbondenDTRiolen DrainsEnHemel
subclass of: Restriction
  on property: heeft Functie
  has value: TransporteertVooral

Dakoppervlak hellend
notation: DAK_HEL
author at start life: Marinus Vonhof
date of start life: 2011-12-15
units of measurements: m2
comment: [is aspect]
scope note: Collection of facts MDS
scope note: Collection of facts HYD
type: Class
subclass of: Afvoerend oppervlak hellend
subclass of: Restriction
  on property: has as value
  all values from: Dakoppervlak hellend (datatype)

Dakoppervlak vlak
notation: DAK_VLA
author at start life: Marinus Vonhof
date of start life: 2011-12-15
units of measurements: m2
comment: [is aspect]
scope note: Collection of facts MDS
scope note: Collection of facts HYD
type: Class
subclass of: Afvoerend oppervlak vlak
subclass of: Restriction
  on property: has as value
  all values from: Dakoppervlak vlak (datatype)

Dakoppervlak vlak uitgestrekt
notation: DAK_VLU
author at start life: Marinus Vonhof
date of start life: 2011-12-15
units of measurements: m2
comment: [is aspect]
scope note: Collection of facts MDS
scope note: Collection of facts HYD
type: Class
subclass of: Afvoerend oppervlak vlak uitgestrekt
subclass of: Restriction
  on property: has as value
  all values from: Dakoppervlak vlak uitgestrekt (datatype)

Datacommunicatie
author of change: Marinus Vonhof
author of change: Johan Post
date of change: 2024-05-16
date of change: 2026-06-30
definition: Type communicatie tussen het OT-procesbesturings- en bewakingssysteem en het object, waarmee besturingssignalen, meetwaarden of statusinformatie worden uitgewisseld.
author at start life: Marinus Vonhof
date of start life: 2014-08-01
validity context: 6d 10d 11d 12d 13d
comment: Type verbinding met OT-systeem
comment: [is aspect]
scope note: Collection of facts MDS
type: Class
subclass of: Kenmerk
subclass of: Restriction
  author at start life: Marinus Vonhof
  date of start life: 2014-08-01
  on class: Elektriciteitskast
  on property: has as aspect (inverse)
  max qualified cardinality: 1
subclass of: Restriction
  on property: has as reference (qualification)
  all values from: Datacommunicatie (coll)

Datakabel
author of change: Marinus Vonhof
author of change: Johan Post
date of change: 2025-01-16
date of change: 2021-10-01
definition: [IMBOR] Kabel voor de voortgeleiding van een signaal.
author at start life: Marinus Vonhof
date of start life: 2014-08-01
validity context: 1d 3d
alternative label: Datatransportkabel
scope note: Collection of facts BAS
type: Class
subclass of: Kabel
subclass of: Restriction
  on property: heeft Functie
  has value: VoortgeleidingVanSignaal
subclass of: Restriction
  on class: Sym_Kabel
  on property: is represented by
  max qualified cardinality: 1
subclass of: Restriction
  on class: Vacuümriolering
  on property: has as part (inverse)
  max qualified cardinality: 1

Kabel
author of change: Marinus Vonhof
author of change: Johan Post
date of change: 2025-01-16
date of change: 2024-05-01
date of change: 2016-04-15
author at start life: Marinus Vonhof
date of start life: 2015-07-28
validity context: 1d 3d 10d 15d
see also: [IMKL: 1.1/2008] Een geheel van geleiders welke voorzien zijn van 1 ommanteling en bestemd is voor transport van energie of data
scope note: Collection of facts BAS
type: Class
subclass of: Fysiek object
subclass of: Restriction
  author of change: Marinus Vonhof
  date of change: 2016-04-23
  author at start life: Marinus Vonhof
  date of start life: 2014-08-01
  on class: Zekering kabel
  on property: has as part
  min qualified cardinality: 0
subclass of: Restriction
  author of change: Marinus Vonhof
  date of change: 2018-12-05
  author at start life: Marinus Vonhof
  date of start life: 2018-09-03
  on class: Straat
  on property: has as part (inverse)
  max qualified cardinality: 1
subclass of: Restriction
  author of change: Marinus Vonhof
  date of change: 2020-04-18
  author at start life: Marinus Vonhof
  date of start life: 2016-04-21
  on class: Kabeloriëntatie
  on property: has as aspect
  max qualified cardinality: 1
subclass of: Restriction
  author of change: Marinus Vonhof
  date of change: 2021-08-06
  date of change: 2026-07-23
  author at start life: Marinus Vonhof
  date of start life: 2018-12-12
  on class: Revisietekening
  on property: is represented by
  min qualified cardinality: 0
subclass of: Restriction
  author at start life: Marinus Vonhof
  date of start life: 2015-07-28
  on class: Elektriciteitskast
  on property: is connected to
  max qualified cardinality: 1
subclass of: Restriction
  author at start life: Marinus Vonhof
  date of start life: 2018-09-03
  on class: Ondergrond
  on property: has as part (inverse)
  max qualified cardinality: 1
subclass of: Restriction
  author at start life: Marinus Vonhof
  date of start life: 2020-04-17
  on class: Meetinrichting
  on property: has as part (inverse)
  max qualified cardinality: 1
subclass of: Restriction
  author at start life: Marinus Vonhof
  date of start life: 2020-04-17
  on class: Regelinrichting
  on property: has as part (inverse)
  max qualified cardinality: 1
subclass of: Restriction
  on property: heeft Functie
  has value: GeleidenVanElektronen
subclass of: Restriction
  on class: Theoretische levensduur
  on property: has as aspect
  max qualified cardinality: 1

Sym_Kabel
definition: Standaard stijl: Lijntype doorgetrokken, Lijnkleur 255 0 0, Lijndikte 1.0
author at start life: Johan Post
date of start life: 2021-10-01
scope note: Collection of facts NLCS
type: Class
subclass of: Geo-symbool
subclass of: Restriction
  author at start life: Marinus Vonhof
  date of start life: 2018-11-07
  on class: Datakabel
  on property: is represented by (inverse)
  max qualified cardinality: 1
subclass of: Restriction
  on class: Hoogspanningskabel
  on property: is represented by (inverse)
  max qualified cardinality: 1
subclass of: Restriction
  on class: Laagspanningskabel
  on property: is represented by (inverse)
  max qualified cardinality: 1
subclass of: Restriction
  on class: Middenspanningskabel
  on property: is represented by (inverse)
  max qualified cardinality: 1
subclass of: Restriction
  on class: Voedingskabel
  on property: is represented by (inverse)
  max qualified cardinality: 1

WIBON thema (coll)
author of change: Marinus Vonhof
date of change: 2022-10-01
comment: [is coll]
scope note: Collection of facts MDS
scope note: Collection of facts DMO
type: Class
subclass of: Verzameling soorten

Datum inwinning
author of change: Johan Post
date of change: 2022-09-29
author at start life: Marinus Vonhof
date of start life: 2015-10-29
units of measurements: yyyy-mm-dd
alternative label: Inwinningsdatum
comment: [is aspect]
scope note: Collection of facts TOP
type: Class
subclass of: Datum
subclass of: Restriction
  date of change: 2019-04-25
  author at start life: Marinus Vonhof
  date of start life: 2015-10-29
  on class: Inwinning
  on property: has as aspect (inverse)
  max qualified cardinality: 1
subclass of: Restriction
  on property: has as value
  all values from: date

Datum maatregel
author of change: Marinus Vonhof
date of change: 2019-03-14
definition: De datum waarop de status van de maatregel (ontwerp, uitgevoerd) is ingegaan. Als de status ontbreekt de datum waarop de uitvoering van de maatregel is afgerond
author at start life: Marinus Vonhof
date of start life: 2013-03-26
units of measurements: yyyy-mm-dd
validity context: 6d 15d
comment: [is aspect]
scope note: Collection of facts TOP
type: Class
subclass of: Datum
subclass of: Restriction
  author of change: Marinus Vonhof
  date of change: 2018-05-01
  author at start life: Marinus Vonhof
  date of start life: 2013-03-26
  validity context: *t
  on class: Maatregel
  on property: has as aspect (inverse)
  max qualified cardinality: 1
subclass of: Restriction
  on property: has as value
  all values from: date

Debietmeter
author of change: Johan Post
author of change: Wouter van Riel
date of change: 2022-05-03
date of change: 2024-04-22
definition: Een instrument dat de (afvoer)capaciteit van de volumestroom meet.
author at start life: Finy Teitsma (Oranjewoud)
date of start life: 2007-10-23
scope note: Collection of facts BAS
type: Class
subclass of: Meetinstrument
subclass of: Restriction
  author at start life: Wouter van Riel
  date of start life: 2024-04-22
  on class: Persleiding
  on property: has as part (inverse)
  max qualified cardinality: 1
subclass of: Restriction
  on property: heeft Functie
  has value: MetenCapaciteitVolumestroom
subclass of: Restriction
  on class: Sym_Debietmeter
  on property: is represented by
  max qualified cardinality: 1

Persleiding
label: Pressure main @en
author of change: Marinus Vonhof
author of change: Wouter van Riel
date of change: 2018-12-13
date of change: 2024-04-23
definition: Een gesloten leiding waarin het afvalwater door middel van overdruk wordt getransporteerd.
definition: [EN 16323:2014] pipeline for conveying wastewater under pressure @en
definition: [NEN 3300:1996] leiding waardoor onder overdruk afvalwater wordt getransporteerd
definition: [NEN-EN 752:2008] leiding waardoor afvalwater wordt gepompt [EN 1085:2007, definitie 2170]
author at start life: Marinus Vonhof
author at start life: Finy Teitsma (Oranjewoud)
date of start life: 2007-10-23
validity context: 1d 12d
scope note: Collection of facts TOP
type: Class
subclass of: Mechanische transportleiding
subclass of: Restriction
  author of change: Marinus Vonhof
  date of change: 2016-04-28
  author at start life: Marinus Vonhof
  date of start life: 2014-12-02
  on class: Leidingsegment
  on property: has as part
  min qualified cardinality: 0
subclass of: Restriction
  author of change: Marinus Vonhof
  date of change: 2019-04-05
  author at start life: Marinus Vonhof
  date of start life: 2014-12-02
  on class: Pigging
  on property: has as input (inverse)
  max qualified cardinality: 1
subclass of: Restriction
  author of change: Marinus Vonhof
  date of change: 2017-03-06
  author at start life: Nic Roest (Idoro)
  date of start life: 2007-11-29
  on class: Rioolgemaal
  on property: is connected to
  max qualified cardinality: 1
subclass of: Restriction
  author at start life: Marinus Vonhof
  date of start life: 2014-12-02
  on class: Zakbaak
  on property: has as part
  min qualified cardinality: 0
subclass of: Restriction
  author at start life: Marinus Vonhof
  date of start life: 2014-12-02
  on class: Persleidingstelsel
  on property: has as part (inverse)
  qualified cardinality: 1
subclass of: Restriction
  author at start life: Marinus Vonhof
  date of start life: 2018-10-27
  on class: NLCS_PERSLEIDING
  on property: is represented by
  max qualified cardinality: 1
subclass of: Restriction
  author at start life: Marinus Vonhof
  date of start life: 2018-11-07
  on class: Sym_Persleiding
  on property: is represented by
  max qualified cardinality: 1
subclass of: Restriction
  on property: heeft Technologie
  has value: TransportOnderOverdruk

Sym_Debietmeter
author at start life: Johan Post
date of start life: 2021-10-01
scope note: Collection of facts NLCS
type: Class
subclass of: Geo-symbool
subclass of: Restriction
  author at start life: Marinus Vonhof
  date of start life: 2018-11-07
  on class: Debietmeter
  on property: is represented by (inverse)
  max qualified cardinality: 1

Decentraal zuiveringssysteem
validity context: *d
comment: [is coll]
scope note: Collection of facts BAS
type: Class
subclass of: Verzameling soorten
subclass of: Class
  one of: Beerput
  one of: IBA
subclass of: Restriction
  on property: heeft Functie
  has value: ZuiverenAfvalwater

IBA
author of change: Johan Post
date of change: 2021-10-01
date of change: 2026-05-01
definition: Een reservoir waarbij het vuilwater op biologische wijze wordt gereinigd en het gereinigde water direct wordt geloosd op het oppervlaktewater (IBA-Individuele Behandeling van vuilwater).
author at start life: Finy Teitsma (Oranjewoud)
date of start life: 2007-10-23
see also: [DIV Model] Heeft klasse-specificatie, aanduiding van het zuiveringsrendement
alternative label: Compacte minizuivering
alternative label: IBA compactsysteem
scope note: Collection of facts BAS
type: Class
subclass of: Zuiveringsreservoir
subclass of: Restriction
  author of change: Marinus Vonhof
  date of change: 2016-04-25
  author at start life: Nic Roest (Idoro)
  date of start life: 2007-11-29
  on class: Perceelaansluitpunt
  on property: is connected to
  min qualified cardinality: 1
subclass of: Restriction
  author at start life: Marinus Vonhof
  date of start life: 2015-07-27
  on class: Lozingspunt bodem
  on property: has as part
  max qualified cardinality: 1
subclass of: Restriction
  author at start life: Marinus Vonhof
  date of start life: 2015-07-27
  on class: Lozingspunt oppervlaktewater
  on property: has as part
  max qualified cardinality: 1
subclass of: Restriction
  author at start life: Marinus Vonhof
  date of start life: 2018-10-27
  on class: NLCS_VWA_IBA
  on property: is represented by
  max qualified cardinality: 1
subclass of: Restriction
  on property: heeft Functie
  has value: InzamelingVanVuilwater
subclass of: Restriction
  on property: heeft Uitvoering
  has value: ReservoirMetDirecteLozing
subclass of: Restriction
  on class: IBA
  on property: is represented by
  max qualified cardinality: 1
subclass of: Restriction
  on class: Gebouwaansluitpunt
  on property: is connected to
  min qualified cardinality: 0

GWSW Deelmodel
author of change: Marinus Vonhof
date of change: 2025-11-18
definition: Een selectie van het GWSW Datamodel, gericht op een specifieke toepassing.
author at start life: Marinus Vonhof
date of start life: 2021-02-17
scope note: Collection of facts REV
scope note: Collection of facts BAS
type: Class
subclass of: Informatiedrager
subclass of: Restriction
  author at start life: Marinus Vonhof
  date of start life: 2026-07-24
  on class: Gegevenswoordenboek Stedelijk Water
  on property: has as part (inverse)
  qualified cardinality: 1

Deelmodel GGN-Ligging
author of change: Marinus Vonhof
date of change: 2025-04-09
definition: GGN (gegevensgebruiksniveau) Ligging (CoFs conform Deelmodel Basis)
author at start life: Marinus Vonhof
date of start life: 2024-12-21
comment: [cfk=10]
scope note: Collection of facts BAS
type: Class
subclass of: GWSW Deelmodel
subclass of: Restriction
  author at start life: Marinus Vonhof
  date of start life: 2024-12-21
  on class: Collection of facts MDS
  on property: has as part
  qualified cardinality: 1
subclass of: Restriction
  author at start life: Marinus Vonhof
  date of start life: 2024-12-21
  on class: Collection of facts TOP
  on property: has as part
  qualified cardinality: 1
subclass of: Restriction
  author at start life: Marinus Vonhof
  date of start life: 2025-01-29
  on class: Collection of facts BAS
  on property: has as part
  qualified cardinality: 1

Deelmodel GGN-Modelleren
author of change: Marinus Vonhof
date of change: 2025-04-09
definition: GGN (gegevensgebruiksniveau) Modelleren (CoFs conform Deelmodel Hyd)
author at start life: Marinus Vonhof
date of start life: 2024-12-21
comment: [cfk=11]
scope note: Collection of facts BAS
type: Class
subclass of: GWSW Deelmodel
subclass of: Restriction
  author at start life: Marinus Vonhof
  date of start life: 2024-12-21
  on class: Collection of facts HYD
  on property: has as part
  qualified cardinality: 1
subclass of: Restriction
  author at start life: Marinus Vonhof
  date of start life: 2024-12-21
  on class: Collection of facts TOP
  on property: has as part
  qualified cardinality: 1

Deelmodel GGN-Monitor
definition: GGN (gegevensgebruiksniveau) Monitor, algemene kenmerken afvalwatersysteem gemeenten
author at start life: Marinus Vonhof
date of start life: 2025-10-07
comment: [cfk=15]
scope note: Collection of facts BAS
type: Class
subclass of: GWSW Deelmodel
subclass of: Restriction
  author at start life: Marinus Vonhof
  date of start life: 2025-10-07
  on class: Collection of facts MDS
  on property: has as part
  qualified cardinality: 1
subclass of: Restriction
  author at start life: Marinus Vonhof
  date of start life: 2025-10-07
  on class: Collection of facts TOP
  on property: has as part
  qualified cardinality: 1
subclass of: Restriction
  author at start life: Marinus Vonhof
  date of start life: 2025-10-09
  on class: Collection of facts BAS
  on property: has as part
  qualified cardinality: 1

Deelmodel GGN-Prognoses
author of change: Marinus Vonhof
date of change: 2025-04-09
definition: GGN (gegevensgebruiksniveau) Prognoses (CoFs conform Deelmodel Kengetallen)
author at start life: Marinus Vonhof
date of start life: 2024-12-21
comment: [cfk=13]
scope note: Collection of facts BAS
type: Class
subclass of: GWSW Deelmodel
subclass of: Restriction
  author at start life: Marinus Vonhof
  date of start life: 2024-12-21
  on class: Collection of facts DMO
  on property: has as part
  qualified cardinality: 1
subclass of: Restriction
  author at start life: Marinus Vonhof
  date of start life: 2024-12-21
  on class: Collection of facts TOP
  on property: has as part
  qualified cardinality: 1

Deelmodel GGN-R&I
author of change: Marinus Vonhof
date of change: 2025-04-09
definition: GGN (gegevensgebruiksniveau) Ribx (CoFs conform Deelmodel Mds)
author at start life: Marinus Vonhof
date of start life: 2024-12-21
comment: [cfk=12]
scope note: Collection of facts BAS
type: Class
subclass of: GWSW Deelmodel
subclass of: Restriction
  author at start life: Marinus Vonhof
  date of start life: 2024-12-21
  on class: Collection of facts MDS
  on property: has as part
  qualified cardinality: 1
subclass of: Restriction
  author at start life: Marinus Vonhof
  date of start life: 2024-12-21
  on class: Collection of facts TOP
  on property: has as part
  qualified cardinality: 1

Deelmodel GGN-Uitgebreid
author of change: Marinus Vonhof
date of change: 2025-04-09
definition: GGN (gegevensgebruiksniveau) Uitgebreid (CoFs conform Deelmodel Basis, Hyd en Kengetallen)
author at start life: Marinus Vonhof
date of start life: 2024-12-21
comment: [cfk=14]
scope note: Collection of facts BAS
type: Class
subclass of: GWSW Deelmodel
subclass of: Restriction
  author at start life: Marinus Vonhof
  date of start life: 2024-12-21
  on class: Collection of facts BAS
  on property: has as part
  qualified cardinality: 1
subclass of: Restriction
  author at start life: Marinus Vonhof
  date of start life: 2024-12-21
  on class: Collection of facts HYD
  on property: has as part
  qualified cardinality: 1
subclass of: Restriction
  author at start life: Marinus Vonhof
  date of start life: 2024-12-21
  on class: Collection of facts MDS
  on property: has as part
  qualified cardinality: 1
subclass of: Restriction
  author at start life: Marinus Vonhof
  date of start life: 2024-12-21
  on class: Collection of facts TOP
  on property: has as part
  qualified cardinality: 1

Deelmodel Mds
definition: Deelmodel met minimale dataset
author at start life: Marinus Vonhof
date of start life: 2022-11-01
scope note: Collection of facts BAS
type: Class
subclass of: GWSW Deelmodel
subclass of: Restriction
  author at start life: Marinus Vonhof
  date of start life: 2022-11-01
  on class: Collection of facts MDS
  on property: has as part
  qualified cardinality: 1
subclass of: Restriction
  author at start life: Marinus Vonhof
  date of start life: 2022-11-01
  on class: Collection of facts TOP
  on property: has as part
  qualified cardinality: 1

Deksel
label: Cover @en
author of change: Marinus Vonhof
author of change: Eric van Gorkom
author of change: Wouter van Riel
date of change: 2025-01-16
date of change: 2018-05-03
date of change: 2022-09-27
date of change: 2024-04-22
definition: [IMBOR] Een verwijderbare afdekking van een bepaald object.
notation: B
author at start life: Marinus Vonhof
date of start life: 2013-09-29
validity context: *f
scope note: Collection of facts MDS
scope note: Collection of facts EN
scope note: Collection of facts RRB
scope note: Collection of facts REV
type: Class
subclass of: Afdekking
subclass of: Restriction
  author of change: Marinus Vonhof
  date of change: 2021-08-06
  author at start life: Marinus Vonhof
  date of start life: 2020-04-18
  on class: Kolk
  on property: has as part (inverse)
  qualified cardinality: 1
subclass of: Restriction
  author at start life: Johan Post
  date of start life: 2026-05-04
  on class: Spuikolk
  on property: has as part (inverse)
  max qualified cardinality: 1
subclass of: Restriction
  author at start life: Marinus Vonhof
  date of start life: 2013-09-29
  on class: Ontstoppingsstuk
  on property: has as part (inverse)
  qualified cardinality: 1
subclass of: Restriction
  author at start life: Marinus Vonhof
  date of start life: 2014-08-01
  on property: has as aspect
  some values from: Hoogte afdekking
subclass of: Restriction
  author at start life: Marinus Vonhof
  date of start life: 2014-11-16
  on property: has as aspect
  some values from: Lengte afdekking
subclass of: Restriction
  on property: heeft Functie
  has value: Afdekken
subclass of: Restriction
  on property: heeft Functie
  has value: ToegankelijkHouden

Putdekselniveau
label: Cover level @en
author of change: Marinus Vonhof
date of change: 2017-05-17
definition: [EN13508-2+A1] Het niveau van de bovenkant van de putrand in meters boven het nationaal referentiepunt.
definition: [EN13508-2+A1] The level of the top of the frame of the cover in metres above to National datum. @en
notation: CAS
author at start life: Marinus Vonhof
date of start life: 2015-10-20
comment: Koppeling geometrie - topologie
alternative label: Putdekselhoogte
comment: [is aspect]
scope note: Collection of facts MDS
scope note: Collection of facts EN
scope note: Collection of facts RRB
type: Class
subclass of: Hoogte t.o.v. NAP
subclass of: Restriction
  author of change: Marinus Vonhof
  date of change: 2015-10-20
  author at start life: Marinus Vonhof
  date of start life: 2013-07-19
  on class: Visueel inspecteren rioolput
  on property: has as output (inverse)
  max qualified cardinality: 1
subclass of: Restriction
  date of change: 2017-05-17
  author at start life: Marinus Vonhof
  date of start life: 2015-10-30
  comment: Koppeling geometrie - topologie
  on class: Inwinning
  on property: has as aspect
  max qualified cardinality: 1
subclass of: Restriction
  author at start life: Marinus Vonhof
  date of start life: 2018-10-27
  on class: NLCS_DRAINAGE_PUTDEKSELHOOGTE
  on property: is represented by
  max qualified cardinality: 1
subclass of: Restriction
  author at start life: Marinus Vonhof
  date of start life: 2018-10-27
  on class: NLCS_GWA_PUTDEKSELHOOGTE
  on property: is represented by
  max qualified cardinality: 1
subclass of: Restriction
  author at start life: Marinus Vonhof
  date of start life: 2018-10-27
  on class: NLCS_HWA_PUTDEKSELHOOGTE
  on property: is represented by
  max qualified cardinality: 1
subclass of: Restriction
  author at start life: Marinus Vonhof
  date of start life: 2018-10-27
  on class: NLCS_ITR_PUTDEKSELHOOGTE
  on property: is represented by
  max qualified cardinality: 1
subclass of: Restriction
  author at start life: Marinus Vonhof
  date of start life: 2018-10-27
  on class: NLCS_PERSLEIDING_PUTDEKSELHOOGTE
  on property: is represented by
  max qualified cardinality: 1
subclass of: Restriction
  author at start life: Marinus Vonhof
  date of start life: 2018-10-27
  on class: NLCS_SWA_PUTDEKSELHOOGTE
  on property: is represented by
  max qualified cardinality: 1
subclass of: Restriction
  author at start life: Marinus Vonhof
  date of start life: 2018-10-27
  on class: NLCS_VACUUMLEIDING_PUTDEKSELHOOGTE
  on property: is represented by
  max qualified cardinality: 1
subclass of: Restriction
  author at start life: Marinus Vonhof
  date of start life: 2018-10-27
  on class: NLCS_VWA_PUTDEKSELHOOGTE
  on property: is represented by
  max qualified cardinality: 1
subclass of: Restriction
  author at start life: Marinus Vonhof
  date of start life: 2018-12-12
  on class: Dekseloriëntatie
  on property: has as aspect (inverse)
  qualified cardinality: 1

Resultaat
author of change: Marinus Vonhof
date of change: 2024-05-16
date of change: 2020-10-09
definition: Bij activiteit: de output, het rapport
author at start life: Marinus Vonhof
date of start life: 2014-04-29
validity context: 1d 3d 5d 6d 10d 11d 12d 14d
scope note: Collection of facts TOP
type: Class
subclass of: Informatiedrager

Diameter
author of change: Marinus Vonhof
date of change: 2018-12-05
definition: De lengte van de koorde die het middelpunt van de cirkel snijdt
definition: Zowel een lijn (de koorde die het middelpunt van de cirkel snijdt) als de lengte van die lijn
author at start life: Nic Roest (Idoro)
date of start life: 2006-02-21
validity context: 15d
alternative label: Middellijn
comment: [is aspect]
scope note: Collection of facts TOP
type: Class
subclass of: Afstand

Diameter boorgat
author at start life: Marinus Vonhof
date of start life: 2026-07-24
units of measurements: m
comment: [is aspect]
scope note: Collection of facts BAS
type: Class
subclass of: Diameter
subclass of: Restriction
  on property: has as value
  all values from: integer
subclass of: Restriction
  on class: Infiltratieput
  on property: has as aspect (inverse)
  max qualified cardinality: 1

Infiltratieput
author of change: Marinus Vonhof
author of change: Johan Post
date of change: 2024-05-01
date of change: 2021-10-01
date of change: 2026-07-13
date of change: 2026-07-24
definition: Een put met waterdoorlatende wanden bestemd voor de inzameling van hemelwater, waarbij het hemelwater door middel van infiltratie door de wanden kan worden afgevoerd
definition: [NEN 3300:1996] put waarin voorbezonken afvalwater via infiltratie in de bodem wordt gebracht
notation: ITP
author at start life: Marinus Vonhof
date of start life: 2014-05-01
comment: Bron afbeelding: Wavin
alternative label: IT-put
alternative label: Zakput
scope note: Collection of facts MDS
scope note: Collection of facts HYD
type: Class
subclass of: Put
subclass of: Restriction
  author at start life: Marinus Vonhof
  date of start life: 2026-07-13
  on class: Omhulling
  on property: has as part
  max qualified cardinality: 1
subclass of: Restriction
  author at start life: Marinus Vonhof
  date of start life: 2026-07-13
  on class: Substraat omstorting
  on property: has as part
  max qualified cardinality: 1
subclass of: Restriction
  author at start life: Marinus Vonhof
  date of start life: 2026-07-13
  validity context: *t
  on class: Substraat kern
  on property: has as part
  qualified cardinality: 1
subclass of: Restriction
  author at start life: Marinus Vonhof
  date of start life: 2026-07-24
  on class: Infiltratievoorziening
  on property: has as part (inverse)
  max qualified cardinality: 1
subclass of: Restriction
  on property: heeft Functie
  has value: AfvoerenHemelwaterNaarDeOndergrond
subclass of: Restriction
  on property: heeft Functie
  has value: TijdelijkeBergingVanHemelwater
subclass of: Restriction
  on property: heeft Uitvoering
  has value: WaterdoorlatendeWanden
subclass of: Restriction
  on class: Diameter boorgat
  on property: has as aspect
  max qualified cardinality: 1
subclass of: Restriction
  on class: Niveau bovenkant filterdeel
  on property: has as aspect
  max qualified cardinality: 1
subclass of: Restriction
  on class: Niveau onderkant filterdeel
  on property: has as aspect
  max qualified cardinality: 1
subclass of: Restriction
  on class: Rooster
  on property: has as part
  max qualified cardinality: 1
subclass of: Restriction
  on class: Sym_Drainageput
  on property: is represented by
  max qualified cardinality: 1

Diameter hulpstuk
definition: De bij het materiaal gebruikelijke aanduiding van de diameter van een hulpstuk.
author at start life: Johan Post
date of start life: 2026-05-18
units of measurements: mm
comment: [is aspect]
scope note: Collection of facts BAS
scope note: Collection of facts PLI
type: Class
subclass of: Diameter
subclass of: Restriction
  on property: has as value
  all values from: Diameter hulpstuk (datatype)
subclass of: Restriction
  on class: Hulpstuk
  on property: has as aspect (inverse)
  max qualified cardinality: 1

Diameter opening
author at start life: Marinus Vonhof
date of start life: 2017-08-31
units of measurements: mm
comment: Intrinsiek aspect
comment: [is aspect]
scope note: Collection of facts MDS
scope note: Collection of facts HYD
type: Class
subclass of: Diameter
subclass of: Restriction
  author of change: Marinus Vonhof
  date of change: 2017-12-07
  author at start life: Marinus Vonhof
  date of start life: 2017-08-31
  on class: Doorlaat
  on property: has as aspect (inverse)
  max qualified cardinality: 1
subclass of: Restriction
  on property: has as value
  all values from: integer

Diameter put
author of change: Marinus Vonhof
author of change: Johan Post
date of change: 2021-08-06
date of change: 2026-05-01
definition: De inwendige diameter (horizontaal, uit het bovenaanzicht). Indien aanwezig de diameter van de onderbak. - zie afbeelding dc (bron EN13508-2)
author at start life: Marinus Vonhof
date of start life: 2013-10-01
units of measurements: mm
comment: Intrinsiek aspect
comment: In datasets kan voor de afmeting van ronde putten zowel de diameter, lengte of breedte als kenmerk worden gebruikt
comment: [is aspect]
scope note: Collection of facts MDS
scope note: Collection of facts HYD
scope note: Collection of facts RGM
type: Class
subclass of: Diameter
subclass of: Restriction
  author of change: Marinus Vonhof
  date of change: 2015-08-24
  author at start life: Marinus Vonhof
  date of start life: 2013-10-01
  on class: Put
  on property: has as aspect (inverse)
  max qualified cardinality: 1
subclass of: Restriction
  on property: has as value
  all values from: Diameter put (datatype)

Standaard afsluiterstand (coll)
comment: [is coll]
scope note: Collection of facts BAS
scope note: Collection of facts PLI
type: Class
subclass of: Verzameling soorten
subclass of: Class
  one of: Open
  one of: Dicht

Diepinfiltratieput
definition: Een infiltratieput met grote hoogte, zonder onderscheid in freatisch/niet-freatisch functioneren
author at start life: Marinus Vonhof
date of start life: 2026-07-20
scope note: Collection of facts BAS
type: Class
subclass of: Infiltratieput
subclass of: Restriction
  on property: heeft Uitvoering
  has value: GroteHoogte

Dijk
author of change: Marinus Vonhof
date of change: 2025-01-16
date of change: 2024-11-26
definition: [IMBOR] Aangelegde waterkering van grond, die het achterliggende land beschermt tegen overstromingen.
author at start life: Marinus Vonhof
date of start life: 2015-04-20
validity context: *d
alternative label: Dijklichaam
scope note: Collection of facts BAS
scope note: Collection of facts PLI
type: Class
subclass of: Bouwwerk
subclass of: Restriction
  author of change: Marinus Vonhof
  date of change: 2018-04-23
  author at start life: Marinus Vonhof
  date of start life: 2014-12-02
  on class: Risicogebied
  on property: has as part (inverse)
  max qualified cardinality: 1
subclass of: Restriction
  on property: heeft Doel
  has value: BeschermenTegenOverstromingen

Risicogebied
author of change: Marinus Vonhof
date of change: 2015-02-28
author at start life: Marinus Vonhof
date of start life: 2014-12-02
see also: [WSH 20141028] Locaties met verhoogd risico bij calamiteiten leiding. Watergang, waterkering, gasleiding, spoorlijn
scope note: Collection of facts BAS
scope note: Collection of facts DMO
type: Class
subclass of: Gebied
subclass of: Restriction
  author of change: Marinus Vonhof
  date of change: 2015-04-20
  author at start life: Marinus Vonhof
  date of start life: 2014-12-02
  on class: Waterdeel
  on property: has as part
  min qualified cardinality: 0
subclass of: Restriction
  author of change: Marinus Vonhof
  date of change: 2015-04-20
  author at start life: Marinus Vonhof
  date of start life: 2014-12-03
  on class: Leiding
  on property: has as part
  min qualified cardinality: 0
subclass of: Restriction
  author of change: Marinus Vonhof
  date of change: 2015-04-20
  author at start life: Marinus Vonhof
  date of start life: 2014-12-03
  on class: Put
  on property: has as part
  min qualified cardinality: 0
subclass of: Restriction
  author of change: Marinus Vonhof
  date of change: 2018-04-23
  author at start life: Marinus Vonhof
  date of start life: 2014-12-02
  on class: Dijk
  on property: has as part
  min qualified cardinality: 0
subclass of: Restriction
  author of change: Marinus Vonhof
  date of change: 2018-04-23
  author at start life: Marinus Vonhof
  date of start life: 2014-12-02
  on class: Spoorlijn
  on property: has as part
  min qualified cardinality: 0
subclass of: Restriction
  author of change: Marinus Vonhof
  date of change: 2018-04-23
  author at start life: Marinus Vonhof
  date of start life: 2014-12-02
  on class: Waterkering
  on property: has as part
  min qualified cardinality: 0

Dikte
author of change: Marinus Vonhof
date of change: 2015-05-29
definition: In de richting haaks op het vlak van een plat voorwerp, waarbij de meetpunten op de buitenkant liggen
author at start life: Nic Roest (Idoro)
date of start life: 2006-02-21
validity context: 15d
comment: [is aspect]
scope note: Collection of facts TOP
type: Class
subclass of: Afstand

Dikte lining
author of change: Marinus Vonhof
date of change: 2018-09-03
definition: Dikte van de lining
author at start life: Nic Roest (Idoro)
date of start life: 2006-02-21
units of measurements: mm
comment: [is aspect]
scope note: Collection of facts BAS
scope note: Collection of facts PLI
type: Class
subclass of: Dikte
subclass of: Restriction
  author of change: Marinus Vonhof
  date of change: 2018-09-03
  author at start life: Finy Teitsma (Oranjewoud)
  date of start life: 2006-02-25
  on class: Lining
  on property: has as aspect (inverse)
  max qualified cardinality: 1
subclass of: Restriction
  on property: has as value
  all values from: integer

Kern
label: Town or village @en
author of change: Marinus Vonhof
date of change: 2021-03-10
definition: [EN13508-2+A1] De naam van de stad, het dorp, zoals gespecificeerd door de bevoegde instantie
definition: [EN13508-2+A1] The name of the town, village as specified by the employing authority @en
notation: AAN
notation: CAN
notation: EAN
notation: GAN
notation: JAN
author at start life: Marinus Vonhof
date of start life: 2014-11-30
validity context: 5d 11d
see also: [IRIS-RIOKEN:2012] Gebied liggend binnen een gemeente, meerdere definities mogelijk, afhankelijk van welke bron gehanteerd wordt. Een kern wordt over het algemeen gevormd door een woonplaats met het bijbehorende buitengebied.
alternative label: Bebouwingskern
alternative label: Stad of dorp
scope note: Collection of facts BAS
scope note: Collection of facts DMO
type: Class
subclass of: Registratief gebied
subclass of: Restriction
  author of change: Marinus Vonhof
  date of change: 2015-05-27
  author at start life: Marinus Vonhof
  date of start life: 2014-11-30
  on class: Gemeentelijk gebied
  on property: has as part (inverse)
  qualified cardinality: 1
subclass of: Restriction
  author of change: Marinus Vonhof
  date of change: 2016-04-24
  author at start life: Marinus Vonhof
  date of start life: 2014-12-01
  on class: District
  on property: has as part
  max qualified cardinality: 1

Doekomhulling
definition: Omhulling van een constructie met doek
author at start life: Marinus Vonhof
date of start life: 2026-07-16
scope note: Collection of facts MDS
scope note: Collection of facts HYD
type: Class
subclass of: Omhulling
subclass of: Restriction
  on property: heeft Uitvoering
  has value: BekledingMetDoek

Onderscheidend kenmerk
author of change: Marinus Vonhof
date of change: 2021-01-09
definition: Een dicriminerend (onderscheidend) kenmerk
author at start life: Marinus Vonhof
date of start life: 2015-02-25
comment: [is aspect]
scope note: Collection of facts TOP
type: Class
subclass of: Kenmerk

Wegtype (coll)
validity context: 6d
comment: [is coll]
scope note: Collection of facts BAS
type: Class
subclass of: Verzameling soorten

Maximale capaciteit doorlaat
author of change: Marinus Vonhof
author of change: Johan Post
date of change: 2025-01-16
date of change: 2022-11-25
definition: [IMBOR] Aanduiding van de van de bovengrens van het vermogen tot verwerken van water van opening.
author at start life: Marinus Vonhof
date of start life: 2011-12-15
units of measurements: m3/h
comment: [is aspect]
scope note: Collection of facts MDS
scope note: Collection of facts HYD
type: Class
subclass of: Capaciteit
subclass of: Restriction
  author of change: Marinus Vonhof
  date of change: 2017-09-06
  author at start life: Marinus Vonhof
  date of start life: 2011-12-15
  validity context: 5t 11t
  on class: Doorlaat
  on property: has as aspect (inverse)
  max qualified cardinality: 1
subclass of: Restriction
  on property: has as value
  all values from: Maximale capaciteit doorlaat (datatype)

Hoogte opening
author of change: Marinus Vonhof
date of change: 2015-02-28
author at start life: Marinus Vonhof
date of start life: 2011-12-15
units of measurements: mm
comment: Intrinsiek aspect
comment: [is aspect]
scope note: Collection of facts MDS
scope note: Collection of facts REV
scope note: Collection of facts HYD
type: Class
subclass of: Hoogte
subclass of: Restriction
  author of change: Marinus Vonhof
  date of change: 2017-12-07
  author at start life: Marinus Vonhof
  date of start life: 2011-12-15
  on class: Doorlaat
  on property: has as aspect (inverse)
  max qualified cardinality: 1
subclass of: Restriction
  on property: has as value
  all values from: integer

Vorm opening
author of change: Eric van Gorkom
date of change: 2024-05-13
definition: A 2 48-49 Vst rond
author at start life: Marinus Vonhof
date of start life: 2011-12-15
comment: Intrinsiek aspect
comment: [is aspect]
scope note: Collection of facts MDS
scope note: Collection of facts REV
scope note: Collection of facts HYD
type: Class
subclass of: Vorm
subclass of: Restriction
  author of change: Marinus Vonhof
  date of change: 2017-12-07
  author at start life: Marinus Vonhof
  date of start life: 2011-12-15
  validity context: 5t 11t
  on class: Doorlaat
  on property: has as aspect (inverse)
  max qualified cardinality: 1
subclass of: Restriction
  on property: has as reference (qualification)
  all values from: Vorm opening (coll)

Stromingsrichting
definition: De richting waarin de vloeistof zich verplaatst, wordt bepaald door de verhanglijn
author at start life: Marinus Vonhof
date of start life: 2011-12-15
see also: [HYD] Aanduiding mogelijke stromingsrichting
alternative label: Stroomrichting
comment: [is aspect]
scope note: Collection of facts HYD
type: Class
subclass of: Kenmerk
subclass of: Restriction
  author of change: Marinus Vonhof
  date of change: 2017-12-07
  author at start life: Marinus Vonhof
  date of start life: 2011-12-15
  validity context: 5t 11t
  on class: Overstortdrempel
  on property: has as aspect (inverse)
  max qualified cardinality: 1
subclass of: Restriction
  author at start life: Marinus Vonhof
  date of start life: 2017-09-06
  validity context: 5t 11t
  on class: Doorlaat
  on property: has as aspect (inverse)
  max qualified cardinality: 1
subclass of: Restriction
  author at start life: Marinus Vonhof
  date of start life: 2018-10-27
  on class: NLCS_STROOMRICHTING
  on property: is represented by
  max qualified cardinality: 1
subclass of: Restriction
  author at start life: Marinus Vonhof
  date of start life: 2019-03-20
  validity context: 5t 11t
  on class: Stuwmuur
  on property: has as aspect (inverse)
  max qualified cardinality: 1
subclass of: Restriction
  on property: has as reference (qualification)
  all values from: Stromingsrichting (coll)

Doorlaatniveau
author of change: Marinus Vonhof
date of change: 2019-08-12
definition: Niveau binnenonderkant doorlaatopening
author at start life: Marinus Vonhof
date of start life: 2017-12-07
units of measurements: m
comment: [is aspect]
scope note: Collection of facts MDS
scope note: Collection of facts REV
scope note: Collection of facts HYD
type: Class
subclass of: Hoogte t.o.v. NAP
subclass of: Restriction
  author at start life: Marinus Vonhof
  date of start life: 2017-12-07
  validity context: 5t 11t
  on class: Doorlaat
  on property: has as aspect (inverse)
  max qualified cardinality: 1
subclass of: Restriction
  on property: has as value
  all values from: decimal

Infiltratieriool
author of change: Marinus Vonhof
author of change: Johan Post
date of change: 2024-05-01
date of change: 2026-07-13
definition: Een rioolleiding met waterdoorlatende wanden bestemd voor de inzameling en transport van hemelwater, waarbij het hemelwater door middel van infiltratie door de wanden kan worden afgevoerd. Kan ook beschouwd worden als een soort infiltratievoorziening.
notation: ITR
author at start life: Marinus Vonhof
date of start life: 2017-05-20
alternative label: IT-riool
alternative label: Infiltratieleiding
scope note: Collection of facts MDS
scope note: Collection of facts REV
scope note: Collection of facts HYD
type: Class
subclass of: Vrijverval rioolleiding
subclass of: Restriction
  author of change: Marinus Vonhof
  date of change: 2019-05-15
  author at start life: Marinus Vonhof
  date of start life: 2018-12-06
  on class: Infiltratiestelsel
  on property: has as part (inverse)
  qualified cardinality: 1
subclass of: Restriction
  author of change: Marinus Vonhof
  date of change: 2026-07-13
  author at start life: Marinus Vonhof
  date of start life: 2018-12-06
  on class: Omhulling
  on property: has as part
  max qualified cardinality: 1
subclass of: Restriction
  author of change: Marinus Vonhof
  date of change: 2017-05-20
  author at start life: Nic Roest (Idoro)
  date of start life: 2007-11-29
  on class: Doorlaatbaarheid
  on property: has as aspect
  max qualified cardinality: 1
subclass of: Restriction
  author at start life: Marinus Vonhof
  date of start life: 2018-11-07
  on class: Sym_Infiltratieriool
  on property: is represented by
  max qualified cardinality: 1
subclass of: Restriction
  author at start life: Marinus Vonhof
  date of start life: 2020-05-26
  on class: Hemelwaterstelsel
  on property: has as part (inverse)
  max qualified cardinality: 1
subclass of: Restriction
  author at start life: Marinus Vonhof
  date of start life: 2026-08-20
  on class: Infiltratievoorziening
  on property: has as part (inverse)
  max qualified cardinality: 1
subclass of: Restriction
  on property: heeft Functie
  has value: AfvoerenHemelwaterNaarDeOndergrond
subclass of: Restriction
  on property: heeft Uitvoering
  has value: WaterdoorlatendeWanden

Drain
author of change: Marinus Vonhof
author of change: Johan Post
author of change: Eric van Gorkom
date of change: 2024-05-01
date of change: 2016-04-20
date of change: 2024-05-13
date of change: 2023-01-12
definition: Een leiding met doorlatende wanden bestemd voor het op peil houden van het grondwater, kan onderdeel zijn van een drainagestelsel.
author at start life: Nic Roest (Idoro)
date of start life: 2006-03-23
validity context: 1d
alternative label: Drainagebuis
alternative label: Draineerbuis
scope note: Collection of facts MDS
scope note: Collection of facts HYD
type: Class
subclass of: Leiding
subclass of: Restriction
  author of change: Marinus Vonhof
  date of change: 2014-09-02
  author at start life: Finy Teitsma (Oranjewoud)
  date of start life: 2007-10-23
  on class: Drainagestelsel
  on property: has as part (inverse)
  qualified cardinality: 1
subclass of: Restriction
  author of change: Marinus Vonhof
  date of change: 2019-07-10
  author at start life: Marinus Vonhof
  date of start life: 2019-05-15
  on class: Grindkoffer
  on property: has as part (inverse)
  max qualified cardinality: 1
subclass of: Restriction
  author of change: Marinus Vonhof
  date of change: 2026-07-13
  author at start life: Marinus Vonhof
  date of start life: 2018-12-06
  on class: Omhulling
  on property: has as part
  max qualified cardinality: 1
subclass of: Restriction
  author at start life: Marinus Vonhof
  date of start life: 2016-04-20
  on class: Porositeit
  on property: has as aspect
  max qualified cardinality: 1
subclass of: Restriction
  author at start life: Marinus Vonhof
  date of start life: 2018-10-27
  on class: NLCS_DRAINAGE
  on property: is represented by
  max qualified cardinality: 1
subclass of: Restriction
  author at start life: Marinus Vonhof
  date of start life: 2018-10-27
  on class: NLCS_DRAINAGE_ALGEMEEN
  on property: is represented by
  max qualified cardinality: 1
subclass of: Restriction
  author at start life: Marinus Vonhof
  date of start life: 2018-10-27
  on class: NLCS_DRAINAGE_DRAIN
  on property: is represented by
  max qualified cardinality: 1
subclass of: Restriction
  author at start life: Marinus Vonhof
  date of start life: 2018-11-07
  on class: Sym_Drain
  on property: is represented by
  max qualified cardinality: 1
subclass of: Restriction
  author at start life: Marinus Vonhof
  date of start life: 2019-07-10
  on class: Zandkoffer
  on property: has as part (inverse)
  max qualified cardinality: 1
subclass of: Restriction
  author at start life: Marinus Vonhof
  date of start life: 2026-07-24
  on class: Infiltratievoorziening
  on property: has as part (inverse)
  max qualified cardinality: 1
subclass of: Restriction
  author at start life: Wouter van Riel
  date of start life: 2022-09-26
  on class: Drainage/infiltratie transportstelsel
  on property: has as part (inverse)
  max qualified cardinality: 1
subclass of: Restriction
  on property: heeft Functie
  has value: InzamelingVanGrondwater
subclass of: Restriction
  on property: heeft Functie
  has value: TransportVanGrondwater
subclass of: Restriction
  on property: heeft Uitvoering
  has value: WaterdoorlatendeWanden
subclass of: Restriction
  on class: Doorlaatbaarheid
  on property: has as aspect
  max qualified cardinality: 1

Infiltratiekolk
author of change: Marinus Vonhof
author of change: Johan Post
date of change: 2021-08-06
date of change: 2024-05-01
date of change: 2026-07-13
definition: Een kolk met waterdoorlatende wanden bestemd voor de inzameling van hemelwater, waarbij het hemelwater door middel van infiltratie door de wanden kan worden afgevoerd. Kan ook beschouwd worden als een soort infiltratievoorziening.
notation: D
author at start life: Finy Teitsma (Oranjewoud)
date of start life: 2006-11-29
comment: ron afbeelding: Wavin
scope note: Collection of facts MDS
scope note: Collection of facts RRB
scope note: Collection of facts LDR
scope note: Collection of facts REV
type: Class
subclass of: Kolk
subclass of: Restriction
  author at start life: Marinus Vonhof
  date of start life: 2026-07-13
  on class: Omhulling
  on property: has as part
  max qualified cardinality: 1
subclass of: Restriction
  author at start life: Marinus Vonhof
  date of start life: 2026-07-13
  on class: Substraat omstorting
  on property: has as part
  max qualified cardinality: 1
subclass of: Restriction
  author at start life: Marinus Vonhof
  date of start life: 2026-07-13
  validity context: *t
  on class: Substraat kern
  on property: has as part
  qualified cardinality: 1
subclass of: Restriction
  author at start life: Nic Roest (Idoro)
  date of start life: 2007-11-29
  on class: Porositeit
  on property: has as aspect
  max qualified cardinality: 1
subclass of: Restriction
  on property: heeft Functie
  has value: AfvoerenHemelwaterNaarDeOndergrond
subclass of: Restriction
  on property: heeft Uitvoering
  has value: WaterdoorlatendeWanden

Doorlatende leiding (coll)
definition: Een leiding die niet vloeistofdicht is, bestemd om het hemel-/grondwater vanuit de bodem op te nemen of in de bodem af te voeren
validity context: *d
comment: [is coll]
scope note: Collection of facts MDS
scope note: Collection of facts DMO
type: Class
subclass of: Verzameling soorten
subclass of: Class
  one of: Infiltratieriool
  one of: Drain
  one of: DIT-riool

Lining met een doorlopende buis
label: Lining with continuous pipes @en
author of change: Marinus Vonhof
date of change: 2025-01-16
definition: [IMBOR] Lining door middel van een geheel nieuwe buisleiding bestaande uit één stuk, die in een bestaande leiding wordt aangebracht.
notation: F
author at start life: Marinus Vonhof
date of start life: 2018-12-12
comment: Bron afbeelding: http://www.nstt.nl
scope note: Collection of facts MDS
scope note: Collection of facts LDR
scope note: Collection of facts MTR
type: Class
subclass of: Lining
subclass of: Restriction
  on property: heeft Uitvoering
  has value: BuisUitEenStuk

Doorspoelen
label: Flushing @en
author of change: Marinus Vonhof
date of change: 2019-03-14
definition: [EN 16323:2014] use of a temporary and substantially increased flow to facilitate the removal of obstructions or sediments from drains or sewers
author at start life: Marinus Vonhof
date of start life: 2013-02-05
scope note: Collection of facts BAS
scope note: Collection of facts MTR
type: Class
subclass of: Reinigen vrijverval leiding
subclass of: Restriction
  on property: heeft Functie
  has value: AfstromingHerstellen

Doorspoelput
author of change: Johan Post
author of change: Wouter van Riel
date of change: 2021-10-01
date of change: 2022-12-19
date of change: 2024-04-22
definition: Een rioolput met voorziening voor het inlaten van oppervlaktewater voor de reiniging van een vrijverval rioolstelsel.
author at start life: Finy Teitsma (Oranjewoud)
date of start life: 2006-02-20
alternative label: Spoelput
scope note: Collection of facts MDS
scope note: Collection of facts RRB
scope note: Collection of facts LDR
scope note: Collection of facts HYD
type: Class
subclass of: Rioolput
subclass of: Restriction
  author of change: Wouter van Riel
  date of change: 2023-12-19
  author at start life: Finy Teitsma (Oranjewoud)
  date of start life: 2007-11-29
  on class: Vrijverval drainagestelsel
  on property: has as part (inverse)
  max qualified cardinality: 1
subclass of: Restriction
  on property: heeft Functie
  has value: ToegangGevenVoorDoorspoelen
subclass of: Restriction
  on class: Sym_Doorspoelput
  on property: is represented by
  max qualified cardinality: 1

Vrijverval drainagestelsel
author of change: Marinus Vonhof
author of change: Johan Post
date of change: 2025-01-16
date of change: 2026-05-18
date of change: 2023-01-12
definition: [IMBOR] Een netwerk van leidingen en putten ten behoeve van drainage waar het watertransport door middel van zwaartekracht plaatsvindt.
author at start life: Marinus Vonhof
date of start life: 2014-09-05
scope note: Collection of facts BAS
type: Class
subclass of: Drainagestelsel
subclass of: Restriction
  author of change: Finy Teitsma (Oranjewoud)
  date of change: 2007-11-29
  author at start life: Finy Teitsma (Oranjewoud)
  date of start life: 2007-10-23
  on class: Lozingspunt
  on property: has as part
  min qualified cardinality: 1
subclass of: Restriction
  author at start life: Finy Teitsma (Oranjewoud)
  date of start life: 2007-11-29
  on class: Filterput
  on property: has as part
  min qualified cardinality: 0
subclass of: Restriction
  author at start life: Marinus Vonhof
  date of start life: 2012-04-29
  on class: Drainageput
  on property: has as part
  min qualified cardinality: 0
subclass of: Restriction
  author at start life: Wouter van Riel
  date of start life: 2022-12-19
  on class: Doorspoelput
  on property: has as part
  min qualified cardinality: 0
subclass of: Restriction
  on property: heeft Technologie
  has value: TransportDoorDeZwaartekracht

Sym_Doorspoelput
author at start life: Johan Post
date of start life: 2021-10-01
scope note: Collection of facts NLCS
type: Class
subclass of: Geo-symbool
subclass of: Restriction
  author at start life: Marinus Vonhof
  date of start life: 2018-11-07
  on class: Doorspoelput
  on property: is represented by (inverse)
  max qualified cardinality: 1

Doorspuitput
author of change: Johan Post
date of change: 2024-05-01
date of change: 2026-05-18
definition: Een rioolput met voorziening voor het inbrengen van een spuitstuk voor de reiniging van de aangesloten leidingen.
author at start life: Wouter van Riel
date of start life: 2022-12-19
scope note: Collection of facts MDS
type: Class
subclass of: Rioolput
subclass of: Restriction
  author at start life: Marinus Vonhof
  date of start life: 2023-01-13
  on class: Mechanisch rioolstelsel
  on property: has as part (inverse)
  max qualified cardinality: 1
subclass of: Restriction
  author at start life: Wouter van Riel
  date of start life: 2022-12-19
  on class: Mechanisch drainagestelsel
  on property: has as part (inverse)
  max qualified cardinality: 1
subclass of: Restriction
  author at start life: Wouter van Riel
  date of start life: 2022-12-19
  on class: NLCS_DRAINAGE_PUT_DOORSPUITPUT
  on property: is represented by
  max qualified cardinality: 1
subclass of: Restriction
  on property: heeft Functie
  has value: ToegangGevenVoorDoorspoelen

Mechanisch rioolstelsel
author of change: Marinus Vonhof
author of change: Johan Post
date of change: 2026-05-01
date of change: 2014-04-29
date of change: 2026-05-18
definition: Een rioolstelsel waarbij het transport door middel van over- of onderdruk plaatsvindt.
author at start life: Finy Teitsma (Oranjewoud)
date of start life: 2006-11-29
validity context: *f
scope note: Collection of facts MDS
scope note: Collection of facts RGM
scope note: Collection of facts DMO
type: Class
subclass of: Rioolstelsel
subclass of: Restriction
  author of change: Marinus Vonhof
  date of change: 2014-04-29
  author at start life: Finy Teitsma (Oranjewoud)
  date of start life: 2006-11-29
  on class: Afvalwatersysteem
  on property: has as part (inverse)
  qualified cardinality: 1
subclass of: Restriction
  author of change: Marinus Vonhof
  date of change: 2018-05-03
  author at start life: Finy Teitsma (Oranjewoud)
  date of start life: 2007-10-23
  on class: Lozingspunt
  on property: has as part
  qualified cardinality: 1
subclass of: Restriction
  author of change: Marinus Vonhof
  author at start life: Marinus Vonhof
  on class: Overnamepunt
  on property: has as part
  max qualified cardinality: 1
subclass of: Restriction
  author at start life: Marinus Vonhof
  date of start life: 2023-01-13
  on class: Doorspuitput
  on property: has as part
  min qualified cardinality: 0
subclass of: Restriction
  on property: heeft Functie
  has value: InzamelingVanVuilwater
subclass of: Restriction
  on property: heeft Technologie
  has value: TransportOnderOverdrukOfOnderdruk
subclass of: Restriction
  on property: heeft Functie
  has value: TransportVanVuilwater
subclass of: Restriction
  on class: Perceelaansluiting
  on property: has as part
  min qualified cardinality: 1

Mechanisch drainagestelsel
author of change: Marinus Vonhof
date of change: 2025-01-16
date of change: 2023-01-12
definition: [IMBOR] Een netwerk van leidingen en putten ten behoeve van drainage waar het watertransport door middel van onder- en bovendruk plaatsvindt.
author at start life: Marinus Vonhof
date of start life: 2014-09-05
scope note: Collection of facts BAS
type: Class
subclass of: Drainagestelsel
subclass of: Restriction
  author of change: Marinus Vonhof
  date of change: 2014-04-10
  author at start life: Finy Teitsma (Oranjewoud)
  date of start life: 2007-10-23
  on class: Filterput
  on property: has as part
  min qualified cardinality: 0
subclass of: Restriction
  author at start life: Marinus Vonhof
  date of start life: 2014-04-10
  on class: Lozingspunt
  on property: has as part
  qualified cardinality: 1
subclass of: Restriction
  author at start life: Wouter van Riel
  date of start life: 2022-12-19
  on class: Doorspuitput
  on property: has as part
  min qualified cardinality: 0
subclass of: Restriction
  on property: heeft Technologie
  has value: ViaOnderdruk

NLCS_DRAINAGE_PUT_DOORSPUITPUT
author of change: Marinus Vonhof
date of change: 2018-11-07
definition: Lijntype: CONTINUOUS / Symbool: 970 - DRAIN_PUT_DOORSPUIT
notation: 1657
author at start life: Marinus Vonhof
date of start life: 2018-10-27
scope note: Collection of facts NLCS
type: Class
subclass of: NLCS_Object
subclass of: Restriction
  author at start life: Marinus Vonhof
  date of start life: 2018-10-27
  on class: Doorspoelput
  on property: is represented by (inverse)
  max qualified cardinality: 1

Grindkoffer
author of change: Marinus Vonhof
author of change: Eric van Gorkom
date of change: 2025-01-16
date of change: 2026-07-13
date of change: 2024-05-13
definition: Een grindkoffer is (meestal) een kuil met worteldoek, gevuld met grind waar regenwater de tijd krijgt om langzaam in de bodem opgenomen te worden
author at start life: Marinus Vonhof
date of start life: 2018-12-05
alternative label: Grindkist
scope note: Collection of facts MDS
type: Class
subclass of: Infiltratiekoffer
subclass of: Restriction
  author of change: Marinus Vonhof
  date of change: 2019-07-10
  author at start life: Marinus Vonhof
  date of start life: 2019-05-15
  on class: Drain
  on property: has as part
  min qualified cardinality: 0
subclass of: Restriction
  on property: heeft Uitvoering
  has value: GevuldMetGrind

Porositeit
label: Porosity @en
author of change: Marinus Vonhof
author of change: Johan Post
date of change: 2024-05-01
date of change: 2019-05-01
definition: De verhouding tussen de (grond)deeltjes en de open ruimten (de poriën)
author at start life: Finy Teitsma (Oranjewoud)
date of start life: 2007-10-25
validity context: 15d
comment: [is aspect]
scope note: Collection of facts MDS
scope note: Collection of facts RRB
scope note: Collection of facts LDR
scope note: Collection of facts HYD
type: Class
subclass of: Kenmerk
subclass of: Restriction
  author of change: Marinus Vonhof
  date of change: 2017-05-20
  author at start life: Nic Roest (Idoro)
  date of start life: 2007-11-29
  on class: Infiltratieput
  on property: has as aspect (inverse)
  max qualified cardinality: 1
subclass of: Restriction
  author at start life: Marinus Vonhof
  date of start life: 2016-04-20
  on class: Drain
  on property: has as aspect (inverse)
  max qualified cardinality: 1
subclass of: Restriction
  author at start life: Marinus Vonhof
  date of start life: 2026-07-26
  on class: Inwinning
  on property: has as aspect
  max qualified cardinality: 1
subclass of: Restriction
  author at start life: Nic Roest (Idoro)
  date of start life: 2007-11-29
  on class: Infiltratiekoffer
  on property: has as aspect (inverse)
  max qualified cardinality: 1
subclass of: Restriction
  author at start life: Nic Roest (Idoro)
  date of start life: 2007-11-29
  on class: Infiltratiekolk
  on property: has as aspect (inverse)
  max qualified cardinality: 1
subclass of: Restriction
  on property: has as value
  all values from: Porositeit (datatype)

NLCS_DRAINAGE
author of change: Marinus Vonhof
date of change: 2018-11-07
definition: Lijntype: RI-DRAINAGE
notation: 1635
author at start life: Marinus Vonhof
date of start life: 2018-10-27
scope note: Collection of facts NLCS
type: Class
subclass of: NLCS_Object
subclass of: Restriction
  author at start life: Marinus Vonhof
  date of start life: 2018-10-27
  on class: Drain
  on property: is represented by (inverse)
  max qualified cardinality: 1

NLCS_DRAINAGE_ALGEMEEN
author of change: Marinus Vonhof
date of change: 2018-11-07
definition: Lijntype: RI-DRAINAGE_ALGEMEEN
notation: 1636
author at start life: Marinus Vonhof
date of start life: 2018-10-27
scope note: Collection of facts NLCS
type: Class
subclass of: NLCS_Object
subclass of: Restriction
  author at start life: Marinus Vonhof
  date of start life: 2018-10-27
  on class: Drain
  on property: is represented by (inverse)
  max qualified cardinality: 1

NLCS_DRAINAGE_DRAIN
author of change: Marinus Vonhof
date of change: 2018-11-07
definition: Lijntype: RI-DRAINAGE
notation: 1638
author at start life: Marinus Vonhof
date of start life: 2018-10-27
scope note: Collection of facts NLCS
type: Class
subclass of: NLCS_Object
subclass of: Restriction
  author at start life: Marinus Vonhof
  date of start life: 2018-10-27
  on class: Drain
  on property: is represented by (inverse)
  max qualified cardinality: 1

Sym_Drain
author of change: Marinus Vonhof
date of change: 2019-10-08
definition: Standaard stijl: Lijntype doorgetrokken, Lijnkleur 0 255 0, Lijndikte 0.4
author at start life: Marinus Vonhof
date of start life: 2018-11-07
scope note: Collection of facts NLCS
type: Class
subclass of: Geo-symbool
subclass of: Restriction
  author at start life: Marinus Vonhof
  date of start life: 2018-11-07
  on class: Drain
  on property: is represented by (inverse)
  max qualified cardinality: 1

Zandkoffer
author of change: Marinus Vonhof
date of change: 2025-01-16
date of change: 2026-07-13
definition: [IMBOR] Een constructie gevuld met zand waar regenwater de tijd krijgt om langzaam in de bodem opgenomen te worden.
author at start life: Marinus Vonhof
date of start life: 2019-07-10
scope note: Collection of facts MDS
type: Class
subclass of: Infiltratiekoffer
subclass of: Restriction
  on property: heeft Uitvoering
  has value: GevuldMetZand

Drainaansluitleiding
definition: Een aansluitleiding met doorlatende wanden bestemd voor het op peil houden van het grondwater
author at start life: Johan Post
date of start life: 2024-05-01
alternative label: Drainage-aansluitleiding
scope note: Collection of facts MDS
scope note: Collection of facts LDR
type: Class
subclass of: Aansluitleiding
subclass of: Restriction
  on property: heeft Functie
  has value: AanvoerVanGrondwater
subclass of: Restriction
  on class: Aansluiting
  on property: has as part (inverse)
  qualified cardinality: 1

Infiltratiestelsel
author of change: Marinus Vonhof
author of change: Eric van Gorkom
date of change: 2025-01-16
date of change: 2019-05-15
date of change: 2022-12-24
definition: Stelsel of systeem bestaande uit infiltratievoorzieningen
author at start life: Marinus Vonhof
date of start life: 2018-12-06
alternative label: Infiltratiesysteem
scope note: Collection of facts BAS
scope note: Collection of facts HYD
type: Class
subclass of: Rioolstelsel
subclass of: Restriction
  author of change: Marinus Vonhof
  date of change: 2019-05-15
  author at start life: Marinus Vonhof
  date of start life: 2018-12-06
  on class: Infiltratieriool
  on property: has as part
  min qualified cardinality: 1
subclass of: Restriction
  author at start life: Marinus Vonhof
  date of start life: 2026-07-16
  on class: Hemelwaterriool
  on property: has as part
  min qualified cardinality: 0
subclass of: Restriction
  author at start life: Marinus Vonhof
  date of start life: 2026-08-04
  on class: Infiltratievoorziening
  on property: has as part
  min qualified cardinality: 0
subclass of: Restriction
  on property: heeft Uitvoering
  has value: GeheelVanVerbondenInfiltratievoorzieningen
subclass of: Restriction
  on property: heeft Functie
  has value: InfiltratieEnTransportVanHemel
subclass of: Restriction
  on class: Goot
  on property: has as part
  min qualified cardinality: 0

Drainagegemaal
author of change: Marinus Vonhof
date of change: 2025-01-16
definition: Een gemaal voor het verpompen van grondwater
author at start life: Marinus Vonhof
date of start life: 2018-05-03
scope note: Collection of facts BAS
scope note: Collection of facts RGM
type: Class
subclass of: Gemaal
subclass of: Restriction
  author at start life: Marinus Vonhof
  date of start life: 2018-05-03
  on class: Drainagestelsel
  on property: has as part (inverse)
  max qualified cardinality: 1
subclass of: Restriction
  on property: heeft Functie
  has value: VerpomptGrondwater

Drainagekoffer
definition: Een koffer gevuld met substraat waar regenwater door de drain opgenomen wordt
author at start life: Marinus Vonhof
date of start life: 2026-07-13
scope note: Collection of facts BAS
type: Class
subclass of: Reservoir
subclass of: Restriction
  on property: heeft Functie
  has value: AfvoerVanHemelwater
subclass of: Restriction
  on class: Drain
  on property: has as part
  min qualified cardinality: 1
subclass of: Restriction
  validity context: *t
  on class: Substraat kern
  on property: has as part
  qualified cardinality: 1

Substraat kern
definition: De inwendige vulling van de constructie
author at start life: Marinus Vonhof
date of start life: 2026-08-05
scope note: Collection of facts MDS
scope note: Collection of facts HYD
type: Class
subclass of: Substraat
subclass of: Restriction
  on property: heeft Toepassing
  has value: VullingVanDeConstructie
subclass of: Restriction
  validity context: *t
  on class: Drainagekoffer
  on property: has as part (inverse)
  qualified cardinality: 1
subclass of: Restriction
  validity context: *t
  on class: Infiltratiekoffer
  on property: has as part (inverse)
  qualified cardinality: 1
subclass of: Restriction
  validity context: *t
  on class: Infiltratiekolk
  on property: has as part (inverse)
  qualified cardinality: 1
subclass of: Restriction
  validity context: *t
  on class: Infiltratieput
  on property: has as part (inverse)
  qualified cardinality: 1

Drainagelaag
author of change: Marinus Vonhof
date of change: 2016-04-20
definition: Over het gehele te draineren oppervlak aangebrachte laag betrekkelijk grof materiaal ten behoeve van horizontale drainage.
author at start life: Finy Teitsma (Oranjewoud)
date of start life: 2007-10-23
scope note: Collection of facts BAS
type: Class
subclass of: Bovengrond
subclass of: Restriction
  author at start life: Marinus Vonhof
  date of start life: 2016-04-20
  on class: Drainagestelsel
  on property: has as part (inverse)
  qualified cardinality: 1
subclass of: Restriction
  on property: heeft Uitvoering
  has value: AangebrachteLaagBetrekkelijkGrofMateriaal
subclass of: Restriction
  on property: heeft Functie
  has value: InzamelingVanGrondwater
subclass of: Restriction
  on property: heeft Functie
  has value: TransportVanGrondwater

Drainageput
author of change: Johan Post
date of change: 2021-10-01
author at start life: Marinus Vonhof
date of start life: 2014-04-11
validity context: 1d 3d 10d
comment: [VervallenLink http://definities.geostandaarden.nl/concepten/imgeo/doc/begrip/drainageput]
see also: [IMGeo:1.0/2007] Put welke toegang geeft naar een poreuze of geperforeerde buisleiding, aangebracht onder de grond om de afwatering van de grond te verbeteren.
scope note: Collection of facts BAS
type: Class
subclass of: Put
subclass of: Restriction
  author at start life: Marinus Vonhof
  date of start life: 2018-10-27
  on class: NLCS_DRAINAGE_PUT
  on property: is represented by
  max qualified cardinality: 1
subclass of: Restriction
  on property: heeft Functie
  has value: InzamelingVanGrondwater
subclass of: Restriction
  on class: Drainagestelsel
  on property: has as part (inverse)
  max qualified cardinality: 1
subclass of: Restriction
  on class: Sym_Drainageput
  on property: is represented by
  max qualified cardinality: 1

NLCS_DRAINAGE_PUT
author of change: Marinus Vonhof
date of change: 2018-11-07
definition: Lijntype: CONTINUOUS / Symbool: 971 - DRAIN_PUT
notation: 1656
author at start life: Marinus Vonhof
date of start life: 2018-10-27
scope note: Collection of facts NLCS
type: Class
subclass of: NLCS_Object
subclass of: Restriction
  author at start life: Marinus Vonhof
  date of start life: 2018-10-27
  on class: Drainageput
  on property: is represented by (inverse)
  max qualified cardinality: 1

Sym_Drainageput
author at start life: Johan Post
date of start life: 2021-10-01
scope note: Collection of facts NLCS
type: Class
subclass of: Geo-symbool
subclass of: Restriction
  author at start life: Marinus Vonhof
  date of start life: 2018-11-07
  on class: Drainageput
  on property: is represented by (inverse)
  max qualified cardinality: 1
subclass of: Restriction
  on class: Infiltratieput
  on property: is represented by (inverse)
  max qualified cardinality: 1

Grondwatersysteem
author of change: Marinus Vonhof
date of change: 2025-01-16
date of change: 2016-04-15
definition: [IMBOR] Een samengesteld systeem voor het beheersen van het grondwaterpeil.
author at start life: Marinus Vonhof
date of start life: 2016-04-15
scope note: Collection of facts BAS
type: Class
subclass of: Systeem
subclass of: Restriction
  author of change: Marinus Vonhof
  date of change: 2013-10-02
  author at start life: Finy Teitsma (Oranjewoud)
  date of start life: 2007-10-23
  on class: Stedelijk gebied
  on property: has as part (inverse)
  max qualified cardinality: 1
subclass of: Restriction
  author of change: Marinus Vonhof
  date of change: 2014-09-05
  author at start life: Finy Teitsma (Oranjewoud)
  date of start life: 2006-11-29
  on class: Drainagestelsel
  on property: has as part
  min qualified cardinality: 0
subclass of: Restriction
  author at start life: Marinus Vonhof
  date of start life: 2013-12-06
  on class: Grondwatermeetnet
  on property: has as part
  min qualified cardinality: 0
subclass of: Restriction
  on property: heeft Toepassing
  has value: BeheersingVanGrondwaterpeil

Inspectieput
label: Manhole @en
author of change: Wouter van Riel
date of change: 2024-04-22
definition: Een rioolput die voor mens of apparatuur vanaf het maaiveld toegang biedt tot de aangesloten rioolleidingen.
definition: [EN 16323:2014] structure with a removable cover, constructed on a drain or sewer to permit entry by personnel @en
definition: [NEN-EN 752:2008] (Ongeldig) put met een afneembaar deksel, gekoppeld aan een aansluitleiding of riool waarmee reinigings- en inspectieapparatuur vanaf de oppervlakte kan worden ingebracht, maar die geen toegang biedt voor personeel
notation: INS
author at start life: Finy Teitsma (Oranjewoud)
date of start life: 2006-05-23
see also: [IMGeo:1.0/2007] Put die toegang geeft tot een (riool)leiding.
see also: [IRIS-RIOKEN:2012] Constructie toeganggevend tot het rioolstelsel.
alternative label: Controleput
scope note: Collection of facts MDS
scope note: Collection of facts RRB
scope note: Collection of facts LDR
scope note: Collection of facts REV
scope note: Collection of facts HYD
type: Class
subclass of: Rioolput
subclass of: Restriction
  author of change: Marinus Vonhof
  date of change: 2019-05-15
  author at start life: Finy Teitsma (Oranjewoud)
  date of start life: 2006-07-12
  on class: Inlaat rioolput
  on property: has as part
  min qualified cardinality: 0
subclass of: Restriction
  author of change: Marinus Vonhof
  date of change: 2015-04-21
  author at start life: Marinus Vonhof
  date of start life: 2014-12-02
  on class: Vrijverval transportstelsel
  on property: has as part (inverse)
  qualified cardinality: 1
subclass of: Restriction
  author of change: Marinus Vonhof
  date of change: 2018-12-11
  author at start life: Marinus Vonhof
  date of start life: 2012-04-29
  on class: Zonk
  on property: has as part
  max qualified cardinality: 1
subclass of: Restriction
  author at start life: Marinus Vonhof
  date of start life: 2018-10-27
  on class: NLCS_GWA_RIOOLPUT_INSPECTIEPUT
  on property: is represented by
  max qualified cardinality: 1
subclass of: Restriction
  author at start life: Marinus Vonhof
  date of start life: 2018-10-27
  on class: NLCS_HWA_RIOOLPUT_INSPECTIEPUT
  on property: is represented by
  max qualified cardinality: 1
subclass of: Restriction
  author at start life: Marinus Vonhof
  date of start life: 2018-10-27
  on class: NLCS_ITR_RIOOLPUT_INSPECTIEPUT
  on property: is represented by
  max qualified cardinality: 1
subclass of: Restriction
  author at start life: Marinus Vonhof
  date of start life: 2018-10-27
  on class: NLCS_PERSLEIDING_RIOOLPUT_INSPECTIEPUT
  on property: is represented by
  max qualified cardinality: 1
subclass of: Restriction
  author at start life: Marinus Vonhof
  date of start life: 2018-10-27
  on class: NLCS_SWA_RIOOLPUT_INSPECTIEPUT
  on property: is represented by
  max qualified cardinality: 1
subclass of: Restriction
  author at start life: Marinus Vonhof
  date of start life: 2018-10-27
  on class: NLCS_VACUUMLEIDING_RIOOLPUT_INSPECTIEPUT
  on property: is represented by
  max qualified cardinality: 1
subclass of: Restriction
  author at start life: Marinus Vonhof
  date of start life: 2018-10-27
  on class: NLCS_VWA_RIOOLPUT_INSPECTIEPUT
  on property: is represented by
  max qualified cardinality: 1
subclass of: Restriction
  author at start life: Marinus Vonhof
  date of start life: 2018-11-10
  on class: Sym_Inspectieput
  on property: is represented by
  max qualified cardinality: 1
subclass of: Restriction
  author at start life: Marinus Vonhof
  date of start life: 2026-07-24
  on class: Infiltratievoorziening
  on property: has as part (inverse)
  max qualified cardinality: 1
subclass of: Restriction
  on property: heeft Functie
  has value: BeluchtenOfVentileren
subclass of: Restriction
  on property: heeft Functie
  has value: InzamelingVanAfvalwater
subclass of: Restriction
  on property: heeft Functie
  has value: ToegangGevenTotHetRioolstelsel
subclass of: Restriction
  on property: heeft Functie
  has value: ToegangVerschaffen
subclass of: Restriction
  on property: heeft Uitvoering
  has value: ToegankelijkVoorInspectie EnReinigingsapparatuur
subclass of: Restriction
  on property: heeft Uitvoering
  has value: VerwijderbaarDeksel
subclass of: Restriction
  on class: Drainagestelsel
  on property: has as part (inverse)
  max qualified cardinality: 1

Lozingsput
author of change: Marinus Vonhof
date of change: 2016-04-15
definition: Een put waarop een rioolleiding is aangesloten waarmee het afvalwater het rioolstelsel verlaat naar, of ontvangt uit, een ander rioolstelsel
author at start life: Nic Roest (Idoro)
date of start life: 2006-03-23
alternative label: Ontvangstput
scope note: Collection of facts MDS
scope note: Collection of facts REV
scope note: Collection of facts HYD
type: Class
subclass of: Rioolput
subclass of: Restriction
  author at start life: Marinus Vonhof
  date of start life: 2018-11-07
  on class: Sym_Lozingsput
  on property: is represented by
  max qualified cardinality: 1
subclass of: Restriction
  on property: heeft Uitvoering
  has value: NaarAnderRioolstelsel
subclass of: Restriction
  on property: heeft Functie
  has value: OvertolligAfvalwaterLatenWegstromen
subclass of: Restriction
  on class: Drainagestelsel
  on property: has as part (inverse)
  max qualified cardinality: 1

Verzameldrain
definition: Een leiding met ondoorlatende wand die het door drains aangevoerde water verzamelt en transporteert, zonder zelf water uit de omliggende bodem op te nemen.
author at start life: Johan Post
date of start life: 2026-05-19
type: Class
subclass of: Vrijverval rioolleiding
subclass of: Restriction
  on property: heeft Functie
  has value: TransportVanGrondwater
subclass of: Restriction
  on class: Drainagestelsel
  on property: has as part (inverse)
  qualified cardinality: 1

Drainagewater
definition: [NEN 3300:1996] Grondwater, ingezameld middels een ingegraven doorlatend buizensysteem
author at start life: Marinus Vonhof
date of start life: 2022-09-30
validity context: *d
scope note: Collection of facts BAS
type: Class
subclass of: NEN 3300 Term

Drainputdeksel
author of change: Marinus Vonhof
date of change: 2025-01-16
definition: [IMBOR] Een putdeksel met openingen aan het oppervlak zodat afval- of hemelwater er ten alle tijden in kan lopen.
author at start life: Marinus Vonhof
date of start life: 2018-12-06
scope note: Collection of facts REV
scope note: Collection of facts BAS
type: Class
subclass of: Deksel
subclass of: Restriction
  on property: heeft Toepassing
  has value: Drainput

Drempelbreedte
definition: De ontwikkelde lengte van de overlaat, waarover het afvalwater overstort, gemeten haaks op de stroomrichting
definition: [NEN 3300:1996] Overstortbreedte is synoniem van drempelbreedte
definition: [NEN 3300:1996] de ontwikkelde lengte van de overlaat waarover het water overstort, gemeten haaks op de stroomrichting
author at start life: Marinus Vonhof
date of start life: 2017-05-17
units of measurements: mm
alternative label: Overstortbreedte
comment: [is aspect]
scope note: Collection of facts MDS
scope note: Collection of facts REV
scope note: Collection of facts HYD
type: Class
subclass of: Breedte
subclass of: Restriction
  author at start life: Finy Teitsma (Oranjewoud)
  date of start life: 2006-02-25
  validity context: 5t 11t
  on class: Overstortdrempel
  on property: has as aspect (inverse)
  max qualified cardinality: 1
subclass of: Restriction
  author at start life: Marinus Vonhof
  date of start life: 2019-03-20
  validity context: 5t 11t
  on class: Stuwmuur
  on property: has as aspect (inverse)
  max qualified cardinality: 1
subclass of: Restriction
  author at start life: Marinus Vonhof
  date of start life: 2024-05-16
  on class: Inwinning
  on property: has as aspect
  max qualified cardinality: 1
subclass of: Restriction
  on property: has as value
  all values from: integer

Drempeldikte
author of change: Marinus Vonhof
date of change: 2023-01-13
definition: Dikte van de drempel waarover het water overstort
author at start life: Johan Post
date of start life: 2022-11-25
units of measurements: mm
comment: [is aspect]
scope note: Collection of facts BAS
type: Class
subclass of: Dikte
subclass of: Restriction
  on property: has as value
  all values from: integer
subclass of: Restriction
  on class: Overstortdrempel
  on property: has as aspect (inverse)
  max qualified cardinality: 1
subclass of: Restriction
  on class: Stuwmuur
  on property: has as aspect (inverse)
  max qualified cardinality: 1

Drempelniveau
definition: De hoogte van de drempel
definition: [NEN 3300:1996] Drempelhoogte is synoniem van drempelniveau
definition: [NEN 3300:1996] de hoogte van de bovenkant van de drempel ten opzichte van een referentiepeil
author at start life: Marinus Vonhof
date of start life: 2016-04-24
units of measurements: m
alternative label: Drempelhoogte
alternative label: Drempelpeil
comment: [is aspect]
scope note: Collection of facts MDS
scope note: Collection of facts REV
scope note: Collection of facts HYD
type: Class
subclass of: Hoogte t.o.v. NAP
subclass of: Restriction
  author of change: Marinus Vonhof
  date of change: 2019-09-02
  author at start life: Finy Teitsma (Oranjewoud)
  date of start life: 2006-02-25
  on class: Overstortdrempel
  on property: has as aspect (inverse)
  qualified cardinality: 1
subclass of: Restriction
  author at start life: Marinus Vonhof
  date of start life: 2015-10-30
  on class: Inwinning
  on property: has as aspect
  max qualified cardinality: 1
subclass of: Restriction
  author at start life: Marinus Vonhof
  date of start life: 2019-03-20
  on class: Stuwmuur
  on property: has as aspect (inverse)
  qualified cardinality: 1
subclass of: Restriction
  on property: has as value
  all values from: decimal

Drinkwater
author of change: Johan Post
date of change: 2022-11-25
definition: [Drinkwaterwet] Water bestemd of mede bestemd om te drinken, te koken of voedsel te bereiden dan wel voor andere huishoudelijke doeleinden, met uitzondering van warm tapwater, dat door middel van leidingen ter beschikking wordt gesteld aan consumenten of andere afnemers.
author at start life: Marinus Vonhof
date of start life: 2017-05-03
scope note: Collection of facts BAS
type: Class
subclass of: Water

Droogweerafvoer
label: Dry weather flow @en
author of change: Wouter van Riel
date of change: 2022-09-26
definition: [EN 16323:2014] flow not affected by rainfall or snow melt @en
definition: [NEN 3300:1996] De hoeveelheid afvalwater die per tijdseenheid in een droogweersituatie via het rioolstelsel wordt afgevoerd
definition: [NEN-EN 752:2008] afvoer die niet wordt beïnvloed door regenval of smeltwater [EN 1085:2007, definitie 3050]
notation: DWA
author at start life: Marinus Vonhof
date of start life: 2014-11-29
comment: 20151014: NEN3300-definitie aangepast
see also: [IRIS-RIOKEN:2012] Het water dat bij droog weer via het rioolstelsel binnen 1 rioleringsgebied moet worden afgevoerd. Dit bestaat uit huishoudelijk- en industrieel afvalwater en lekwater.
alternative label: DWA
alternative label: Vuilwater
scope note: Collection of facts BAS
scope note: Collection of facts DMO
type: Class
subclass of: Afvalwater

Drukklasse
author of change: Marinus Vonhof
date of change: 2025-01-16
date of change: 2024-07-16
date of change: 2020-04-17
definition: De maximale druk die de buis van een bepaalde klasse kan weerstaan bij een bepaalde temperatuur. De waarde is de druk nominaal (PN) uitgedrukt in bar (1 bar = 1,02 kg/cm2). Bijvoorbeeld als de waarde 11 is ingevuld, dan is de drukklasse PN11Bar.
definition: [IMBOR] Klasse voor de maximaal toelaatbare inwendige druk, uitgedrukt in PN bij temperaturen tot 20 gr C.
notation: PN
author at start life: Nic Roest (Idoro)
date of start life: 2006-05-23
validity context: 15d
alternative label: Pression nominale
comment: [is aspect]
scope note: Collection of facts BAS
scope note: Collection of facts PLI
scope note: Collection of facts DMO
type: Class
subclass of: Kenmerk
subclass of: Restriction
  author at start life: Marinus Vonhof
  date of start life: 2024-05-16
  on class: Rioolleiding
  on property: has as aspect (inverse)
  max qualified cardinality: 1
subclass of: Restriction
  author at start life: Marinus Vonhof
  date of start life: 2024-05-16
  on class: Transportleiding
  on property: has as aspect (inverse)
  max qualified cardinality: 1
subclass of: Restriction
  on property: has as value
  all values from: decimal

Drukleiding
author of change: Marinus Vonhof
date of change: 2024-05-16
date of change: 2021-08-06
definition: Leiding bestemd voor de inzameling en het transport van huishoudelijk- en bedrijfsafvalwater, niet zijnde neerslag waarin het afvalwater door middel van overdruk wordt getransporteerd
author at start life: Marinus Vonhof
date of start life: 2013-09-14
validity context: 1d
scope note: Collection of facts MDS
scope note: Collection of facts REV
scope note: Collection of facts RGM
type: Class
subclass of: Mechanische rioolleiding
subclass of: Restriction
  author of change: Marinus Vonhof
  date of change: 2020-04-17
  author at start life: Marinus Vonhof
  date of start life: 2014-04-30
  on class: Drukriolering
  on property: has as part (inverse)
  max qualified cardinality: 1
subclass of: Restriction
  author of change: Marinus Vonhof
  date of change: 2021-08-05
  author at start life: Marinus Vonhof
  date of start life: 2020-04-17
  on class: Hybride drukriolering
  on property: has as part (inverse)
  max qualified cardinality: 1
subclass of: Restriction
  author at start life: Marinus Vonhof
  date of start life: 2018-11-07
  on class: Sym_Drukleiding
  on property: is represented by
  max qualified cardinality: 1
subclass of: Restriction
  on property: heeft Functie
  has value: TransportVanVuilwater

Mechanische rioolleiding
author of change: Marinus Vonhof
author of change: Johan Post
author of change: Wouter van Riel
date of change: 2016-08-26
date of change: 2024-04-23
date of change: 2024-05-04
date of change: 2026-05-19
definition: Een gesloten rioolleiding waarin het afvalwater door middel van onder-/overdruk wordt getransporteerd.
author at start life: Marinus Vonhof
author at start life: Finy Teitsma (Oranjewoud)
date of start life: 2006-02-20
validity context: *f 11d 12d 13d
see also: [IMKL:1.1/2008] Riolering waarbij het transport plaatsvindt door overdruk (uit NEN 3300, Buitenriolering).
scope note: Collection of facts TOP
type: Class
subclass of: Rioolleiding
subclass of: Restriction
  author of change: Marinus Vonhof
  date of change: 2015-02-28
  date of change: 2023-01-10
  author at start life: Finy Teitsma (Oranjewoud)
  date of start life: 2006-05-01
  on class: Ontluchter
  on property: has as part
  min qualified cardinality: 0
subclass of: Restriction
  author of change: Marinus Vonhof
  date of change: 2018-12-05
  author at start life: Finy Teitsma (Oranjewoud)
  date of start life: 2006-05-01
  on class: Ontspanningsventiel
  on property: has as part
  min qualified cardinality: 0
subclass of: Restriction
  author of change: Marinus Vonhof
  date of change: 2017-10-12
  author at start life: Marinus Vonhof
  date of start life: 2014-12-02
  on class: Mangat
  on property: has as part
  min qualified cardinality: 0
subclass of: Restriction
  author of change: Marinus Vonhof
  date of change: 2026-07-23
  author at start life: Marinus Vonhof
  date of start life: 2018-12-05
  on class: Voorzorgsmaatregel-document
  on property: is represented by
  max qualified cardinality: 1
subclass of: Restriction
  on property: heeft Structuur
  has value: Gesloten
subclass of: Restriction
  on property: heeft Technologie
  has value: TransportOnderOverdrukOfOnderdruk

Sym_Drukleiding
author of change: Johan Post
date of change: 2021-10-01
definition: Standaard stijl: Lijntype doorgetrokken, Lijnkleur 255 0 255, Lijndikte 1.0
author at start life: Marinus Vonhof
date of start life: 2018-11-07
scope note: Collection of facts NLCS
type: Class
subclass of: Geo-symbool
subclass of: Restriction
  author at start life: Marinus Vonhof
  date of start life: 2018-11-07
  on class: Drukleiding
  on property: is represented by (inverse)
  max qualified cardinality: 1

Drukmeter
author of change: Wouter van Riel
date of change: 2024-04-22
definition: Een instrument dat de druk bij een pomp meet.
author at start life: Finy Teitsma (Oranjewoud)
date of start life: 2007-10-23
scope note: Collection of facts BAS
type: Class
subclass of: Meetinstrument
subclass of: Restriction
  author at start life: Wouter van Riel
  date of start life: 2024-04-22
  on class: Bouwwerk
  on property: has as part (inverse)
  max qualified cardinality: 1
subclass of: Restriction
  author at start life: Wouter van Riel
  date of start life: 2024-04-22
  on class: Compartiment
  on property: has as part (inverse)
  max qualified cardinality: 1
subclass of: Restriction
  author at start life: Wouter van Riel
  date of start life: 2024-04-22
  on class: Put
  on property: has as part (inverse)
  max qualified cardinality: 1
subclass of: Restriction
  on property: heeft Functie
  has value: MetenWaterdruk
subclass of: Restriction
  on class: Sym_Drukmeter
  on property: is represented by
  max qualified cardinality: 1

Sym_Drukmeter
author at start life: Johan Post
date of start life: 2021-10-01
scope note: Collection of facts NLCS
type: Class
subclass of: Geo-symbool
subclass of: Restriction
  author at start life: Marinus Vonhof
  date of start life: 2018-11-07
  on class: Drukmeter
  on property: is represented by (inverse)
  max qualified cardinality: 1

Sym_Drukriolering
author of change: Marinus Vonhof
date of change: 2025-01-20
author at start life: Johan Post
date of start life: 2021-10-01
scope note: Collection of facts NLCS
type: Class
subclass of: Geo-symbool
subclass of: Restriction
  author at start life: Marinus Vonhof
  date of start life: 2018-11-07
  on class: Drukriolering
  on property: is represented by (inverse)
  max qualified cardinality: 1

Drukrioleringspomp
author of change: Marinus Vonhof
date of change: 2025-01-16
date of change: 2015-07-28
definition: Een pomp die toegepast wordt in een pompunit
author at start life: Marinus Vonhof
date of start life: 2014-05-03
scope note: Collection of facts BAS
scope note: Collection of facts HYD
scope note: Collection of facts RGM
scope note: Collection of facts DMO
type: Class
subclass of: Pomp
subclass of: Restriction
  author of change: Marinus Vonhof
  date of change: 2015-06-01
  author at start life: Marinus Vonhof
  date of start life: 2014-05-03
  on class: Pompunit
  on property: has as part (inverse)
  qualified cardinality: 1
subclass of: Restriction
  on property: heeft Toepassing
  has value: DeelVanPompunit

Dubbelkerende spindelschuif
author of change: Marinus Vonhof
date of change: 2025-01-16
definition: [IMBOR] Een mechanische afsluiter die bestaat uit een naar beneden schuifbare plaat op basis van een afstelbare metalen staaf met draad (spindel) die de doorstroomopening in beide richtingen af kan sluiten.
author at start life: Marinus Vonhof
date of start life: 2019-05-15
scope note: Collection of facts BAS
scope note: Collection of facts PLI
scope note: Collection of facts HYD
scope note: Collection of facts DMO
type: Class
subclass of: Schuif
subclass of: Restriction
  author at start life: Marinus Vonhof
  date of start life: 2019-05-15
  on class: Spindel
  on property: has as part
  qualified cardinality: 1
subclass of: Restriction
  on property: heeft Functie
  has value: AfsluitenInTweeStroomrichtingen

Schuif
author of change: Marinus Vonhof
date of change: 2025-01-16
definition: [IMBOR] Een ijzeren staaf waarmee een bewegend onderdeel van een object afgesloten kan worden.
author at start life: Wouter van Riel
date of start life: 2024-04-20
scope note: Collection of facts BAS
scope note: Collection of facts PLI
scope note: Collection of facts HYD
scope note: Collection of facts DMO
type: Class
subclass of: Mechanische afsluiter
subclass of: Restriction
  author of change: Marinus Vonhof
  date of change: 2024-05-17
  author at start life: Wouter van Riel
  date of start life: 2024-04-20
  on class: Bergbezinkbassin
  on property: has as part (inverse)
  max qualified cardinality: 1
subclass of: Restriction
  author of change: Marinus Vonhof
  date of change: 2024-05-17
  author at start life: Wouter van Riel
  date of start life: 2024-04-20
  on class: Ledigingsvoorziening
  on property: has as part (inverse)
  max qualified cardinality: 1
subclass of: Restriction
  author of change: Marinus Vonhof
  date of change: 2024-05-17
  author at start life: Wouter van Riel
  date of start life: 2024-04-20
  on class: Spoelvoorziening
  on property: has as part (inverse)
  max qualified cardinality: 1
subclass of: Restriction
  author at start life: Wouter van Riel
  date of start life: 2024-04-20
  validity context: *t
  on class: Spindel
  on property: has as part
  qualified cardinality: 1
subclass of: Restriction
  on property: heeft Uitvoering
  has value: SchuifbarePlaat

Spindel
author of change: Marinus Vonhof
date of change: 2025-01-16
definition: [IMBOR] Object dat wordt gebruikt om een roterende beweging om te zetten naar een lineaire beweging en die in het bijzonder geschikt is om met een elektromotor aan te drijven.
author at start life: Marinus Vonhof
date of start life: 2013-02-05
scope note: Collection of facts BAS
scope note: Collection of facts PLI
type: Class
subclass of: Afsluiteraandrijving
subclass of: Restriction
  author at start life: Marinus Vonhof
  date of start life: 2019-05-15
  on class: Dubbelkerende spindelschuif
  on property: has as part (inverse)
  qualified cardinality: 1
subclass of: Restriction
  author at start life: Marinus Vonhof
  date of start life: 2019-05-15
  on class: Enkelkerende spindelschuif
  on property: has as part (inverse)
  qualified cardinality: 1
subclass of: Restriction
  on property: heeft Functie
  has value: RotatieOmzettenNaarTranslatie

Duiker
author of change: Marinus Vonhof
date of change: 2017-05-31
definition: Een leiding die oppervlaktewater-elementen verbindt
author at start life: Marinus Vonhof
date of start life: 2012-04-29
see also: [IHW:20130706] Een kokervormige constructie met als doel de wederzijdse verbinding tussen oppervlaktewater te waarborgen
see also: [IMGeo:1.0/2007] Kunstmatige doorstroomopening onder een rivier; kanaal weg enz., die een functie vervult in de waterhuishouding.
scope note: Collection of facts MDS
scope note: Collection of facts REV
type: Class
subclass of: Leiding
subclass of: Restriction
  author of change: Marinus Vonhof
  date of change: 2019-07-10
  author at start life: Marinus Vonhof
  date of start life: 2016-04-29
  on class: Minimaal doorstroomoppervlak
  on property: has as aspect
  max qualified cardinality: 1
subclass of: Restriction
  author at start life: Marinus Vonhof
  date of start life: 2012-04-29
  validity context: *t
  on class: Oppervlaktewatersysteem
  max qualified cardinality: 1
subclass of: Restriction
  author at start life: Marinus Vonhof
  date of start life: 2018-12-12
  on class: Duikerstelsel
  on property: has as part (inverse)
  max qualified cardinality: 1
subclass of: Restriction
  author at start life: Marinus Vonhof
  date of start life: 2019-05-15
  on class: Profiel leiding
  on property: has as aspect
  max qualified cardinality: 1
subclass of: Restriction
  author at start life: Marinus Vonhof
  date of start life: 2019-10-08
  on class: Sym_Duiker
  on property: is represented by
  max qualified cardinality: 1
subclass of: Restriction
  on property: heeft Functie
  has value: VerbindingTussenOppervlaktewater

Minimaal doorstroomoppervlak
author of change: Marinus Vonhof
date of change: 2019-07-10
definition: Minimaal benodigd doorstroomoppervlak voor goed functioneren
author at start life: Marinus Vonhof
date of start life: 2016-04-29
units of measurements: m2
validity context: 15d
comment: [is aspect]
scope note: Collection of facts BAS
type: Class
subclass of: Kenmerk
subclass of: Restriction
  author of change: Marinus Vonhof
  date of change: 2019-07-10
  author at start life: Marinus Vonhof
  date of start life: 2016-04-29
  on class: Duiker
  on property: has as aspect (inverse)
  max qualified cardinality: 1
subclass of: Restriction
  on property: has as value
  all values from: decimal

Duikerstelsel
author of change: Marinus Vonhof
date of change: 2025-01-16
definition: Een stelsel van onderling verbonden duikers
author at start life: Marinus Vonhof
date of start life: 2018-12-05
validity context: 10d
scope note: Collection of facts BAS
type: Class
subclass of: Stelsel
subclass of: Restriction
  author at start life: Marinus Vonhof
  date of start life: 2018-12-12
  on class: Duiker
  on property: has as part
  min qualified cardinality: 1
subclass of: Restriction
  on property: heeft Uitvoering
  has value: GeheelVanVerbondenDuikers

Profiel leiding
author of change: Marinus Vonhof
date of change: 2019-07-11
definition: Een vlak dat de doorsnede dwars op de richting beginpunt naar eindpunt van een gesloten leiding beschrijft. Het bestaat uit minimaal 4 x/y waarden in [m], decimaalteken (punt) toegestaan. De eerste coördinaat is gelijk aan de laatste coördinaat
author at start life: Marinus Vonhof
date of start life: 2019-05-15
units of measurements: gml
comment: [is aspect]
scope note: Collection of facts BAS
scope note: Collection of facts HYD
type: Class
subclass of: Vlak
subclass of: Restriction
  author at start life: Marinus Vonhof
  date of start life: 2019-05-15
  on class: Duiker
  on property: has as aspect (inverse)
  max qualified cardinality: 1
subclass of: Restriction
  author at start life: Marinus Vonhof
  date of start life: 2019-05-15
  on class: Vrijverval rioolleiding
  on property: has as aspect (inverse)
  max qualified cardinality: 1
subclass of: Restriction
  author at start life: Marinus Vonhof
  date of start life: 2019-05-15
  on class: Vrijverval transportleiding
  on property: has as aspect (inverse)
  max qualified cardinality: 1
subclass of: Restriction
  on property: has as value
  all values from: gmlLiteral

Sym_Duiker
definition: Standaard stijl: Lijntype doorgetrokken, Lijnkleur 0 255 255, Lijndikte 1.0
author at start life: Marinus Vonhof
date of start life: 2019-10-08
scope note: Collection of facts NLCS
type: Class
subclass of: Geo-symbool
subclass of: Restriction
  author at start life: Marinus Vonhof
  date of start life: 2019-10-08
  on class: Duiker
  on property: is represented by (inverse)
  max qualified cardinality: 1

Duikerput
author of change: Johan Post
date of change: 2026-05-11
definition: Put welke toegang geeft naar een duiker.
author at start life: Johan Post
date of start life: 2024-05-01
scope note: Collection of facts MDS
type: Class
subclass of: Put
subclass of: Restriction
  author at start life: Marinus Vonhof
  date of start life: 2012-04-29
  on class: Duikerstelsel
  on property: has as part (inverse)
  max qualified cardinality: 1
subclass of: Restriction
  on property: heeft Functie
  has value: DuikersAansluiten
subclass of: Restriction
  on class: Roosterdeksel
  on property: has as part
  max qualified cardinality: 1

Roosterdeksel
definition: Een deksel spijlen of sleuven die wordt toegepast om doorlaat van water of lucht mogelijk te maken, terwijl het toegang, instroom of doorgang van ongewenste objecten beperkt of voorkomt@nl}
author at start life: Johan Post
date of start life: 2026-08-12
alternative label: Waaierdeksel
scope note: Collection of facts BAS
type: Class
subclass of: Deksel
subclass of: Restriction
  on property: heeft Uitvoering
  has value: Doorlatend
subclass of: Restriction
  on class: Duikerput
  on property: has as part (inverse)
  max qualified cardinality: 1
subclass of: Restriction
  on class: Ontluchtingsunit
  on property: has as part
  max qualified cardinality: 1
subclass of: Restriction
  on class: Opvangput
  on property: has as part (inverse)
  max qualified cardinality: 1
subclass of: Restriction
  on class: Rioolput
  on property: has as part (inverse)
  max qualified cardinality: 1

Duikschot
definition: Constructie die verhindert dat opdrijvend materiaal dat zich aan het oppervlak heeft verzameld, wordt meegesleurd over de overstortrand.
author at start life: Marinus Vonhof
date of start life: 2013-10-01
validity context: 10d
alternative label: Drijfschot
scope note: Collection of facts BAS
type: Class
subclass of: Constructieonderdeel
subclass of: Restriction
  author of change: Finy Teitsma (Oranjewoud)
  date of change: 2007-11-29
  author at start life: Finy Teitsma (Oranjewoud)
  date of start life: 2006-07-12
  on class: Overstortput
  on property: has as part (inverse)
  max qualified cardinality: 1
subclass of: Restriction
  author of change: Marinus Vonhof
  date of change: 2016-04-15
  author at start life: Marinus Vonhof
  date of start life: 2013-10-01
  on class: Verbeterde overstortput
  on property: has as part (inverse)
  max qualified cardinality: 1
subclass of: Restriction
  author at start life: Marinus Vonhof
  date of start life: 2015-05-29
  on class: Overstortconstructie
  on property: has as part (inverse)
  max qualified cardinality: 1
subclass of: Restriction
  on property: heeft Functie
  has value: VerhinderenDatOpdrijvendMateriaalAfstroomt

Verbeterde overstortput
definition: [NEN 3300:1996] een overstortput waarbij duikschotten en een langere drempel zijn toegepast en de inhoud van de put voor de drempel is vergroot met het doel de vuiluitworp te beperken
author at start life: Marinus Vonhof
date of start life: 2012-04-29
scope note: Collection of facts MDS
scope note: Collection of facts HYD
scope note: Collection of facts DMO
type: Class
subclass of: Externe overstortput
subclass of: Restriction
  author of change: Marinus Vonhof
  date of change: 2016-04-15
  author at start life: Marinus Vonhof
  date of start life: 2013-10-01
  on class: Duikschot
  on property: has as part
  min qualified cardinality: 1
subclass of: Restriction
  on property: heeft Uitvoering
  has value: LangereDrempel
subclass of: Restriction
  on property: heeft Uitvoering
  has value: VergroteInhoudVoorDeDrempel
subclass of: Restriction
  on property: heeft Doel
  has value: VerminderenVuilbelastingVanOppervlaktewater

DWA perceelaansluitleiding
author of change: Marinus Vonhof
author of change: Johan Post
date of change: 2026-05-01
date of change: 2016-04-25
date of change: 2026-05-18
definition: Transport van vuilwater vanaf het perceel
author at start life: Marinus Vonhof
date of start life: 2013-02-05
alternative label: Vuilwaterperceelaansluitleiding
scope note: Collection of facts MDS
type: Class
subclass of: Perceelaansluitleiding
subclass of: Restriction
  author at start life: Marinus Vonhof
  date of start life: 2018-10-27
  on class: NLCS_VWA_HUISAANSLUITING
  on property: is represented by
  max qualified cardinality: 1
subclass of: Restriction
  author at start life: Marinus Vonhof
  date of start life: 2018-10-27
  on class: NLCS_VWA_PERCEELAANSLUITING
  on property: is represented by
  max qualified cardinality: 1
subclass of: Restriction
  author at start life: Marinus Vonhof
  date of start life: 2018-11-07
  on class: Sym_Perceelaansluitleiding
  on property: is represented by
  max qualified cardinality: 1
subclass of: Restriction
  author at start life: Marinus Vonhof
  date of start life: 2019-10-08
  on class: Sym_DwaPerceelaansluitleiding
  on property: is represented by
  max qualified cardinality: 1
subclass of: Restriction
  on property: heeft Functie
  has value: AanvoerVanVuilwater

NLCS_VWA_HUISAANSLUITING
author of change: Marinus Vonhof
date of change: 2018-11-07
definition: Lijntype: RI-VWA_HUISAANSLUITING
notation: 2227
author at start life: Marinus Vonhof
date of start life: 2018-10-27
scope note: Collection of facts NLCS
type: Class
subclass of: NLCS_Object
subclass of: Restriction
  author at start life: Marinus Vonhof
  date of start life: 2018-10-27
  on class: DWA perceelaansluitleiding
  on property: is represented by (inverse)
  max qualified cardinality: 1

NLCS_VWA_PERCEELAANSLUITING
author of change: Marinus Vonhof
date of change: 2018-11-07
definition: Lijntype: RI-VWA_PERCEELAANSLUITING
notation: 2246
author at start life: Marinus Vonhof
date of start life: 2018-10-27
scope note: Collection of facts NLCS
type: Class
subclass of: NLCS_Object
subclass of: Restriction
  author at start life: Marinus Vonhof
  date of start life: 2018-10-27
  on class: DWA perceelaansluitleiding
  on property: is represented by (inverse)
  max qualified cardinality: 1

Sym_Perceelaansluitleiding
author of change: Marinus Vonhof
date of change: 2019-10-08
definition: Standaard stijl: Lijntype doorgetrokken, Lijnkleur 255 191 0, Lijndikte 0.4
author at start life: Marinus Vonhof
date of start life: 2018-11-07
scope note: Collection of facts NLCS
type: Class
subclass of: Geo-symbool
subclass of: Restriction
  author at start life: Marinus Vonhof
  date of start life: 2018-11-07
  on class: DWA perceelaansluitleiding
  on property: is represented by (inverse)
  max qualified cardinality: 1
subclass of: Restriction
  author at start life: Marinus Vonhof
  date of start life: 2018-11-07
  on class: Gemengde perceelaansluitleiding
  on property: is represented by (inverse)
  max qualified cardinality: 1
subclass of: Restriction
  author at start life: Marinus Vonhof
  date of start life: 2018-11-07
  on class: HWA perceelaansluitleiding
  on property: is represented by (inverse)
  max qualified cardinality: 1
subclass of: Restriction
  author at start life: Marinus Vonhof
  date of start life: 2018-11-07
  on class: Perceelaansluitleiding
  on property: is represented by (inverse)
  max qualified cardinality: 1

Sym_DwaPerceelaansluitleiding
author of change: Johan Post
date of change: 2021-10-01
definition: Standaard stijl: Lijntype doorgetrokken, Lijnkleur 255 0 0, Lijndikte 0.4
author at start life: Marinus Vonhof
date of start life: 2019-10-08
scope note: Collection of facts NLCS
type: Class
subclass of: Geo-symbool
subclass of: Restriction
  author at start life: Marinus Vonhof
  date of start life: 2019-10-08
  on class: DWA perceelaansluitleiding
  on property: is represented by (inverse)
  max qualified cardinality: 1

Edge
author of change: Marinus Vonhof
date of change: 2020-11-24
definition: Wiskundige term (engels) voor zijde, kant, boog, tak
author at start life: Marinus Vonhof
date of start life: 2011-12-15
alternative label: Zijde
scope note: Collection of facts TOP
type: Class
subclass of: Topologisch element

Topologisch element
author of change: Marinus Vonhof
date of change: 2025-01-16
date of change: 2016-11-09
definition: [Gellish] Is a configuration that indicates how items are connected or positioned relative to each other. The topology in terms of connections usually doesn't change when the positions of the items change. @en
definition: [IMBOR] Een configuratie waarin vastgelegd wordt hoe objecten verbonden zijn of hoe ze relatief tot elkaar gepositioneerd zijn.
author at start life: Marinus Vonhof
date of start life: 2013-10-04
validity context: *f 15d
scope note: Collection of facts TOP
type: Class

Effluent
definition: [NEN 3300:1996] (Gedeeltelijk) gezuiverd water, uitstromend uit een afvalwaterzuiveringsinrichting
author at start life: Marinus Vonhof
date of start life: 2022-09-30
validity context: *d
scope note: Collection of facts BAS
type: Class
subclass of: NEN 3300 Term

Einddatum
author of change: Marinus Vonhof
author of change: Johan Post
date of change: 2015-05-29
date of change: 2023-01-10
date of change: 2026-05-13
definition: Datum waarop een object functioneel geen onderdeel meer vormt van het systeem, doordat het niet langer een rol vervult in het functioneren, beheren of gebruiken van dat systeem. Dit is niet per definitie de datum van fysieke verwijdering of sloop
author at start life: Marinus Vonhof
date of start life: 2011-12-15
units of measurements: yyyy-mm-dd
validity context: 6d 15d 16d
comment: [is aspect]
scope note: Collection of facts TOP
type: Class
subclass of: Datum
subclass of: Restriction
  author at start life: Marinus Vonhof
  date of start life: 2013-09-28
  on class: Fysiek object
  on property: has as aspect (inverse)
  max qualified cardinality: 1
subclass of: Restriction
  on property: has as value
  all values from: date

Eindknooppunt
definition: [EN13508-2+A1] The node reference of the second node as specified by the employing authority. @en
definition: Het knooppunt dat koppelt aan het (topologische) eindpunt van een leiding.
author at start life: Marinus Vonhof
date of start life: 2026-07-17
alternative label: Eindknoop
scope note: Collection of facts TOP
type: Class
subclass of: Extra objecttype (rol)

Keuring elektrisch
author of change: Marinus Vonhof
date of change: 2021-09-24
author at start life: Marinus Vonhof
date of start life: 2014-08-01
validity context: 1d 3d 6d 10d 12d 14d
see also: [DIV model] Keuring van elektrische installatie volgens NEN 3410
scope note: Collection of facts MDS
scope note: Collection of facts MTR
type: Class
subclass of: Onderzoeken
subclass of: Restriction
  author of change: Marinus Vonhof
  date of change: 2018-05-03
  author at start life: Marinus Vonhof
  date of start life: 2014-08-01
  on class: Elektriciteitskast
  on property: has as input
  max qualified cardinality: 1

Hoogte kast
author of change: Nic Roest (Idoro)
date of change: 2006-11-23
definition: De uitwendige hoogte van een elektriciteitskast
author at start life: Nic Roest (Idoro)
date of start life: 2006-02-21
units of measurements: mm
comment: Intrinsiek aspect
comment: [is aspect]
scope note: Collection of facts MDS
type: Class
subclass of: Hoogte
subclass of: Restriction
  author at start life: Finy Teitsma (Oranjewoud)
  date of start life: 2006-02-25
  on class: Elektriciteitskast
  on property: has as aspect (inverse)
  max qualified cardinality: 1
subclass of: Restriction
  on property: has as value
  all values from: integer

Lengte kast
author at start life: Marinus Vonhof
date of start life: 2013-12-05
units of measurements: mm
comment: [is aspect]
scope note: Collection of facts MDS
scope note: Collection of facts RGM
type: Class
subclass of: Lengte
subclass of: Restriction
  author at start life: Finy Teitsma (Oranjewoud)
  date of start life: 2006-02-25
  on class: Elektriciteitskast
  on property: has as aspect (inverse)
  max qualified cardinality: 1
subclass of: Restriction
  on property: has as value
  all values from: integer

Sokkel
author at start life: Marinus Vonhof
date of start life: 2018-05-03
scope note: Collection of facts BAS
scope note: Collection of facts RGM
type: Class
subclass of: Fundering
subclass of: Restriction
  author at start life: Marinus Vonhof
  date of start life: 2018-05-03
  on class: Elektriciteitskast
  on property: has as part (inverse)
  qualified cardinality: 1
subclass of: Restriction
  on property: heeft Uitvoering
  has value: VerhoogdOnderstel

Meetinrichting
author of change: Marinus Vonhof
date of change: 2025-01-16
definition: [IMBOR] Een samenhangend geheel van meetinstrumenten, kabels en elektriciteitskasten.
author at start life: Marinus Vonhof
date of start life: 2020-04-17
scope note: Collection of facts BAS
type: Class
subclass of: Systeem
subclass of: Restriction
  author at start life: Marinus Vonhof
  date of start life: 2020-04-17
  on class: Elektriciteitskast
  on property: has as part
  min qualified cardinality: 0
subclass of: Restriction
  author at start life: Marinus Vonhof
  date of start life: 2020-04-17
  on class: Kabel
  on property: has as part
  min qualified cardinality: 0
subclass of: Restriction
  author at start life: Marinus Vonhof
  date of start life: 2020-04-17
  on class: Meetinstrument
  on property: has as part
  min qualified cardinality: 0
subclass of: Restriction
  on property: heeft Uitvoering
  has value: GeheelVanMeetapparatuur

Elektronisch component
author of change: Marinus Vonhof
author of change: Eric van Gorkom
date of change: 2025-01-16
date of change: 2021-11-23
definition: [IMBOR] Een onderdeel dat in elektronische apparaten gebruikt wordt.
author at start life: Finy Teitsma (Oranjewoud)
date of start life: 2007-10-23
validity context: *d
alternative label: Electronisch component
scope note: Collection of facts BAS
type: Class
subclass of: Constructieonderdeel
subclass of: Restriction
  on property: heeft Uitvoering
  has value: OnderdeelVanApparatuur

Enkelkerende spindelschuif
author of change: Marinus Vonhof
date of change: 2025-01-16
definition: [IMBOR] Een doorlaat met een voorziening om de stroming te regelen.
author at start life: Marinus Vonhof
date of start life: 2019-05-15
scope note: Collection of facts BAS
scope note: Collection of facts PLI
scope note: Collection of facts HYD
scope note: Collection of facts DMO
type: Class
subclass of: Schuif
subclass of: Restriction
  author at start life: Marinus Vonhof
  date of start life: 2019-05-15
  on class: Spindel
  on property: has as part
  qualified cardinality: 1
subclass of: Restriction
  on property: heeft Functie
  has value: AfsluitenInEenStroomrichting

Pompschakeling (coll)
comment: [is coll]
scope note: Collection of facts BAS
scope note: Collection of facts RGM
scope note: Collection of facts DMO
type: Class
subclass of: Verzameling soorten
subclass of: Class
  one of: Samenloop
  one of: Enkelloop

Erfafscheidingsput
author of change: Marinus Vonhof
date of change: 2025-01-16
definition: [IMBOR] De put die een scheidingselement is voor het rioleringsperceel van de gemeente en dat van de particulier.
author at start life: Marinus Vonhof
date of start life: 2013-10-04
scope note: Collection of facts BAS
type: Class
subclass of: Aansluitput
subclass of: Restriction
  on property: heeft Toepassing
  has value: ScheidenVanPrivaatEnOpenbaar

Explosievrije kolk
author of change: Marinus Vonhof
date of change: 2025-01-16
definition: [IMBOR] Een explosievrije of explosieveilige kolk kan worden uitgevoerd als straatkolk voor in het wegdek bij bijvoorbeeld tankstations. Het rooster komt gelijk te liggen met het wegdek en kan worden geopend om de kolk leeg te zuigen of om het leidingwerk of kolk te controleren.
author at start life: Marinus Vonhof
date of start life: 2021-08-06
scope note: Collection of facts MDS
scope note: Collection of facts RRB
scope note: Collection of facts LDR
scope note: Collection of facts REV
type: Class
subclass of: Kolk
subclass of: Restriction
  on property: heeft Functie
  has value: VoorkomenVanExplosie

Externe overstortconstructie
author of change: Marinus Vonhof
date of change: 2015-09-01
definition: Een overstortconstructie waarbij het overtollig afvalwater uit een rioolstelsel kan stromen.
author at start life: Marinus Vonhof
date of start life: 2015-05-29
scope note: Collection of facts MDS
scope note: Collection of facts HYD
type: Class
subclass of: Overstortconstructie
subclass of: Restriction
  author of change: Marinus Vonhof
  date of change: 2018-12-12
  author at start life: Marinus Vonhof
  date of start life: 2015-05-29
  validity context: 11t 14t
  comment: Temporeel kenmerk, met kenmerk Inwinning
  on class: Niveau buitenwater
  on property: has as aspect
  min qualified cardinality: 0
subclass of: Restriction
  on property: heeft Functie
  has value: LozenBuitenHetStelsel

Niveau buitenwater
author of change: Marinus Vonhof
date of change: 2017-07-25
definition: Niveau van het ontvangend oppervlaktewater.
author at start life: Finy Teitsma (Oranjewoud)
date of start life: 2007-10-25
units of measurements: m
validity context: 15d
comment: [is aspect]
scope note: Collection of facts BAS
scope note: Collection of facts HYD
type: Class
subclass of: Waterpeil
subclass of: Restriction
  author of change: Marinus Vonhof
  date of change: 2015-05-29
  author at start life: Finy Teitsma (Oranjewoud)
  date of start life: 2007-10-24
  on class: Externe overstortput
  on property: has as aspect (inverse)
  max qualified cardinality: 1
subclass of: Restriction
  author of change: Marinus Vonhof
  date of change: 2018-12-12
  author at start life: Marinus Vonhof
  date of start life: 2015-05-29
  on class: Externe overstortconstructie
  on property: has as aspect (inverse)
  max qualified cardinality: 1
subclass of: Restriction
  author at start life: Marinus Vonhof
  date of start life: 2015-11-03
  on class: Inwinning
  on property: has as aspect
  max qualified cardinality: 1
subclass of: Restriction
  on property: has as value
  all values from: decimal

Externe overstortput
author of change: Finy Teitsma (Oranjewoud)
date of change: 2007-11-12
definition: Een overstortput waarbij overtollig afvalwater uit een rioolstelsel kan stromen.
definition: [NEN 3300:1996] rioolput voorzien van een overstortdrempel die loost buiten het in beschouwing genomen rioolstelsel, meestal op oppervlaktewater
definition: [NEN-EN 752:2008] voorziening in een gemengd systeem waarmee overtollig afvalwater wordt afgevoerd [EN 1085:2007, definitie 2130]
author at start life: Finy Teitsma (Oranjewoud)
date of start life: 2006-05-23
alternative label: Externe overstort
scope note: Collection of facts MDS
scope note: Collection of facts REV
scope note: Collection of facts HYD
scope note: Collection of facts DMO
type: Class
subclass of: Overstortput
subclass of: Restriction
  author of change: Marinus Vonhof
  date of change: 2015-05-29
  author at start life: Finy Teitsma (Oranjewoud)
  date of start life: 2007-10-24
  validity context: 11t 14t
  on class: Niveau buitenwater
  on property: has as aspect
  max qualified cardinality: 1
subclass of: Restriction
  author at start life: Marinus Vonhof
  date of start life: 2018-11-07
  on class: Sym_ExterneOverstortput
  on property: is represented by
  max qualified cardinality: 1
subclass of: Restriction
  on property: heeft Functie
  has value: LozenBuitenHetStelsel

Sym_ExterneOverstortput
author of change: Marinus Vonhof
date of change: 2018-11-11
definition: Aangepaste stijl: Lijnkleur 255 0 0, Vulkleur 255 0 0, Grootte 10
author at start life: Marinus Vonhof
date of start life: 2018-11-07
scope note: Collection of facts NLCS
type: Class
subclass of: Geo-symbool
subclass of: Restriction
  author at start life: Marinus Vonhof
  date of start life: 2018-11-07
  on class: Externe overstortput
  on property: is represented by (inverse)
  max qualified cardinality: 1

Fabricaat
definition: Type-aanduiding van de fabrikant
author at start life: Marinus Vonhof
date of start life: 2020-04-17
validity context: 1d 10d
alternative label: Modelnaam
comment: [is aspect]
scope note: Collection of facts BAS
scope note: Collection of facts PLI
type: Class
subclass of: Kenmerk
subclass of: Restriction
  author at start life: Marinus Vonhof
  date of start life: 2020-04-17
  on class: Mechanische afsluiter
  on property: has as aspect (inverse)
  max qualified cardinality: 1
subclass of: Restriction
  author at start life: Marinus Vonhof
  date of start life: 2020-04-17
  on class: Rioolafsluiter
  on property: has as aspect (inverse)
  max qualified cardinality: 1

Rioolafsluiter
author of change: Marinus Vonhof
date of change: 2020-04-17
date of change: 2026-07-14
definition: Een statische constructie waarmee de doorstroomopening van een rioolleiding geheel of gedeeltelijk wordt afgesloten. Bij gedeeltelijke afsluiting (bijvoorbeeld als vloeistof via een uitsparing kan doorstromen) als deel een Opening In Wand toevoegen.
author at start life: Finy Teitsma (Oranjewoud)
date of start life: 2007-10-23
scope note: Collection of facts MDS
scope note: Collection of facts HYD
type: Class
subclass of: Wand
subclass of: Restriction
  author of change: Marinus Vonhof
  date of change: 2024-05-16
  date of change: 2020-04-17
  author at start life: Finy Teitsma (Oranjewoud)
  date of start life: 2006-05-23
  on class: Rioolleiding
  on property: has as part (inverse)
  max qualified cardinality: 1
subclass of: Restriction
  author of change: Marinus Vonhof
  date of change: 2020-04-17
  author at start life: Marinus Vonhof
  date of start life: 2013-02-05
  on class: Rioolput
  on property: has as part (inverse)
  max qualified cardinality: 1
subclass of: Restriction
  author of change: Marinus Vonhof
  date of change: 2020-04-17
  author at start life: Marinus Vonhof
  date of start life: 2018-11-07
  on class: Sym_Afsluiter
  on property: is represented by
  max qualified cardinality: 1
subclass of: Restriction
  author at start life: Marinus Vonhof
  date of start life: 2020-04-17
  on class: Fabricaat
  on property: has as aspect
  max qualified cardinality: 1
subclass of: Restriction
  author at start life: Marinus Vonhof
  date of start life: 2020-04-17
  on class: Serienummer
  on property: has as aspect
  max qualified cardinality: 1
subclass of: Restriction
  author at start life: Marinus Vonhof
  date of start life: 2024-05-16
  on class: Transportleiding
  on property: has as part (inverse)
  max qualified cardinality: 1
subclass of: Restriction
  on property: heeft Functie
  has value: AfsluitenVanLeidingen

Fabrikant
author of change: Marinus Vonhof
author of change: Eric van Gorkom
date of change: 2025-01-16
date of change: 2021-10-01
definition: De maker
definition: [IMBOR] De partij die het beheerobject vervaardigd heeft.
author at start life: Marinus Vonhof
date of start life: 2021-08-06
validity context: 1d 10d
scope note: Collection of facts BAS
type: Class
subclass of: Levensvorm
subclass of: Restriction
  author at start life: Marinus Vonhof
  date of start life: 2021-08-06
  on class: Fysiek object
  on property: has as output
  min qualified cardinality: 0

Faunarooster
notation: EXL
author at start life: Johan Post
date of start life: 2026-05-01
validity context: 10d
see also: constructie voor het kolkrooster dat voorkomt dat amfibieën en kleine zoogdieren ind de kolk kunnen vallen.
alternative label: Dierveiligheidsrooster
alternative label: Inklimverhindervoorziening
scope note: Collection of facts BAS
type: Class
subclass of: Constructieonderdeel
subclass of: Restriction
  author at start life: Johan Post
  date of start life: 2026-05-04
  on class: Spuikolk
  on property: has as part (inverse)
  max qualified cardinality: 1
subclass of: Restriction
  author at start life: Marinus Vonhof
  date of start life: 2020-04-18
  on class: Kolk
  on property: has as part (inverse)
  max qualified cardinality: 1
subclass of: Restriction
  on property: heeft Functie
  has value: AmfibieenEnZoogdierenRedden

Filterput
author of change: Marinus Vonhof
date of change: 2017-05-31
definition: Put met een filterconstructie voor het onttrekken van grondwater. Kan ook beschouwd worden als een soort drainagevoorziening.
author at start life: Finy Teitsma (Oranjewoud)
date of start life: 2007-10-23
validity context: 1d 3d 10d 12d 14d
scope note: Collection of facts MDS
type: Class
subclass of: Put
subclass of: Restriction
  author of change: Marinus Vonhof
  date of change: 2014-04-10
  author at start life: Finy Teitsma (Oranjewoud)
  date of start life: 2007-10-23
  on class: Mechanisch drainagestelsel
  on property: has as part (inverse)
  max qualified cardinality: 1
subclass of: Restriction
  author of change: Marinus Vonhof
  date of change: 2017-05-31
  author at start life: Nic Roest (Idoro)
  date of start life: 2007-11-29
  on class: Lamellenafscheider
  on property: has as part
  max qualified cardinality: 1
subclass of: Restriction
  author at start life: Finy Teitsma (Oranjewoud)
  date of start life: 2007-11-29
  on class: Vrijverval drainagestelsel
  on property: has as part (inverse)
  max qualified cardinality: 1
subclass of: Restriction
  author at start life: Marinus Vonhof
  date of start life: 2018-10-27
  on class: NLCS_DRAINAGE_PUT_FILTERPUT
  on property: is represented by
  max qualified cardinality: 1
subclass of: Restriction
  on property: heeft Functie
  has value: InzamelingVanGrondwater

Lamellenafscheider
label: Lamella separator @en
author of change: Marinus Vonhof
date of change: 2015-07-09
definition: Een toestel bestemd voor het verwijderen van vaste deeltjes (vuil en slib) die zich in het water bevinden
definition: [EN 16323:2014] device comprising regularly spaced, inclined plates or tubes, designed to increase the effective settling area @en
author at start life: Finy Teitsma (Oranjewoud)
date of start life: 2007-10-23
validity context: 10d
alternative label: Lamellenfilter
scope note: Collection of facts BAS
type: Class
subclass of: Constructieonderdeel
subclass of: Restriction
  author of change: Marinus Vonhof
  date of change: 2017-05-31
  author at start life: Nic Roest (Idoro)
  date of start life: 2007-11-29
  on class: Filterput
  on property: has as part (inverse)
  max qualified cardinality: 1
subclass of: Restriction
  on property: heeft Functie
  has value: AfscheidenVasteDeeltjesVuilEnSlib
subclass of: Restriction
  on property: heeft Functie
  has value: OpvangenVuil
subclass of: Restriction
  on property: heeft Functie
  has value: ReinigenAfvalwater

NLCS_DRAINAGE_PUT_FILTERPUT
author of change: Marinus Vonhof
date of change: 2018-11-07
definition: Lijntype: CONTINUOUS
notation: 1658
author at start life: Marinus Vonhof
date of start life: 2018-10-27
scope note: Collection of facts NLCS
type: Class
subclass of: NLCS_Object
subclass of: Restriction
  author at start life: Marinus Vonhof
  date of start life: 2018-10-27
  on class: Filterput
  on property: is represented by (inverse)
  max qualified cardinality: 1

Hulpstukoriëntatie
author of change: Marinus Vonhof
author of change: Johan Post
date of change: 2018-12-05
date of change: 2024-07-30
definition: Een topologisch element dat het zwaartepunt (vertex) van de bovenkant hulpstukbodem beschrijft
author at start life: Marinus Vonhof
date of start life: 2017-12-12
scope note: Collection of facts MDS
scope note: Collection of facts PLI
scope note: Collection of facts HYD
type: Class
subclass of: Knooppunt
subclass of: Restriction
  author of change: Marinus Vonhof
  date of change: 2017-12-13
  author at start life: Marinus Vonhof
  date of start life: 2013-03-29
  validity context: 5t 11t
  on class: Hulpstuk
  on property: has as aspect (inverse)
  max qualified cardinality: 1
subclass of: Restriction
  author at start life: Marinus Vonhof
  date of start life: 2017-05-30
  comment: Koppeling geometrie - topologie
  on class: Maaiveldoriëntatie
  on property: is connected to
  max qualified cardinality: 1
subclass of: Restriction
  author at start life: Marinus Vonhof
  date of start life: 2021-08-06
  on class: Flexibel zettingsstuk
  on property: has as aspect (inverse)
  max qualified cardinality: 1
subclass of: Restriction
  on class: Lijn
  on property: has as aspect
  max qualified cardinality: 1

Fontein
author of change: Marinus Vonhof
date of change: 2025-01-16
definition: Een natuurlijke of kunstmatige installatie die water spuit
author at start life: Johan Post
date of start life: 2022-09-29
validity context: 10d
scope note: Collection of facts BAS
type: Class
subclass of: Constructieonderdeel
subclass of: Restriction
  author of change: Marinus Vonhof
  date of change: 2018-03-20
  author at start life: Marinus Vonhof
  date of start life: 2018-03-20
  on class: Oppervlaktewater
  on property: has as part (inverse)
  max qualified cardinality: 1
subclass of: Restriction
  on property: heeft Functie
  has value: WaterSpuiten

Oppervlaktewater
label: Surface water @en
author of change: Marinus Vonhof
author of change: Johan Post
date of change: 2022-09-29
date of change: 2024-10-28
definition: [EN 16323:2014] inland waters, except groundwater; transitional waters and coastal waters, except in respect of chemical status for which it shall also include territorial waters @en
author at start life: Marinus Vonhof
date of start life: 2012-04-29
validity context: *d
see also: [IMGeo:1.0/2007] Grondoppervlakte in principe bedekt met water.
see also: [IRIS-RIOKEN:2012] Het grondoppervlak in principe bedekt met water.
see also: [NEN 3610:2010] Grondoppervlak in principe bedekt met water.
scope note: Collection of facts BAS
type: Class
subclass of: Fysiek object
subclass of: Restriction
  on property: heeft Structuur
  has value: GrondoppervlakBedektMetWater
subclass of: Restriction
  on class: Fontein
  on property: has as part
  min qualified cardinality: 0

Foutaansluiting
author of change: Marinus Vonhof
date of change: 2025-01-16
date of change: 2024-08-01
definition: Een aansluiting (van perceel of kolk) op een andersoortig type rioolstelsel die de goede werking van een rioolstelsel belemmert. In principe zijn drie soorten foutaansluitingen mogelijk: / 1 De afvalwaterafvoer is aangesloten op het hemelwaterriool. / 2 De hemelwaterafvoer is aangesloten op het vuilwaterriool of op drukriolering. / 3 De afvalwater- en hemelwaterafvoer zijn omgedraaid en aangesloten op respectievelijk het hemelwater- en vuilwaterriool.
author at start life: Marinus Vonhof
date of start life: 2018-12-06
scope note: Collection of facts BAS
type: Class
subclass of: Aansluiting
subclass of: Extra objecttype (rol)
subclass of: Restriction
  on property: heeft Uitvoering
  has value: OngewensteVermengingVanAfvalwater

Frequentie-omvormer
definition: Een apparaat dat de frequentie van elektrische energie verandert.
author at start life: Marinus Vonhof
date of start life: 2013-10-01
scope note: Collection of facts BAS
scope note: Collection of facts RGM
type: Class
subclass of: Elektronisch component
subclass of: Restriction
  author at start life: Finy Teitsma (Oranjewoud)
  date of start life: 2007-11-29
  on class: Meetinstrument
  on property: is connected to
  max qualified cardinality: 1
subclass of: Restriction
  author at start life: Marinus Vonhof
  date of start life: 2013-02-05
  on class: Pomp
  on property: has as part (inverse)
  qualified cardinality: 1
subclass of: Restriction
  on property: heeft Functie
  has value: AanpassenFrequentieVanElektrischeEnergie

Fundatieplaat
author of change: Marinus Vonhof
date of change: 2025-01-16
date of change: 2021-08-06
definition: Bijvoorbeeld een (stelcon)plaat op zand, zonder verbinding met het gefundeerde object
author at start life: Marinus Vonhof
date of start life: 2018-12-06
validity context: 1d 10d
scope note: Collection of facts BAS
scope note: Collection of facts RGM
type: Class
subclass of: Fundering
subclass of: Restriction
  on property: heeft Uitvoering
  has value: VrijliggendePlaat

Materiaal fundering
author at start life: Marinus Vonhof
date of start life: 2018-05-03
validity context: 1d 10d
comment: Intrinsiek aspect
comment: [is aspect]
scope note: Collection of facts BAS
scope note: Collection of facts RGM
type: Class
subclass of: Materiaal
subclass of: Restriction
  author at start life: Marinus Vonhof
  date of start life: 2018-05-03
  on class: Fundering
  on property: has as aspect (inverse)
  max qualified cardinality: 1
subclass of: Restriction
  on property: has as reference (qualification)
  all values from: Materiaal fundering (coll)

Rioleringsbeheerder
definition: [NEN 3300:1996] rechtspersoon belast met de zorg voor de riolering
author at start life: Marinus Vonhof
date of start life: 2016-08-26
validity context: 1d 10d
scope note: Collection of facts BAS
scope note: Collection of facts DMO
type: Class
subclass of: Beheerder
subclass of: Restriction
  author at start life: Wouter van Riel
  date of start life: 2022-12-19
  on class: Fysiek object
  on property: has as input
  min qualified cardinality: 0
subclass of: Restriction
  on property: heeft Functie
  has value: Rioleringsbeheer

Leverancier
author of change: Marinus Vonhof
author of change: Eric van Gorkom
date of change: 2025-01-16
date of change: 2021-10-01
definition: De verstrekker
definition: [IMBOR] De partij of persoon die het beheerobject aan de eigenaar geleverd heeft.
author at start life: Marinus Vonhof
date of start life: 2021-08-06
validity context: 1d 10d
scope note: Collection of facts BAS
type: Class
subclass of: Levensvorm
subclass of: Restriction
  author at start life: Marinus Vonhof
  date of start life: 2021-08-06
  on class: Fysiek object
  on property: has as output
  min qualified cardinality: 0

Gegevensbeheerder
definition: Persoon die zorgdraagt voor het beheren van gegevens
author at start life: Wouter van Riel
date of start life: 2022-12-19
validity context: 1d 5d 6d 10d 11d 12d
scope note: Collection of facts BAS
scope note: Collection of facts DMO
type: Class
subclass of: Beheerder
subclass of: Restriction
  author at start life: Marinus Vonhof
  date of start life: 2023-01-16
  on class: Informatiedrager
  on property: has as input
  min qualified cardinality: 0
subclass of: Restriction
  author at start life: Marinus Vonhof
  date of start life: 2023-01-16
  on class: Informatiedrager
  on property: has as output
  min qualified cardinality: 0
subclass of: Restriction
  author at start life: Wouter van Riel
  date of start life: 2022-12-19
  on class: Fysiek object
  on property: has as input
  min qualified cardinality: 0

Gegevenswoordenboek Stedelijk Water
author of change: Marinus Vonhof
date of change: 2024-05-16
date of change: 2024-07-31
date of change: 2021-12-29
date of change: 2021-09-20
date of change: 2021-10-02
date of change: 2025-11-18
date of change: 2026-08-25
definition: Een datamodel (ontologie, kennismodel) voor het vakgebied Stedelijk Water, het bevat modellen voor systemen en processen binnen het vakgebied. Belangrijke onderdelen ervan zijn modellen van constructies (systemen, stelsels, bouwwerken, leidingen, putten) en modellen van activiteiten (plannen, projecten, maatregelen). Het datamodel is onderdeel van het Semantisch Web, de datastructuur is gebaseerd op de linked-data-taal RDF/RDFS/OWL.
author at start life: Marinus Vonhof
date of start life: 2011-11-11
validity context: 6d
comment: URI gewijzigd (was GWSW_Datamodel) (20251118)
comment: Vigerend: GWSW versie 1.7.0 (25-08-2026)
alternative label: GWSW
scope note: Collection of facts TOP
type: Class
subclass of: Informatiedrager
subclass of: Restriction
  author at start life: Marinus Vonhof
  date of start life: 2025-11-18
  on class: GWSW Deelmodel
  on property: has as part
  min qualified cardinality: 1
subclass of: Restriction
  author at start life: Marinus Vonhof
  date of start life: 2026-07-24
  on class: GWSW.orox
  on property: has as part
  qualified cardinality: 1

GWSW.orox
definition: Het uitwisselprotocol voor toepassingen van het GWSW. Het protocol beschrijft met de linked-data-taal RDF/RDFS/OWL de inhoud van het GWSW Datamodel en de GWSW Datasets (de gemeentelijke gegevens). In alle gevallen wordt het zogenaamde Turtle-formaat voor de uitwisselbestanden gebruikt, maar in principe is elk RDF-formaat bruikbaar. De door gemeenten gebruikte beheersystemen kunnen in de meeste gevallen gegevens exporteren conform GWSW OroX.
author at start life: Marinus Vonhof
date of start life: 2026-07-24
alternative label: GWSW OroX
scope note: Collection of facts TOP
type: Class
subclass of: Informatiedrager
subclass of: Restriction
  author at start life: Marinus Vonhof
  date of start life: 2026-07-24
  on class: Gegevenswoordenboek Stedelijk Water
  on property: has as part (inverse)
  qualified cardinality: 1

Galvanische bescherming
definition: Opoffering van een minder edel metaal om zo een object tegen corrosie te beschermen.
author at start life: Johan Post
date of start life: 2026-05-04
validity context: 15d
comment: [is aspect]
scope note: Collection of facts BAS
scope note: Collection of facts PLI
type: Class
subclass of: Kathodische bescherming

Gasmeter
definition: Een instrument dat de hoeveelheid gas meet.
author at start life: Marinus Vonhof
date of start life: 2026-07-15
scope note: Collection of facts BAS
scope note: Collection of facts RGM
type: Class
subclass of: Meetinstrument
subclass of: Restriction
  on property: heeft Functie
  has value: MetenVanGas

Gebeurtenisberekening
definition: [NEN 3300:1996] Hydraulische berekening met één neerslaggebeurtenis
author at start life: Marinus Vonhof
date of start life: 2022-09-30
validity context: *d
scope note: Collection of facts BAS
type: Class
subclass of: NEN 3300 Term

Geboorde leiding
author of change: Marinus Vonhof
date of change: 2024-08-01
author at start life: Marinus Vonhof
date of start life: 2018-12-06
scope note: Collection of facts BAS
type: Class
subclass of: Leiding
subclass of: Extra objecttype (rol)
subclass of: Restriction
  on property: heeft Uitvoering
  has value: Geboord

Helofytenfilter
label: Constructed wetland @en
author of change: Marinus Vonhof
author of change: Johan Post
date of change: 2025-01-16
date of change: 2021-10-01
date of change: 2026-05-01
definition: [EN 16323:2014] construction near to nature using helophyte plants supporting bacterial action in the gravel or sand for treatment of wastewater @en
definition: [IMBOR] Functie van rietland. Bed of veld van planten (helofyten) dat, met behulp van zonlicht, water zuivert. Het object kan onderdeel uitmaken van een waterpartij.
definition: [NEN 3300:1996] afgescheiden gebied beplant met helofyten (riet, biezen etc.) waardoor afvalwater stroomt (horizontaal of verticaal) en door beluchting, bezinking en afzetting wordt gezuiverd. Bij verticale stroming wordt het gezuiverde water afgevoerd door drainage.
author at start life: Marinus Vonhof
date of start life: 2013-09-29
alternative label: Biologisch reinigend filter
scope note: Collection of facts BAS
type: Class
subclass of: IBA Klasse IIIa
subclass of: Restriction
  author of change: Marinus Vonhof
  date of change: 2016-04-25
  author at start life: Nic Roest (Idoro)
  date of start life: 2007-11-29
  on class: Perceelaansluitpunt
  on property: is connected to
  min qualified cardinality: 1
subclass of: Restriction
  on property: heeft Uitvoering
  has value: Filter
subclass of: Restriction
  on class: Sym_Infiltratievoorziening
  on property: is represented by
  max qualified cardinality: 1
subclass of: Restriction
  on class: Gebouwaansluitpunt
  on property: is connected to
  min qualified cardinality: 0

Lozingsvergunninghouder
author of change: Marinus Vonhof
author of change: Johan Post
date of change: 2025-01-16
date of change: 2026-05-01
date of change: 2013-09-03
definition: [IMBOR] De partij die het lozen van water op een perceelaansluitpunt vergund is.
author at start life: Marinus Vonhof
date of start life: 2013-02-05
comment: [is aspect]
scope note: Collection of facts BAS
scope note: Collection of facts DMO
type: Class
subclass of: Kenmerk
subclass of: Restriction
  author at start life: Marinus Vonhof
  date of start life: 2013-02-05
  on class: Perceelaansluitpunt
  on property: has as aspect (inverse)
  max qualified cardinality: 1
subclass of: Restriction
  on class: Gebouwaansluitpunt
  on property: has as aspect (inverse)
  max qualified cardinality: 1
subclass of: Restriction
  on class: Overnamepunt
  on property: has as aspect (inverse)
  max qualified cardinality: 1

Lozingsvergunningnummer
author of change: Marinus Vonhof
author of change: Johan Post
date of change: 2025-01-16
date of change: 2026-05-01
date of change: 2020-04-18
definition: [IMBOR] Het nummer dat de vergunning aanduidt die een partij is verleend voor het lozen van water op een bepaald perceelaansluitpunt.
author at start life: Marinus Vonhof
date of start life: 2013-02-05
comment: [is aspect]
scope note: Collection of facts BAS
scope note: Collection of facts DMO
type: Class
subclass of: Unieke identificatie
subclass of: Restriction
  author at start life: Marinus Vonhof
  date of start life: 2013-02-05
  on class: Perceelaansluitpunt
  on property: has as aspect (inverse)
  max qualified cardinality: 1
subclass of: Restriction
  on class: Gebouwaansluitpunt
  on property: has as aspect (inverse)
  max qualified cardinality: 1
subclass of: Restriction
  on class: Overnamepunt
  on property: has as aspect (inverse)
  max qualified cardinality: 1

Lozingseisen
author of change: Johan Post
date of change: 2025-05-01
author at start life: Marinus Vonhof
date of start life: 2020-04-18
see also: [Saniwijzer] Eisen die worden gesteld aan te lozen effluent
alternative label: Lozingsnormen
comment: [is aspect]
scope note: Collection of facts BAS
scope note: Collection of facts DMO
type: Class
subclass of: Kenmerk
subclass of: Restriction
  author at start life: Marinus Vonhof
  date of start life: 2020-04-18
  on class: Perceelaansluitpunt
  on property: has as aspect (inverse)
  max qualified cardinality: 1
subclass of: Restriction
  on class: Gebouwaansluitpunt
  on property: has as aspect (inverse)
  max qualified cardinality: 1
subclass of: Restriction
  on class: Overnamepunt
  on property: has as aspect (inverse)
  max qualified cardinality: 1

Perceelaansluiting
author of change: Johan Post
date of change: 2026-05-01
definition: De aansluiting van een perceel op een rioolstelsel
definition: [Omgevingswet] De buis waarmee een gebouw is (of wordt) aangesloten op de riolering
author at start life: Marinus Vonhof
date of start life: 2018-12-05
see also: [IMKL:1.1/2008] (Ongeldig) De leiding die een leiding verbindt met een aansluitpunt.
alternative label: Huisaansluiting
scope note: Collection of facts MDS
type: Class
subclass of: Aansluiting
subclass of: Restriction
  author of change: Marinus Vonhof
  date of change: 2014-04-29
  author at start life: Finy Teitsma (Oranjewoud)
  date of start life: 2007-10-23
  on class: Drukriolering
  on property: has as part (inverse)
  max qualified cardinality: 1
subclass of: Restriction
  author of change: Marinus Vonhof
  date of change: 2016-04-25
  author at start life: Finy Teitsma (Oranjewoud)
  date of start life: 2007-11-30
  on class: Perceelaansluitleiding
  on property: has as part
  min qualified cardinality: 1
subclass of: Restriction
  author of change: Marinus Vonhof
  date of change: 2019-05-15
  author at start life: Finy Teitsma (Oranjewoud)
  date of start life: 2007-11-30
  on class: Perceelaansluitpunt
  on property: has as part
  min qualified cardinality: 1
subclass of: Restriction
  author at start life: Johan Post
  date of start life: 2026-05-04
  on class: Spuikolk
  on property: has as part
  min qualified cardinality: 0
subclass of: Restriction
  author at start life: Marinus Vonhof
  date of start life: 2020-04-17
  on class: Hybride drukriolering
  on property: has as part (inverse)
  max qualified cardinality: 1
subclass of: Restriction
  author at start life: Marinus Vonhof
  date of start life: 2020-04-17
  on class: Luchtpersriolering
  on property: has as part (inverse)
  max qualified cardinality: 1
subclass of: Restriction
  author at start life: Marinus Vonhof
  date of start life: 2020-04-17
  on class: Vacuümriolering
  on property: has as part (inverse)
  max qualified cardinality: 1
subclass of: Restriction
  on property: heeft Functie
  has value: AanvoerVanAfvalwaterVanafEenPerceel
subclass of: Restriction
  on property: heeft Doel
  has value: PerceelAansluitenOpRioolstelsel
subclass of: Restriction
  on class: Gebouwaansluitpunt
  on property: has as part
  min qualified cardinality: 0

Gecombineerde straat-trottoirkolk
author of change: Marinus Vonhof
date of change: 2021-08-06
definition: Een kolk met de inlaat aan de boven- en voorzijde bestemd om te worden aangebracht zowel gedeeltelijk in het vlak van de wegverharding als gedeeltelijk in de vlakken van de aansluitende trottoirbanden die in het zicht blijven.
notation: C
author at start life: Finy Teitsma (Oranjewoud)
date of start life: 2006-11-29
alternative label: Combikolk
alternative label: Gemengde kolk
scope note: Collection of facts MDS
scope note: Collection of facts RRB
scope note: Collection of facts LDR
scope note: Collection of facts REV
type: Class
subclass of: Kolk
subclass of: Restriction
  author at start life: Marinus Vonhof
  date of start life: 2018-10-27
  on class: NLCS_GWA_KOLK_COMBIKOLK
  on property: is represented by
  max qualified cardinality: 1
subclass of: Restriction
  author at start life: Marinus Vonhof
  date of start life: 2018-10-27
  on class: NLCS_HWA_KOLK_COMBIKOLK
  on property: is represented by
  max qualified cardinality: 1
subclass of: Restriction
  author at start life: Marinus Vonhof
  date of start life: 2018-10-27
  on class: NLCS_ITR_KOLK_COMBIKOLK
  on property: is represented by
  max qualified cardinality: 1
subclass of: Restriction
  author at start life: Marinus Vonhof
  date of start life: 2018-10-27
  on class: NLCS_SWA_KOLK_COMBIKOLK
  on property: is represented by
  max qualified cardinality: 1
subclass of: Restriction
  author at start life: Marinus Vonhof
  date of start life: 2018-11-11
  on class: Sym_Kolk
  on property: is represented by
  max qualified cardinality: 1
subclass of: Restriction
  on property: heeft Functie
  has value: AfvoerNaarKolkaansluitleiding
subclass of: Restriction
  on property: heeft Uitvoering
  has value: MetDeInlaatAanDeBoven EnVoorzijde

NLCS_GWA_KOLK_COMBIKOLK
author of change: Marinus Vonhof
date of change: 2018-11-07
definition: Lijntype: CONTINUOUS / Symbool: 2114 - KOLK_COMBINATIE
notation: 1686
author at start life: Marinus Vonhof
date of start life: 2018-10-27
scope note: Collection of facts NLCS
type: Class
subclass of: NLCS_Object
subclass of: Restriction
  author at start life: Marinus Vonhof
  date of start life: 2018-10-27
  on class: Gecombineerde straat-trottoirkolk
  on property: is represented by (inverse)
  max qualified cardinality: 1

NLCS_HWA_KOLK_COMBIKOLK
author of change: Marinus Vonhof
date of change: 2018-11-07
definition: Lijntype: CONTINUOUS / Symbool: 2114 - KOLK_COMBINATIE
notation: 1813
author at start life: Marinus Vonhof
date of start life: 2018-10-27
scope note: Collection of facts NLCS
type: Class
subclass of: NLCS_Object
subclass of: Restriction
  author at start life: Marinus Vonhof
  date of start life: 2018-10-27
  on class: Gecombineerde straat-trottoirkolk
  on property: is represented by (inverse)
  max qualified cardinality: 1

NLCS_ITR_KOLK_COMBIKOLK
author of change: Marinus Vonhof
date of change: 2018-11-07
definition: Lijntype: CONTINUOUS / Symbool: 2114 - KOLK_COMBINATIE
notation: 1962
author at start life: Marinus Vonhof
date of start life: 2018-10-27
scope note: Collection of facts NLCS
type: Class
subclass of: NLCS_Object
subclass of: Restriction
  author at start life: Marinus Vonhof
  date of start life: 2018-10-27
  on class: Gecombineerde straat-trottoirkolk
  on property: is represented by (inverse)
  max qualified cardinality: 1

NLCS_SWA_KOLK_COMBIKOLK
author of change: Marinus Vonhof
date of change: 2018-11-07
definition: Lijntype: CONTINUOUS / Symbool: 2114 - KOLK_COMBINATIE
notation: 2091
author at start life: Marinus Vonhof
date of start life: 2018-10-27
scope note: Collection of facts NLCS
type: Class
subclass of: NLCS_Object
subclass of: Restriction
  author at start life: Marinus Vonhof
  date of start life: 2018-10-27
  on class: Gecombineerde straat-trottoirkolk
  on property: is represented by (inverse)
  max qualified cardinality: 1

Sym_Kolk
author of change: Marinus Vonhof
date of change: 2019-10-08
definition: Standaard stijl: Vorm half vierkant, Vulkleur 197 197 197, Grootte 4
author at start life: Marinus Vonhof
date of start life: 2018-11-10
scope note: Collection of facts NLCS
type: Class
subclass of: Geo-symbool
subclass of: Restriction
  author at start life: Marinus Vonhof
  date of start life: 2018-11-10
  on class: Kolk
  on property: is represented by (inverse)
  max qualified cardinality: 1
subclass of: Restriction
  author at start life: Marinus Vonhof
  date of start life: 2018-11-11
  on class: Gecombineerde straat-trottoirkolk
  on property: is represented by (inverse)
  max qualified cardinality: 1
subclass of: Restriction
  author at start life: Marinus Vonhof
  date of start life: 2018-11-11
  on class: Straatkolk
  on property: is represented by (inverse)
  max qualified cardinality: 1
subclass of: Restriction
  author at start life: Marinus Vonhof
  date of start life: 2018-11-11
  on class: Trottoirkolk
  on property: is represented by (inverse)
  max qualified cardinality: 1

Gedammerde leiding
author of change: Marinus Vonhof
date of change: 2025-01-16
date of change: 2018-12-10
definition: Een loze leiding gevuld met een daarvoor geschikt materiaal
author at start life: Marinus Vonhof
date of start life: 2018-12-05
scope note: Collection of facts BAS
scope note: Collection of facts MTR
type: Class
subclass of: Loze leiding
subclass of: Restriction
  on property: heeft Uitvoering
  has value: AfgevuldMetMateriaal

Loze leiding
author of change: Marinus Vonhof
date of change: 2025-01-16
date of change: 2018-12-10
definition: Leiding is buiten gebruik
definition: [IMBOR] Een leiding die buiten gebruik is, maar zich nog wel in de ondergrond bevindt.
author at start life: Marinus Vonhof
date of start life: 2016-04-29
alternative label: Verlaten leiding
scope note: Collection of facts REV
scope note: Collection of facts BAS
scope note: Collection of facts MTR
type: Class
subclass of: Leiding
subclass of: Restriction
  author at start life: Marinus Vonhof
  date of start life: 2018-11-07
  on class: Sym_LozeLeiding
  on property: is represented by
  max qualified cardinality: 1
subclass of: Restriction
  on property: heeft Functie
  has value: GeenFunctie

Gedwongen stroom bescherming
definition: Een systeem dat gelijkstroom gebruikt om een object tegen corrosie te beschermen.
author at start life: Johan Post
date of start life: 2026-05-04
validity context: 15d
comment: [is aspect]
scope note: Collection of facts BAS
scope note: Collection of facts PLI
type: Class
subclass of: Kathodische bescherming

Geel afvalwater
definition: Urine en eventueel spoelwater uit urinoirs en urinescheidingstoiletten
author at start life: Marinus Vonhof
date of start life: 2016-04-15
scope note: Collection of facts BAS
type: Class
subclass of: Afvalwater

Stromingsrichting (coll)
comment: [is coll]
scope note: Collection of facts HYD
type: Class
subclass of: Verzameling soorten
subclass of: Class
  one of: StromingVanBeginpuntNaarEindpunt
  one of: StromingVanEindpuntNaarBeginpunt
  one of: StromingInBeideRichtingen
  one of: GeenStroming Gesloten

Maaiveldschematisering (coll)
comment: [is coll]
scope note: Collection of facts HYD
type: Class
subclass of: Verzameling soorten
subclass of: Class
  one of: ReservoirMaaiveldschema
  one of: Gekneveld
  one of: Verlies

Pompschakeling
author of change: Marinus Vonhof
date of change: 2015-02-28
definition: Wijze waarop de pompen worden in- en uitgeschakeld
author at start life: Nic Roest (Idoro)
date of start life: 2006-02-21
validity context: 15d
see also: [HYD] Aanduiding of pompen in samenloop of enkelloop functioneren
alternative label: Pompregime
comment: [is aspect]
scope note: Collection of facts BAS
scope note: Collection of facts HYD
scope note: Collection of facts RGM
scope note: Collection of facts DMO
type: Class
subclass of: Kenmerk
subclass of: Restriction
  author of change: Marinus Vonhof
  date of change: 2019-07-11
  author at start life: Finy Teitsma (Oranjewoud)
  date of start life: 2006-02-25
  on class: Gemaal
  on property: has as aspect (inverse)
  max qualified cardinality: 1
subclass of: Restriction
  author at start life: Marinus Vonhof
  date of start life: 2019-07-11
  on class: Pompput
  on property: has as aspect (inverse)
  max qualified cardinality: 1
subclass of: Restriction
  on property: has as reference (qualification)
  all values from: Pompschakeling (coll)

Veiligheidsrooster
author of change: Marinus Vonhof
date of change: 2025-01-16
date of change: 2026-08-03
definition: [IMBOR] Een vaak bewandelbaar rooster dat ter bescherming van mensen aan het oppervlak over een opening is aangebracht.
author at start life: Marinus Vonhof
date of start life: 2013-03-31
validity context: 10d
alternative label: Valrooster
scope note: Collection of facts REV
scope note: Collection of facts BAS
scope note: Collection of facts RGM
type: Class
subclass of: Afdekking
subclass of: Restriction
  author of change: Marinus Vonhof
  date of change: 2016-04-13
  author at start life: Marinus Vonhof
  date of start life: 2013-02-05
  on class: Gemaal
  on property: has as part (inverse)
  max qualified cardinality: 1
subclass of: Restriction
  author at start life: Marinus Vonhof
  date of start life: 2018-05-03
  on class: Pompput
  on property: has as part (inverse)
  max qualified cardinality: 1
subclass of: Restriction
  on property: heeft Functie
  has value: BeschermenTegenVallen

Service elektrisch
author of change: Marinus Vonhof
date of change: 2018-05-01
author at start life: Marinus Vonhof
date of start life: 2013-02-05
scope note: Collection of facts BAS
scope note: Collection of facts MTR
scope note: Collection of facts RGM
type: Class
subclass of: Onderhouden
subclass of: Restriction
  author of change: Marinus Vonhof
  date of change: 2018-05-03
  author at start life: Marinus Vonhof
  date of start life: 2016-04-24
  on class: Gemaal
  on property: has as input
  max qualified cardinality: 1

Service mechanisch
author of change: Marinus Vonhof
date of change: 2019-03-14
author at start life: Marinus Vonhof
date of start life: 2013-02-05
scope note: Collection of facts BAS
scope note: Collection of facts PLI
scope note: Collection of facts MTR
scope note: Collection of facts RGM
type: Class
subclass of: Onderhouden
subclass of: Restriction
  author of change: Marinus Vonhof
  date of change: 2019-03-20
  author at start life: Marinus Vonhof
  date of start life: 2014-12-02
  on class: Ontluchter
  on property: has as input
  max qualified cardinality: 1
subclass of: Restriction
  author of change: Marinus Vonhof
  date of change: 2019-03-20
  author at start life: Marinus Vonhof
  date of start life: 2016-04-24
  on class: Gemaal
  on property: has as input
  max qualified cardinality: 1
subclass of: Restriction
  author of change: Marinus Vonhof
  date of change: 2019-03-20
  author at start life: Marinus Vonhof
  date of start life: 2016-04-24
  on class: Pomp
  on property: has as input
  max qualified cardinality: 1
subclass of: Restriction
  author of change: Marinus Vonhof
  date of change: 2019-03-20
  author at start life: Marinus Vonhof
  date of start life: 2017-03-29
  on class: Ontspanningsventiel
  on property: has as input
  max qualified cardinality: 1
subclass of: Restriction
  author of change: Marinus Vonhof
  date of change: 2019-05-15
  author at start life: Marinus Vonhof
  date of start life: 2013-03-26
  on class: Mechanische afsluiter
  on property: has as input
  max qualified cardinality: 1

Hijsinrichting
author of change: Marinus Vonhof
date of change: 2025-01-16
definition: [IMBOR] Een constructieonderdeel dat bestaat uit een (gemotoriseerde) kabel met een haak waarmee dingen opgetakeld of -gehesen kunnen worden.
author at start life: Marinus Vonhof
date of start life: 2015-07-28
validity context: 1d 3d 10d 12d 14d
scope note: Collection of facts MDS
type: Class
subclass of: Constructieonderdeel
subclass of: Restriction
  author at start life: Marinus Vonhof
  date of start life: 2015-07-28
  on class: Gemaal
  on property: has as part (inverse)
  max qualified cardinality: 1
subclass of: Restriction
  author at start life: Marinus Vonhof
  date of start life: 2015-07-28
  on class: Pompput
  on property: has as part (inverse)
  max qualified cardinality: 1
subclass of: Restriction
  author at start life: Marinus Vonhof
  date of start life: 2015-07-28
  on class: Keuring hijsinrichting
  on property: has as input (inverse)
  qualified cardinality: 1
subclass of: Restriction
  on property: heeft Functie
  has value: Hijsen

Inspecteren gemaal
author of change: Marinus Vonhof
date of change: 2017-03-23
author at start life: Marinus Vonhof
date of start life: 2015-07-28
validity context: 6d
scope note: Collection of facts BAS
scope note: Collection of facts RGM
type: Class
subclass of: Inspecteren
subclass of: Restriction
  author at start life: Marinus Vonhof
  date of start life: 2015-07-28
  on class: Gemaal
  on property: has as input
  qualified cardinality: 1

Ontwerpcapaciteit gemaal
author of change: Johan Post
date of change: 2022-11-25
definition: De capaciteit op basis van het ontwerp
author at start life: Marinus Vonhof
date of start life: 2020-04-18
units of measurements: m3/h
comment: [is aspect]
scope note: Collection of facts BAS
scope note: Collection of facts HYD
scope note: Collection of facts RGM
scope note: Collection of facts DMO
type: Class
subclass of: Capaciteit
subclass of: Restriction
  author at start life: Marinus Vonhof
  date of start life: 2020-04-18
  on class: Gemaal
  on property: has as aspect (inverse)
  max qualified cardinality: 1
subclass of: Restriction
  on property: has as value
  all values from: decimal

Slingergoot
definition: Een goot die zorgt voor een gecontroleerde en gelijkmatige toestroom van afvalwater. Hierdoor worden wervelingen, luchtinslag en vuilophoping voorkomen, wat direct bijdraagt aan een stabiele en efficiënte pompwerking.
author at start life: Marinus Vonhof
date of start life: 2026-07-20
scope note: Collection of facts BAS
type: Class
subclass of: Goot
subclass of: Restriction
  on property: heeft Functie
  has value: VoorkomenWervelingLuchtinslagVuilophoping
subclass of: Restriction
  on class: Gemaal
  on property: has as part (inverse)
  max qualified cardinality: 1

Gemaal droge opstelling
author of change: Marinus Vonhof
date of change: 2017-05-31
definition: Een gemaal waarbij de pompen zich buiten de ontvangput/kelder bevinden.
definition: [NEN 3300:1996] Gemaal ten minste bestaande uit een ontvangkelder en een pompenkelder. De pompen zijn buiten de ontvangkelder opgesteld
author at start life: Finy Teitsma (Oranjewoud)
date of start life: 2006-05-23
comment: 20151014: NEN3300-definitie aangepast
alternative label: Gemaal met droge pompopstelling
scope note: Collection of facts MDS
scope note: Collection of facts HYD
scope note: Collection of facts RGM
scope note: Collection of facts DMO
type: Class
subclass of: Rioolgemaal
subclass of: Restriction
  on property: heeft Uitvoering
  has value: OpstellingPompEnBuitenDeOntvangput kelder

Gemaal natte opstelling
author of change: Marinus Vonhof
date of change: 2019-05-15
definition: Een gemaal waarbij de pompen zich in de ontvangput/kelder bevinden.
definition: [NEN 3300:1996] gemaal waarbij de pomp in de ontvangkelder van het gemaal is opgesteld
author at start life: Finy Teitsma (Oranjewoud)
date of start life: 2006-05-23
alternative label: Gemaal met natte pompopstelling
scope note: Collection of facts MDS
scope note: Collection of facts HYD
scope note: Collection of facts RGM
scope note: Collection of facts DMO
type: Class
subclass of: Rioolgemaal
subclass of: Restriction
  author at start life: Marinus Vonhof
  date of start life: 2016-04-13
  on class: Natte pompkelder
  on property: has as part
  qualified cardinality: 1
subclass of: Restriction
  on property: heeft Uitvoering
  has value: OpstellingPompEnInDeOntvangput kelder

Natte pompkelder
author of change: Marinus Vonhof
date of change: 2019-05-15
definition: [NEN-EN 752:2008] ruimte die deel uitmaakt van een rioolgemaal waarin afvalwater wordt geloosd voordat het wordt verpompt. De ruimte kan pompapparatuur en leidingen onder water bevatten
author at start life: Marinus Vonhof
date of start life: 2012-04-29
alternative label: Ontvangkelder
scope note: Collection of facts BAS
scope note: Collection of facts RGM
type: Class
subclass of: Compartiment
subclass of: Restriction
  author at start life: Marinus Vonhof
  date of start life: 2016-04-13
  on class: Gemaal natte opstelling
  on property: has as part (inverse)
  qualified cardinality: 1

Gemeentelijk rioleringsplan
author of change: Marinus Vonhof
date of change: 2018-12-10
definition: [NEN 3300:1996] Document op grond van de Wet milieubeheer waarin het vastgestelde rioleringsbeleid van de gemeente is beschreven
definition: [Omgevingswet] Een document van een gemeente over het beheer van de riolering en het beheer van grondwater en hemelwater
author at start life: Marinus Vonhof
date of start life: 2014-11-29
see also: [IRIS-RIOKEN:2012] Financieel beleidstuk, waarin de onder andere in het BRP en het gemeentelijk waterplan geformuleerde doelen en maatregelen door de gemeente op investerings- en exploitatiegeld en een jaarlijkse fasering worden gezet.
alternative label: GRP
scope note: Collection of facts BAS
scope note: Collection of facts PLI
scope note: Collection of facts DMO
type: Class
subclass of: Rioleringsplan
subclass of: Restriction
  author of change: Marinus Vonhof
  date of change: 2018-12-13
  author at start life: Marinus Vonhof
  date of start life: 2014-11-29
  on class: Planvorming rioleringsbeheer
  on property: has as output (inverse)
  qualified cardinality: 1

Gemeentelijke taak
author of change: Marinus Vonhof
date of change: 2018-12-10
author at start life: Marinus Vonhof
date of start life: 2014-12-02
validity context: 6d
scope note: Collection of facts BAS
scope note: Collection of facts DMO
type: Class
subclass of: Activiteit

Gemengd afvalwater
author of change: Marinus Vonhof
date of change: 2021-09-11
definition: Water samengesteld uit twee of meer soorten afvalwater
notation: GMD
author at start life: Marinus Vonhof
date of start life: 2017-09-09
scope note: Collection of facts BAS
type: Class
subclass of: Afvalwater

NLCS_GWA
author of change: Marinus Vonhof
date of change: 2018-11-07
definition: Lijntype: RI-GWA
notation: 1664
author at start life: Marinus Vonhof
date of start life: 2018-10-27
scope note: Collection of facts NLCS
type: Class
subclass of: NLCS_Object
subclass of: Restriction
  author at start life: Marinus Vonhof
  date of start life: 2018-10-27
  on class: Gemengd riool
  on property: is represented by (inverse)
  max qualified cardinality: 1

Sym_GemengdRiool
author of change: Marinus Vonhof
date of change: 2018-11-11
definition: Standaard stijl: Lijntype doorgetrokken, Lijnkleur 255 127 0, Lijndikte 1.0
author at start life: Marinus Vonhof
date of start life: 2018-11-07
scope note: Collection of facts NLCS
type: Class
subclass of: Geo-symbool
subclass of: Restriction
  author at start life: Marinus Vonhof
  date of start life: 2018-11-07
  on class: Gemengd riool
  on property: is represented by (inverse)
  max qualified cardinality: 1

Vuilwaterstelsel
author of change: Johan Post
author of change: Eric van Gorkom
date of change: 2021-10-01
date of change: 2024-05-13
definition: Een vrijverval rioolstelsel bestemd voor de inzameling, het transport en de tijdelijke berging van vuilwater.
definition: [NEN 3300:1996] Dwa-rioolstelsel is synoniem van vuilwaterstelsel
definition: [NEN 3300:1996] rioolstelsel voor de inzameling en het transport van huishoudelijk- en bedrijfsafvalwater, niet zijnde neerslag
author at start life: Finy Teitsma (Oranjewoud)
date of start life: 2007-10-23
alternative label: DWA stelsel
alternative label: Dwa-rioolstelsel
alternative label: Vuilwaterrioolstelsel
scope note: Collection of facts TOP
type: Class
subclass of: Vrijverval rioolstelsel
subclass of: Restriction
  author of change: Marinus Vonhof
  date of change: 2016-04-22
  author at start life: Nic Roest (Idoro)
  date of start life: 2007-11-29
  on class: Gescheiden systeem
  on property: has as part (inverse)
  qualified cardinality: 1
subclass of: Restriction
  author at start life: Marinus Vonhof
  date of start life: 2015-03-01
  validity context: 5t 11t
  on class: Lozingspunt
  on property: has as part
  min qualified cardinality: 1
subclass of: Restriction
  author at start life: Marinus Vonhof
  date of start life: 2020-05-26
  on class: Rioolgemaal
  on property: has as part
  min qualified cardinality: 0
subclass of: Restriction
  author at start life: Marinus Vonhof
  date of start life: 2020-05-26
  on class: Vuilwaterriool
  on property: has as part
  min qualified cardinality: 1
subclass of: Restriction
  author at start life: Marinus Vonhof
  date of start life: 2022-10-03
  comment: 20160415: Inverse = optioneel, niet elke specialisatie zit in vv stelsel
  on class: Onderbemaling
  on property: has as part
  min qualified cardinality: 0
subclass of: Restriction
  author at start life: Marinus Vonhof
  date of start life: 2022-10-03
  on class: Gestuwd rioolstelsel
  on property: has as part
  min qualified cardinality: 0
subclass of: Restriction
  on class: Vrijverval rioolleiding
  on property: has as part
  min qualified cardinality: 0
subclass of: Restriction
  on property: heeft Functie
  has value: InzamelingVanVuilwater
subclass of: Restriction
  on property: heeft Functie
  has value: TijdelijkeBergingVanVuilwater
subclass of: Restriction
  on property: heeft Functie
  has value: TransportVanVuilwater
subclass of: Restriction
  on class: Sym Vuilwaterstelsel
  on property: is represented by
  max qualified cardinality: 1

Kolkaansluiting
definition: De aansluiting van een kolk op een rioolstelsel.
author at start life: Marinus Vonhof
date of start life: 2015-10-01
validity context: 1d 3d
scope note: Collection of facts MDS
scope note: Collection of facts RRB
scope note: Collection of facts LDR
type: Class
subclass of: Aansluiting
subclass of: Restriction
  author of change: Marinus Vonhof
  date of change: 2016-04-30
  author at start life: Finy Teitsma (Oranjewoud)
  date of start life: 2007-10-24
  on class: Gemengd rioolstelsel
  on property: has as part (inverse)
  max qualified cardinality: 1
subclass of: Restriction
  author of change: Marinus Vonhof
  date of change: 2016-04-30
  author at start life: Finy Teitsma (Oranjewoud)
  date of start life: 2007-10-24
  on class: Hemelwaterstelsel
  on property: has as part (inverse)
  max qualified cardinality: 1
subclass of: Restriction
  author of change: Marinus Vonhof
  date of change: 2019-04-03
  author at start life: Finy Teitsma (Oranjewoud)
  date of start life: 2007-11-30
  on class: Kolkaansluitleiding
  on property: has as part
  min qualified cardinality: 1
subclass of: Restriction
  author of change: Marinus Vonhof
  date of change: 2021-08-06
  author at start life: Finy Teitsma (Oranjewoud)
  date of start life: 2007-11-30
  on class: Kolk
  on property: has as part
  min qualified cardinality: 1
subclass of: Restriction
  on property: heeft Functie
  has value: AanvoerAfstromendHemelwaterVanafEenKolk
subclass of: Restriction
  on property: heeft Functie
  has value: InzamelingVanHemelwater
subclass of: Restriction
  on property: heeft Toepassing
  has value: KolkAansluitenOpRioolstelsel

Septictank
label: Septic tank @en
author of change: Marinus Vonhof
author of change: Johan Post
date of change: 2024-05-16
date of change: 2021-10-01
definition: Een reservoir waarbij het vuilwater bezinkt en op biologische wijze beperkt wordt gereinigd (een IBA klasse 1 is een specifieke uitvoering van een septictank).
definition: [EN 16323:2014] closed tank receiving wastewater for sedimentation and sludge digestion @en
definition: [NEN 3300:1996] Bezinkbak mede bestemd voor beperkte biologische afbraak van de verontreiniging in afvalwater
author at start life: Finy Teitsma (Oranjewoud)
date of start life: 2007-10-23
comment: 20151014: NEN3300-definitie aangepast
alternative label: Septische put
alternative label: Septische tank
scope note: Collection of facts BAS
type: Class
subclass of: IBA
subclass of: Restriction
  author at start life: Marinus Vonhof
  date of start life: 2016-04-22
  on class: Gemengd rioolstelsel
  on property: has as part (inverse)
  max qualified cardinality: 1
subclass of: Restriction
  author at start life: Marinus Vonhof
  date of start life: 2018-10-27
  on class: NLCS_VWA_SEPTICTANK
  on property: is represented by
  max qualified cardinality: 1
subclass of: Restriction
  on property: heeft Uitvoering
  has value: TankOfPut
subclass of: Restriction
  on class: Sym_IBA
  on property: is represented by
  max qualified cardinality: 1

Onderbemaling
author of change: Marinus Vonhof
author of change: Johan Post
author of change: Eric van Gorkom
date of change: 2025-01-16
date of change: 2021-10-01
date of change: 2024-05-13
definition: Een deel van een vrijverval rioolstelsel waarvan het ingezamelde afvalwater via een bemaling wordt opgevoerd naar een ander deel van hetzelfde stelsel. Tijdens hemelwaterafvoer functioneert het stelsel (inclusief onderbemalingen) hydraulisch gezien als een geheel.
author at start life: Marinus Vonhof
date of start life: 2016-04-19
scope note: Collection of facts BAS
type: Class
subclass of: Vrijverval rioolstelsel
subclass of: Extra objecttype (rol)
subclass of: Restriction
  author of change: Marinus Vonhof
  date of change: 2016-08-05
  author at start life: Marinus Vonhof
  date of start life: 2016-04-28
  on class: Rioolgemaal
  on property: has as part
  qualified cardinality: 1
subclass of: Restriction
  author of change: Marinus Vonhof
  date of change: 2018-05-03
  author at start life: Marinus Vonhof
  date of start life: 2016-04-19
  on class: Vrijverval rioolstelsel
  on property: has as part (inverse)
  max qualified cardinality: 1
subclass of: Restriction
  on property: heeft Functie
  has value: DoorBemalingGeregeldeAfvoer
subclass of: Restriction
  on class: Sym_Onderbemaling
  on property: is represented by
  max qualified cardinality: 1

Gestuwd rioolstelsel
author of change: Marinus Vonhof
author of change: Johan Post
author of change: Eric van Gorkom
date of change: 2025-01-16
date of change: 2024-05-16
date of change: 2024-05-13
date of change: 2024-04-27
definition: Een deel van een vrijverval rioolstelsel waarvan de (hemelwater)afvoer middels een stuwput of stuwriool wordt beperkt
author at start life: Johan Post
date of start life: 2022-09-29
alternative label: Gestuwd stelsel
scope note: Collection of facts BAS
type: Class
subclass of: Vrijverval rioolstelsel
subclass of: Extra objecttype (rol)
subclass of: Restriction
  author of change: Marinus Vonhof
  date of change: 2018-05-03
  author at start life: Marinus Vonhof
  date of start life: 2016-04-19
  on class: Vrijverval rioolstelsel
  on property: has as part (inverse)
  max qualified cardinality: 1
subclass of: Restriction
  on property: heeft Functie
  has value: DoorStuwingGeregeldeAfvoer

Sym_GemengdStelsel
author at start life: Johan Post
date of start life: 2021-10-01
scope note: Collection of facts NLCS
type: Class
subclass of: Geo-symbool
subclass of: Restriction
  author at start life: Marinus Vonhof
  date of start life: 2018-11-07
  on class: Gemengd rioolstelsel
  on property: is represented by (inverse)
  max qualified cardinality: 1

Gemengde perceelaansluitleiding
author of change: Marinus Vonhof
date of change: 2026-05-01
date of change: 2016-04-25
definition: Transport van afvalwater vanaf het perceel
author at start life: Marinus Vonhof
date of start life: 2013-02-05
scope note: Collection of facts MDS
type: Class
subclass of: Perceelaansluitleiding
subclass of: Restriction
  author at start life: Marinus Vonhof
  date of start life: 2018-10-27
  on class: NLCS_GWA_HUISAANSLUITING
  on property: is represented by
  max qualified cardinality: 1
subclass of: Restriction
  author at start life: Marinus Vonhof
  date of start life: 2018-11-07
  on class: Sym_Perceelaansluitleiding
  on property: is represented by
  max qualified cardinality: 1
subclass of: Restriction
  author at start life: Marinus Vonhof
  date of start life: 2019-10-08
  on class: Sym_GemengdePerceelaansluitleiding
  on property: is represented by
  max qualified cardinality: 1
subclass of: Restriction
  on property: heeft Functie
  has value: AanvoerVanHemelwaterEnVuilwater

NLCS_GWA_HUISAANSLUITING
author of change: Marinus Vonhof
date of change: 2018-11-07
definition: Lijntype: RI-GWA_HUISAANSLUITING
notation: 1667
author at start life: Marinus Vonhof
date of start life: 2018-10-27
scope note: Collection of facts NLCS
type: Class
subclass of: NLCS_Object
subclass of: Restriction
  author at start life: Marinus Vonhof
  date of start life: 2018-10-27
  on class: Gemengde perceelaansluitleiding
  on property: is represented by (inverse)
  max qualified cardinality: 1

Sym_GemengdePerceelaansluitleiding
definition: Standaard stijl: Lijntype doorgetrokken, Lijnkleur 255 127 0, Lijndikte 0.4
author at start life: Marinus Vonhof
date of start life: 2019-10-08
scope note: Collection of facts NLCS
type: Class
subclass of: Geo-symbool
subclass of: Restriction
  author at start life: Marinus Vonhof
  date of start life: 2019-10-08
  on class: Gemengde perceelaansluitleiding
  on property: is represented by (inverse)
  max qualified cardinality: 1

Geometrie
author of change: Marinus Vonhof
date of change: 2025-01-16
date of change: 2017-11-16
definition: [Gellish] Is a scale that is a measurement of spatial aspects. (This may otherwise be called geometry)
definition: [IMBOR] Een kenmerk waarmee de locatie van een object wordt vastgelegd.
author at start life: Marinus Vonhof
date of start life: 2016-10-14
units of measurements: gml
validity context: 15d
comment: [is aspect]
scope note: Collection of facts TOP
type: Class
subclass of: Kenmerk
subclass of: Restriction
  author at start life: Marinus Vonhof
  date of start life: 2016-11-09
  on class: Inwinning
  on property: has as aspect
  max qualified cardinality: 1
subclass of: Restriction
  on property: has as value
  all values from: gmlLiteral

Status maatregel (coll)
validity context: 6d
comment: [is coll]
scope note: Collection of facts MDS
scope note: Collection of facts MTR
type: Class
subclass of: Verzameling soorten
subclass of: Class
  one of: Uitgevoerd
  one of: Gepland
  one of: InUitvoering
  one of: InVoorbereiding
  one of: Vervallen

Sym_GescheidenSysteem
author at start life: Johan Post
date of start life: 2021-10-01
scope note: Collection of facts NLCS
type: Class
subclass of: Geo-symbool
subclass of: Restriction
  author at start life: Marinus Vonhof
  date of start life: 2018-11-07
  on class: Gescheiden systeem
  on property: is represented by (inverse)
  max qualified cardinality: 1

Gescheurde rubberring
definition: [NEN 3300:1996] Geen aanvullende definitie in NEN 3301
author at start life: Marinus Vonhof
date of start life: 2022-09-30
validity context: *d
scope note: Collection of facts BAS
type: Class
subclass of: NEN 3300 Term

Gesegmenteerde lining
label: Segmental linings @en
author of change: Marinus Vonhof
date of change: 2025-01-16
definition: [IMBOR] Nieuwe bekleding of een geheel nieuwe leiding die in een bestaande leiding wordt aangebracht bestaande uit meerdere segmenten die afzonderlijk worden aangebracht.
notation: D
author at start life: Marinus Vonhof
date of start life: 2018-12-12
comment: Bron afbeelding: www.unitracc.com
scope note: Collection of facts MDS
scope note: Collection of facts LDR
scope note: Collection of facts MTR
type: Class
subclass of: Lining
subclass of: Restriction
  on property: heeft Uitvoering
  has value: AfzonderlijkAangebrachteSegmenten

Gesloten verhard oppervlak hellend
author of change: Marinus Vonhof
date of change: 2018-12-05
definition: [Omgevingswet] (bij concept VerhardOppervlak) De verharding als gevolg waarvan neerslag niet of zeer beperkt in de bodem kan infiltreren
notation: GVH_HEL
author at start life: Marinus Vonhof
date of start life: 2011-12-15
units of measurements: m2
comment: [is aspect]
scope note: Collection of facts MDS
scope note: Collection of facts HYD
type: Class
subclass of: Afvoerend oppervlak hellend
subclass of: Restriction
  on property: has as value
  all values from: Gesloten verhard oppervlak hellend (datatype)

Gesloten verhard oppervlak vlak
definition: [Omgevingswet] (bij concept VerhardOppervlak) De verharding als gevolg waarvan neerslag niet of zeer beperkt in de bodem kan infiltreren
notation: GVH_VLA
author at start life: Marinus Vonhof
date of start life: 2011-12-15
units of measurements: m2
comment: [is aspect]
scope note: Collection of facts MDS
scope note: Collection of facts HYD
type: Class
subclass of: Afvoerend oppervlak vlak
subclass of: Restriction
  on property: has as value
  all values from: Gesloten verhard oppervlak vlak (datatype)

Gesloten verhard oppervlak vlak uitgestrekt
definition: [Omgevingswet] (bij concept VerhardOppervlak) De verharding als gevolg waarvan neerslag niet of zeer beperkt in de bodem kan infiltreren
notation: GVH_VLU
author at start life: Marinus Vonhof
date of start life: 2011-12-15
units of measurements: m2
comment: [is aspect]
scope note: Collection of facts MDS
scope note: Collection of facts HYD
type: Class
subclass of: Afvoerend oppervlak vlak uitgestrekt
subclass of: Restriction
  on property: has as value
  all values from: Gesloten verhard oppervlak vlak uitgestrekt (datatype)

Opgespoten lining
label: Sprayed lining @en
author of change: Marinus Vonhof
date of change: 2025-01-16
definition: [IMBOR] Nieuwe bekleding die in een bestaande leiding wordt aangebracht door middel van het spuiten van het materiaal van de lining tegen de wanden van de bestaande leiding.
notation: B
author at start life: Marinus Vonhof
date of start life: 2018-12-12
comment: Bron afbeelding: www.spray-liner.eu
scope note: Collection of facts MDS
scope note: Collection of facts LDR
scope note: Collection of facts MTR
type: Class
subclass of: Lining
subclass of: Restriction
  on property: heeft Uitvoering
  has value: GespotenOpBinnenwand

NLCS_HWA_GOOT
author of change: Marinus Vonhof
date of change: 2018-11-07
definition: Lijntype: CONTINUOUS
notation: 1789
author at start life: Marinus Vonhof
date of start life: 2018-10-27
scope note: Collection of facts NLCS
type: Class
subclass of: NLCS_Object
subclass of: Restriction
  author at start life: Marinus Vonhof
  date of start life: 2018-10-27
  on class: Goot
  on property: is represented by (inverse)
  max qualified cardinality: 1

Sym_Goot
definition: Standaard stijl: Lijntype doorgetrokken, Lijnkleur 50 160 50, Lijndikte 0.4
author at start life: Johan Post
date of start life: 2021-10-01
scope note: Collection of facts NLCS
type: Class
subclass of: Geo-symbool
subclass of: Restriction
  author at start life: Marinus Vonhof
  date of start life: 2019-10-08
  on class: Goot
  on property: is represented by (inverse)
  max qualified cardinality: 1
subclass of: Restriction
  on class: Lijngoot
  on property: is represented by (inverse)
  max qualified cardinality: 1
subclass of: Restriction
  on class: Roostergoot
  on property: is represented by (inverse)
  max qualified cardinality: 1
subclass of: Restriction
  on class: Taludgoot
  on property: is represented by (inverse)
  max qualified cardinality: 1
subclass of: Restriction
  on class: Verholen goot
  on property: is represented by (inverse)
  max qualified cardinality: 1

Gracht
author of change: Marinus Vonhof
date of change: 2025-01-16
definition: [IMBOR] Een waterloop die is aangelegd, bijvoorbeeld in een stad of langs andere bebouwing.
author at start life: Marinus Vonhof
date of start life: 2017-05-31
validity context: 1d 3d 10d 12d 14d
scope note: Collection of facts MDS
type: Class
subclass of: Waterloop
subclass of: Restriction
  on property: heeft Uitvoering
  has value: AangelegdInWoonkern

Grijs afvalwater
label: Grey water @en
author of change: Marinus Vonhof
date of change: 2016-04-24
definition: (Licht verontreinigd) huishoudelijk afvalwater afkomstig van douche/bad, keuken, afwas- en wasmachine, en niet afkomstig van toiletspoeling
definition: [EN 16323:2014] Domestic wastewater excluding wastewater from toilets and urinals @en
definition: [EN 16323:2014] Huishoudelijk afvalwater exclusief het afvalwater uit toiletten en urinoirs
author at start life: Marinus Vonhof
date of start life: 2016-04-15
scope note: Collection of facts BAS
type: Class
subclass of: Afvalwater

Grondsoort (coll)
comment: [is coll]
scope note: Collection of facts BAS
type: Class
subclass of: Verzameling soorten
subclass of: Class
  one of: Zand
  one of: ZandKlei
  one of: KleiZand
  one of: Klei
  one of: ZwareKlei
  one of: Veen
  one of: Grind
  one of: Leem
  one of: Loss
  one of: ZandGrind

Groen afvalwater
author at start life: Marinus Vonhof
date of start life: 2020-04-18
see also: [Saniwijzer] Het spoelwater van het toilet, met urine en fecaliën, aangevuld met de groene fractie uit de keuken afkomstig van een voedselrestenvermaler (wettelijk is afvoer daaruit naar de riolering overigens niet toegestaan)
scope note: Collection of facts BAS
type: Class
subclass of: Afvalwater

Groene berging
definition: [NEN 3300:1996] Omdijkt of verdiept gelegen gebied met groenvoorziening bestemd voor de tijdelijke opslag van voorbezonken afvalwater
author at start life: Marinus Vonhof
date of start life: 2022-09-30
validity context: *d
scope note: Collection of facts BAS
type: Class
subclass of: NEN 3300 Term

Radarmeting
author of change: Marinus Vonhof
date of change: 2018-05-01
author at start life: Marinus Vonhof
date of start life: 2014-12-02
validity context: 6d
scope note: Collection of facts BAS
scope note: Collection of facts MTR
type: Class
subclass of: Onderzoeken

Grondslag maatregel
author of change: Marinus Vonhof
date of change: 2019-03-14
author at start life: Marinus Vonhof
date of start life: 2013-03-26
validity context: 6d
comment: [is aspect]
scope note: Collection of facts BAS
scope note: Collection of facts MTR
type: Class
subclass of: Kenmerk
subclass of: Restriction
  author of change: Marinus Vonhof
  date of change: 2019-03-14
  author at start life: Marinus Vonhof
  date of start life: 2013-03-26
  on class: Maatregel
  on property: has as aspect (inverse)
  max qualified cardinality: 1
subclass of: Restriction
  on property: has as reference (qualification)
  all values from: Grondslag maatregel (coll)

Grondsoort
author of change: Marinus Vonhof
author of change: Nic Roest (Idoro)
date of change: 2025-01-16
date of change: 2006-11-23
definition: Grondsoort waarin het onderdeel ligt.
definition: [IMBOR] Afbakening van de bodem op basis van de binnen een gebied prevalente constituenten van de grond, mede ten behoeve van het gebruik als ondergrond.
author at start life: Nic Roest (Idoro)
date of start life: 2006-02-21
comment: [is aspect]
scope note: Collection of facts BAS
type: Class
subclass of: Kenmerk
subclass of: Restriction
  author of change: Marinus Vonhof
  date of change: 2014-07-11
  author at start life: Nic Roest (Idoro)
  date of start life: 2007-11-29
  on class: Ondergrond
  on property: has as aspect (inverse)
  max qualified cardinality: 1
subclass of: Restriction
  on property: has as reference (qualification)
  all values from: Grondsoort (coll)

Grondverbetering
author of change: Marinus Vonhof
date of change: 2025-01-16
date of change: 2021-08-06
definition: Fundering op staal waarbij de slappe grond, vaak veen of klei, verbeterd is om het draagvermogen te vergroten.
definition: [IMBOR] Het verbeteren van slappe grond, meestal veen of klei, om het draagvermogen te vergroten.
author at start life: Marinus Vonhof
date of start life: 2013-10-05
validity context: 1d 10d
alternative label: Staal op grondverbetering
scope note: Collection of facts BAS
scope note: Collection of facts RGM
type: Class
subclass of: Fundering
subclass of: Restriction
  on property: heeft Uitvoering
  has value: GrondMetVerbeterdDraagvermogen

Grondwatersamenstellingsonderzoek
author at start life: Marinus Vonhof
date of start life: 2020-04-17
validity context: 6d
scope note: Collection of facts BAS
scope note: Collection of facts DMO
type: Class
subclass of: Onderzoeken
subclass of: Restriction
  author at start life: Marinus Vonhof
  date of start life: 2020-04-17
  on class: Grondwater
  on property: has as input
  qualified cardinality: 1

Grondwatermeetnet
author of change: Marinus Vonhof
author of change: Eric van Gorkom
date of change: 2024-05-13
date of change: 2020-03-17
author at start life: Marinus Vonhof
date of start life: 2013-03-26
validity context: 6d
see also: [BRO] Een verzameling locaties waar periodiek onderzoek aan het grondwater op een bepaalde diepte wordt gedaan om de toestand van het grondwater vanuit een perspectief te kunnen bepalen en de eventuele veranderingen erin te kunnen volgen
alternative label: Grondwatermonitoringsnet
scope note: Collection of facts BAS
type: Class
subclass of: Systeem
subclass of: Restriction
  author at start life: Marinus Vonhof
  date of start life: 2012-04-29
  on class: Peilbuis
  on property: has as part
  min qualified cardinality: 0
subclass of: Restriction
  author at start life: Marinus Vonhof
  date of start life: 2013-03-26
  on class: Grondwatermeetpunt
  on property: has as part
  min qualified cardinality: 1
subclass of: Restriction
  author at start life: Marinus Vonhof
  date of start life: 2013-12-06
  on class: Grondwatersysteem
  on property: has as part (inverse)
  qualified cardinality: 1
subclass of: Restriction
  on property: heeft Functie
  has value: MetenGrondwaterstand

Peilbuis
author of change: Marinus Vonhof
author of change: Johan Post
date of change: 2025-01-16
date of change: 2021-10-01
date of change: 2026-05-01
definition: [IMBOR] Buis, eventueel met een filter, die in de grond wordt gebracht om het grondwaterpeil te bepalen.
author at start life: Marinus Vonhof
date of start life: 2013-10-04
validity context: 14d
see also: [BRO] De putconstructie die gebruikt wordt om, gedurende langere tijd, standen en/of de samenstelling van het grondwater te meten
see also: [IMGeo:1.0/2007] Buis waarmee men de grondwaterstand meet of waarin men monsters neemt van het grondwater.
alternative label: Grondwatermonitoringsput
alternative label: Peilbuis (type installatie)
scope note: Collection of facts BAS
type: Class
subclass of: Meetinstrument
subclass of: Restriction
  author at start life: Marinus Vonhof
  date of start life: 2012-04-29
  on class: Grondwatermeetnet
  on property: has as part (inverse)
  max qualified cardinality: 1
subclass of: Restriction
  author at start life: Marinus Vonhof
  date of start life: 2021-08-06
  on class: Peilbuisdeksel
  on property: has as part
  max qualified cardinality: 1
subclass of: Restriction
  on property: heeft Functie
  has value: MetenGrondwaterstand
subclass of: Restriction
  on class: Schutkoker
  on property: has as part
  max qualified cardinality: 1
subclass of: Restriction
  on class: Sym_Peilbuis
  on property: is represented by
  max qualified cardinality: 1

Grondwatermeetpunt
author of change: Marinus Vonhof
date of change: 2017-05-17
definition: Het meetpunt van de grondwaterstand
author at start life: Marinus Vonhof
date of start life: 2013-03-26
validity context: *d
scope note: Collection of facts BAS
type: Class
subclass of: Meetpunt
subclass of: Restriction
  author of change: Marinus Vonhof
  date of change: 2017-05-17
  author at start life: Marinus Vonhof
  date of start life: 2013-03-26
  on class: Grondwaterniveau
  on property: has as aspect
  max qualified cardinality: 1
subclass of: Restriction
  author of change: Marinus Vonhof
  date of change: 2017-12-12
  author at start life: Marinus Vonhof
  date of start life: 2013-03-26
  on class: Putoriëntatie
  on property: is connected to
  max qualified cardinality: 1
subclass of: Restriction
  author at start life: Marinus Vonhof
  date of start life: 2013-03-26
  on class: Grondwatermeetnet
  on property: has as part (inverse)
  qualified cardinality: 1

Meetpunt
author of change: Marinus Vonhof
date of change: 2017-05-17
author at start life: Marinus Vonhof
date of start life: 2014-11-30
validity context: 1d 3d 5d 10d 12d 14d
see also: [IHW:20130706] Aanduiding van een plaats of gebied waar een meting is/wordt verricht.
see also: [IRIS-RIOKEN:2012] Een fysiek punt waar een rechtstreekse meting en/of een monstername plaatsvindt.
scope note: Collection of facts BAS
type: Class
subclass of: Vertex
subclass of: Restriction
  author of change: Marinus Vonhof
  date of change: 2020-04-18
  author at start life: Marinus Vonhof
  date of start life: 2016-11-09
  comment: Temporeel kenmerk, met kenmerk Inwinning
  on class: Punt
  on property: has as aspect
  qualified cardinality: 1
subclass of: Restriction
  author at start life: Marinus Vonhof
  date of start life: 2015-07-09
  on class: Meetinstrument
  on property: has as aspect (inverse)
  max qualified cardinality: 1

Grondwaterniveau
author of change: Marinus Vonhof
date of change: 2018-12-05
definition: [Omgevingswet] De hoogte van een punt waar het grondwater een drukhoogte gelijk nul heeft (de absolute waterdruk is dan gelijk aan de druk van de atmosfeer) ten opzichte van een referentieniveau
author at start life: Marinus Vonhof
date of start life: 2013-03-26
units of measurements: m
validity context: *d
alternative label: Grondwaterpeil
alternative label: Grondwaterstand
comment: [is aspect]
scope note: Collection of facts BAS
scope note: Collection of facts HYD
type: Class
subclass of: Hoogte t.o.v. NAP
subclass of: Restriction
  author of change: Marinus Vonhof
  date of change: 2017-05-17
  author at start life: Marinus Vonhof
  date of start life: 2013-03-26
  on class: Grondwatermeetpunt
  on property: has as aspect (inverse)
  max qualified cardinality: 1
subclass of: Restriction
  on property: has as value
  all values from: decimal

H2S sensor
definition: Een instrument dat de hoeveelheid H2S-gas meet.
author at start life: Marinus Vonhof
date of start life: 2026-08-04
scope note: Collection of facts BAS
scope note: Collection of facts RGM
type: Class
subclass of: Gasmeter
subclass of: Restriction
  on class: Vacuümpompstation
  on property: has as part (inverse)
  max qualified cardinality: 1
subclass of: Restriction
  on property: heeft Functie
  has value: MetenVanH2sGas

Vacuümpompstation
author of change: Marinus Vonhof
author of change: Johan Post
date of change: 2021-10-01
date of change: 2026-05-21
date of change: 2026-07-20
definition: Een technische installatie waarmee onderdruk wordt gecreëerd om het afvalwater te transporteren
definition: [NEN 3300:1996] Onderdrukpompstation is synoniem van vacuümpompstation
definition: [NEN 3300:1996] pompstation voor het in stand houden van de onderdruk in vacuümafvoerleidingen en voor het vervolgens onder overdruk verder transporten van het afvalwater
author at start life: Marinus Vonhof
date of start life: 2012-04-29
validity context: 1d
alternative label: Onderdrukpompstation
alternative label: Vacuümgemaal
scope note: Collection of facts MDS
scope note: Collection of facts HYD
scope note: Collection of facts RGM
scope note: Collection of facts DMO
type: Class
subclass of: Rioolgemaal
subclass of: Restriction
  author of change: Marinus Vonhof
  date of change: 2026-07-16
  author at start life: Johan Post
  date of start life: 2026-05-21
  on class: Stankfilter
  on property: has as part
  max qualified cardinality: 1
subclass of: Restriction
  author of change: Marinus Vonhof
  date of change: 2018-11-10
  author at start life: Marinus Vonhof
  date of start life: 2018-10-27
  on class: NLCS_VACUUMLEIDING_GEMAAL
  on property: is represented by
  max qualified cardinality: 1
subclass of: Restriction
  author at start life: Marinus Vonhof
  date of start life: 2013-09-14
  on class: Vacuümriolering
  on property: has as part (inverse)
  qualified cardinality: 1
subclass of: Restriction
  author at start life: Marinus Vonhof
  date of start life: 2026-07-15
  on class: Waterafscheider
  on property: has as part
  max qualified cardinality: 1
subclass of: Restriction
  author at start life: Marinus Vonhof
  date of start life: 2026-07-15
  on class: Ventilator
  on property: has as part
  min qualified cardinality: 0
subclass of: Restriction
  author at start life: Marinus Vonhof
  date of start life: 2026-07-15
  on class: Verwarmingsunit
  on property: has as part
  min qualified cardinality: 0
subclass of: Restriction
  author at start life: Marinus Vonhof
  date of start life: 2026-08-04
  on class: H2S sensor
  on property: has as part
  max qualified cardinality: 1
subclass of: Restriction
  author at start life: Marinus Vonhof
  date of start life: 2026-08-04
  on class: Vacuumpomp
  on property: has as part
  min qualified cardinality: 1
subclass of: Restriction
  author at start life: Marinus Vonhof
  date of start life: 2026-08-05
  on class: Perspomp
  on property: has as part
  min qualified cardinality: 1
subclass of: Restriction
  on property: heeft Functie
  has value: InStandHoudenOnderdruk
subclass of: Restriction
  on class: Sym_Vacuumgemaal
  on property: is represented by
  max qualified cardinality: 1

Haven
author of change: Marinus Vonhof
date of change: 2025-01-16
definition: [IMBOR] Deels omsloten watervlakte waarbij de omsluitende objecten gebruikt kunnen worden als ligplaats of aanlegplaats voor vaartuigen, voornamelijk voor schepen.
author at start life: Marinus Vonhof
date of start life: 2017-05-31
validity context: 1d 3d 10d 12d 14d
scope note: Collection of facts MDS
type: Class
subclass of: Watervlakte
subclass of: Restriction
  on property: heeft Functie
  has value: LigplaatsFaciliteren

Watervlakte
author of change: Marinus Vonhof
date of change: 2025-01-16
definition: [IMBOR] Een aan het oppervlak gelegen, niet lijnvormige, natuurlijke dan wel kunstmatige verdieping van de bodem die, eventueel periodiek, gevuld is met water.
author at start life: Marinus Vonhof
date of start life: 2017-05-31
validity context: 1d 3d 10d 12d 14d
scope note: Collection of facts MDS
type: Class
subclass of: Oppervlaktewater
subclass of: Restriction
  on property: heeft Structuur
  has value: UitgestrektOppervlaktewater

Heffingsmaatstaf
definition: [NEN 3300:1996] De maatstaf waarop de individuele aanslagen in een gemeentelijke heffing worden gebaseerd
author at start life: Marinus Vonhof
date of start life: 2022-09-30
validity context: *d
scope note: Collection of facts BAS
type: Class
subclass of: NEN 3300 Term

IBA Klasse IIIa
author of change: Marinus Vonhof
author of change: Johan Post
date of change: 2025-01-16
date of change: 2021-10-01
definition: Als IBA klasse II en verwijdert ook stikstof
definition: [IMBOR] Een septische tank die met name zwevende stoffen en stikstof verwijderd.
author at start life: Marinus Vonhof
date of start life: 2014-08-01
scope note: Collection of facts BAS
type: Class
subclass of: IBA
subclass of: Restriction
  on property: heeft Functie
  has value: VerwijderenStikstof
subclass of: Restriction
  on property: heeft Functie
  has value: VerwijderenZwevendeStoffen
subclass of: Restriction
  on class: Sym_IBAKlasseIII
  on property: is represented by
  max qualified cardinality: 1

Sym_Infiltratievoorziening
author at start life: Johan Post
date of start life: 2021-10-01
scope note: Collection of facts NLCS
type: Class
subclass of: Geo-symbool
subclass of: Restriction
  author at start life: Marinus Vonhof
  date of start life: 2018-11-07
  on class: Helofytenfilter
  on property: is represented by (inverse)
  max qualified cardinality: 1
subclass of: Restriction
  on class: Infiltratiebassin
  on property: is represented by (inverse)
  max qualified cardinality: 1
subclass of: Restriction
  on class: Infiltratiegreppel
  on property: is represented by (inverse)
  max qualified cardinality: 1
subclass of: Restriction
  on class: Infiltratiekoffer
  on property: is represented by (inverse)
  max qualified cardinality: 1

Hemelwater
label: Rainwater @en
author of change: Marinus Vonhof
author of change: Johan Post
date of change: 2020-04-20
date of change: 2020-04-30
definition: Water afkomstig van neerslag
definition: [EN 16323:2014] Water arising from atmospheric precipitation, which has not yet collected matter from the surface @en
author at start life: Marinus Vonhof
date of start life: 2016-04-24
scope note: Collection of facts BAS
type: Class
subclass of: Water

Sym_Hemelwaterriool
author of change: Marinus Vonhof
date of change: 2018-11-10
definition: Standaard stijl: Lijntype doorgetrokken, Lijnkleur 0 0 255, Lijndikte 1.0
author at start life: Marinus Vonhof
date of start life: 2018-11-07
scope note: Collection of facts NLCS
type: Class
subclass of: Geo-symbool
subclass of: Restriction
  author of change: Marinus Vonhof
  date of change: 2018-11-10
  author at start life: Marinus Vonhof
  date of start life: 2018-11-07
  on class: Hemelwaterriool
  on property: is represented by (inverse)
  max qualified cardinality: 1

Lateraal debiet HWA
author of change: Johan Post
date of change: 2022-11-25
definition: HWA lozingsdebiet vanuit ander rioolstelsel
author at start life: Marinus Vonhof
date of start life: 2017-08-31
units of measurements: m3/h
comment: [is aspect]
scope note: Collection of facts HYD
type: Class
subclass of: Lateraal debiet
subclass of: Restriction
  author at start life: Marinus Vonhof
  date of start life: 2017-08-31
  on class: Hemelwaterriool
  on property: has as aspect (inverse)
  max qualified cardinality: 1
subclass of: Restriction
  on property: has as value
  all values from: decimal

NLCS_HWA
author of change: Marinus Vonhof
date of change: 2018-11-07
definition: Lijntype: RI-HWA
notation: 1786
author at start life: Marinus Vonhof
date of start life: 2018-10-27
scope note: Collection of facts NLCS
type: Class
subclass of: NLCS_Object
subclass of: Restriction
  author at start life: Marinus Vonhof
  date of start life: 2018-10-27
  on class: Hemelwaterriool
  on property: is represented by (inverse)
  max qualified cardinality: 1

Uitlaat (punt)
author of change: Marinus Vonhof
author of change: Johan Post
date of change: 2026-05-21
date of change: 2020-04-18
definition: Het punt waar uitstroming van water uit een uiteinde-opening van een leiding naar het oppervlaktewater mogelijk is, zonder dat sprake is van een civieltechnisch bouwwerk of vormgegeven uitstroomconstructie.
author at start life: Nic Roest (Idoro)
date of start life: 2006-03-23
alternative label: Modelrand
alternative label: Uitmonding
scope note: Collection of facts MDS
scope note: Collection of facts HYD
type: Class
subclass of: Aansluitpunt
subclass of: Restriction
  author of change: Marinus Vonhof
  date of change: 2024-05-16
  date of change: 2017-03-28
  author at start life: Finy Teitsma (Oranjewoud)
  date of start life: 2006-02-25
  validity context: *t
  on class: Waterdeel
  on property: is connected to
  qualified cardinality: 1
subclass of: Restriction
  author at start life: Marinus Vonhof
  date of start life: 2016-04-24
  validity context: 5t 11t
  on class: Uitlaatconstructie
  on property: has as aspect (inverse)
  max qualified cardinality: 1
subclass of: Restriction
  author at start life: Marinus Vonhof
  date of start life: 2018-11-07
  on class: Sym_UitlaatPunt
  on property: is represented by
  max qualified cardinality: 1

Sym_Hemelwaterstelsel
author at start life: Johan Post
date of start life: 2021-10-01
scope note: Collection of facts NLCS
type: Class
subclass of: Geo-symbool
subclass of: Restriction
  author at start life: Marinus Vonhof
  date of start life: 2018-11-07
  on class: Hemelwaterstelsel
  on property: is represented by (inverse)
  max qualified cardinality: 1

Keuring hijsinrichting
author of change: Marinus Vonhof
date of change: 2018-05-01
author at start life: Marinus Vonhof
date of start life: 2015-07-28
validity context: 1d 3d 6d 10d 12d 14d
scope note: Collection of facts MDS
scope note: Collection of facts MTR
type: Class
subclass of: Onderzoeken
subclass of: Restriction
  author at start life: Marinus Vonhof
  date of start life: 2015-07-28
  on class: Hijsinrichting
  on property: has as input
  qualified cardinality: 1

Hoekverdraaiing
definition: [NEN 3300:1996] Een afwijking van de asrichting van een buis ten opzichte van de asrichting van de aanliggende buis
author at start life: Marinus Vonhof
date of start life: 2022-09-30
validity context: *d
scope note: Collection of facts BAS
type: Class
subclass of: NEN 3300 Term

Hondenhokput
author of change: Johan Post
date of change: 2026-05-01
definition: Een put die over een bestaande leiding heen is gebouwd, waarna de buis binnenin de put is verbroken
author at start life: Marinus Vonhof
date of start life: 2018-12-05
alternative label: Hondenhok
scope note: Collection of facts MDS
scope note: Collection of facts HYD
type: Class
subclass of: Inspectieput
subclass of: Restriction
  on property: heeft Technologie
  has value: OverBestaandeLeidingGebouwd

Hoofdpost
author of change: Marinus Vonhof
date of change: 2025-01-16
definition: Voorziening voor monitoren en besturen van instrumenten
author at start life: Marinus Vonhof
date of start life: 2018-12-06
validity context: 1d 3d 10d 12d 14d
scope note: Collection of facts BAS
type: Class
subclass of: Apparatuur
subclass of: Restriction
  author at start life: Marinus Vonhof
  date of start life: 2018-12-06
  on class: Meetinstrument
  on property: is connected to
  max qualified cardinality: 1
subclass of: Restriction
  on property: heeft Doel
  has value: MonitorenEnBesturenVanApparatuur

Hoogspanningskabel
author of change: Marinus Vonhof
author of change: Johan Post
date of change: 2025-01-16
date of change: 2021-10-01
author at start life: Marinus Vonhof
date of start life: 2015-07-28
validity context: 1d 3d
see also: [IMKL: 1.1/2008] HS = hoogspanning (36 tot en met 220 kV)
scope note: Collection of facts BAS
type: Class
subclass of: Voedingskabel
subclass of: Restriction
  on property: heeft Uitvoering
  has value: OntworpenVoorHoogspanning
subclass of: Restriction
  on class: Sym_Kabel
  on property: is represented by
  max qualified cardinality: 1

Voedingskabel
author of change: Marinus Vonhof
author of change: Johan post
date of change: 2025-01-16
date of change: 2021-10-10
definition: [IMBOR] Kabel voor geleiding van energie.
author at start life: Marinus Vonhof
date of start life: 2014-08-01
scope note: Collection of facts BAS
type: Class
subclass of: Kabel
subclass of: Restriction
  on property: heeft Functie
  has value: VoortgeleidingVanEnergie
subclass of: Restriction
  on class: Sym_Kabel
  on property: is represented by
  max qualified cardinality: 1

Hoogte
author of change: Marinus Vonhof
date of change: 2015-05-29
definition: In de richting haaks op het horizontale vlak
author at start life: Nic Roest (Idoro)
date of start life: 2006-02-21
units of measurements: mm
validity context: 15d
comment: [is aspect]
scope note: Collection of facts TOP
type: Class
subclass of: Afstand
subclass of: Restriction
  on property: has as value
  all values from: integer

Hoogte hulpstuk
label: Height @en
definition: De bij het materiaal gebruikelijke aanduiding van de hoogte van een hulpstuk.
author at start life: Johan Post
date of start life: 2026-05-18
units of measurements: mm
comment: Intrinsiek aspect
comment: [is aspect]
scope note: Collection of facts BAS
scope note: Collection of facts PLI
type: Class
subclass of: Hoogte
subclass of: Restriction
  on property: has as value
  all values from: Hoogte hulpstuk (datatype)
subclass of: Restriction
  on class: Hulpstuk
  on property: has as aspect (inverse)
  max qualified cardinality: 1

Hoogte put
author of change: Marinus Vonhof
author of change: Eric van Gorkom
date of change: 2021-08-06
date of change: 2024-05-13
definition: De inwendige hoogte (verticaal, vanuit het zijaanzicht). De afstand van binnenonderkant tot binnenbovenkant putconstructie (inclusief onderbak) - zie afbeelding C+F (bron EN13508-2)
author at start life: Marinus Vonhof
date of start life: 2014-08-01
units of measurements: mm
comment: Intrinsiek aspect
comment: [is aspect]
scope note: Collection of facts TOP
type: Class
subclass of: Hoogte
subclass of: Restriction
  author of change: Marinus Vonhof
  date of change: 2014-08-01
  author at start life: Finy Teitsma (Oranjewoud)
  date of start life: 2006-02-25
  validity context: 5t 11t
  on class: Put
  on property: has as aspect (inverse)
  max qualified cardinality: 1
subclass of: Restriction
  on property: has as value
  all values from: Hoogte put (datatype)

Hoogte stellaag
definition: De hoogte van de stellaag (verticaal, vanuit het zijaanzicht)
author at start life: Marinus Vonhof
date of start life: 2024-05-18
units of measurements: mm
comment: Intrinsiek aspect
comment: [is aspect]
scope note: Collection of facts REV
scope note: Collection of facts BAS
type: Class
subclass of: Hoogte
subclass of: Restriction
  on property: has as value
  all values from: integer
subclass of: Restriction
  on class: Stellaag
  on property: has as aspect (inverse)
  max qualified cardinality: 1

Stellaag
author of change: Marinus Vonhof
date of change: 2025-01-16
definition: De - meestal uit baksteen bestaande - verhoging van de putschacht om de putdeksel op maaiveldhoogte te brengen
author at start life: Eric van Gorkom
date of start life: 2024-05-13
date of start life: 2024-05-18
validity context: 10d
scope note: Collection of facts REV
scope note: Collection of facts BAS
type: Class
subclass of: Constructieonderdeel
subclass of: Restriction
  on property: heeft Uitvoering
  has value: BestaatMeestalUitBaksteen
subclass of: Restriction
  on property: heeft Doel
  has value: PutdekselOpMaaiveldhoogteBrengen
subclass of: Restriction
  on property: heeft Uitvoering
  has value: VerhogingPutschacht
subclass of: Restriction
  on class: Hoogte stellaag
  on property: has as aspect
  max qualified cardinality: 1
subclass of: Restriction
  on class: Put
  on property: has as part (inverse)
  max qualified cardinality: 1

Horizontale drainage
author of change: Finy Teitsma (Oranjewoud)
date of change: 2007-10-25
definition: Drainage ter beheersing van de grondwaterstand en/of ter regulering van de afwatering.
author at start life: Finy Teitsma (Oranjewoud)
date of start life: 2007-10-23
scope note: Collection of facts BAS
type: Class
subclass of: Drainagestelsel
subclass of: Restriction
  on property: heeft Uitvoering
  has value: Horizontaal

Huishoudelijk afvalwater
author of change: Marinus Vonhof
date of change: 2020-04-18
definition: [NEN 3300:1996] Afvalwater uit particuliere huishoudens
definition: [NEN-EN 752:2008] afvalwater uit particuliere huishoudens afkomstig van keukens, toiletten, badkamers, wasmachines en dergelijke [EN 1085:2007, definitie 2030]
definition: [Waterwet] Afvalwater dat overwegend afkomstig is van menselijke stofwisseling en huishoudelijke werkzaamheden
author at start life: Marinus Vonhof
date of start life: 2016-04-07
see also: [Saniwijzer] Het normale huishoudelijke afvalwater, bestaand uit al het water van toilet, keuken, badkamer en wasmachine
scope note: Collection of facts BAS
scope note: Collection of facts DMO
type: Class
subclass of: Afvalwater

Huisnummer
author of change: Marinus Vonhof
date of change: 2025-01-16
definition: [IMBOR] Nummer dat is toegekend aan het object zelf of toebehoort aan een nabijgelegen gebouw om het adres van een object met de overige adresgegevens vast te kunnen leggen.
author at start life: Marinus Vonhof
date of start life: 2014-12-23
comment: [is aspect]
scope note: Collection of facts BAS
scope note: Collection of facts DMO
type: Class
subclass of: Perceelnummer

Perceelnummer
author of change: Marinus Vonhof
date of change: 2015-02-28
author at start life: Marinus Vonhof
date of start life: 2013-02-05
comment: [is aspect]
scope note: Collection of facts BAS
scope note: Collection of facts DMO
type: Class
subclass of: Unieke identificatie

Lengte hulpstuk
definition: Lengte van een hulpstuk
author at start life: Johan Post
date of start life: 2026-05-18
units of measurements: m
comment: [is aspect]
scope note: Collection of facts BAS
scope note: Collection of facts PLI
type: Class
subclass of: Lengte
subclass of: Restriction
  author at start life: Marinus Vonhof
  date of start life: 2013-03-29
  on class: Hulpstuk
  on property: has as aspect (inverse)
  max qualified cardinality: 1
subclass of: Restriction
  on property: has as value
  all values from: decimal

NLCS_DRAINAGE_HULPSTUK
author of change: Marinus Vonhof
date of change: 2018-11-07
definition: Lijntype: CONTINUOUS
notation: 1653
author at start life: Marinus Vonhof
date of start life: 2018-10-27
scope note: Collection of facts NLCS
type: Class
subclass of: NLCS_Object
subclass of: Restriction
  author at start life: Marinus Vonhof
  date of start life: 2018-10-27
  on class: Hulpstuk
  on property: is represented by (inverse)
  max qualified cardinality: 1

NLCS_GWA_HULPSTUK
author of change: Marinus Vonhof
date of change: 2018-11-07
definition: Lijntype: CONTINUOUS
notation: 1681
author at start life: Marinus Vonhof
date of start life: 2018-10-27
scope note: Collection of facts NLCS
type: Class
subclass of: NLCS_Object
subclass of: Restriction
  author at start life: Marinus Vonhof
  date of start life: 2018-10-27
  on class: Hulpstuk
  on property: is represented by (inverse)
  max qualified cardinality: 1

NLCS_HWA_HULPSTUK
author of change: Marinus Vonhof
date of change: 2018-11-07
definition: Lijntype: CONTINUOUS
notation: 1809
author at start life: Marinus Vonhof
date of start life: 2018-10-27
scope note: Collection of facts NLCS
type: Class
subclass of: NLCS_Object
subclass of: Restriction
  author at start life: Marinus Vonhof
  date of start life: 2018-10-27
  on class: Hulpstuk
  on property: is represented by (inverse)
  max qualified cardinality: 1

NLCS_ITR_HULPSTUK
author of change: Marinus Vonhof
date of change: 2018-11-07
definition: Lijntype: CONTINUOUS
notation: 1958
author at start life: Marinus Vonhof
date of start life: 2018-10-27
scope note: Collection of facts NLCS
type: Class
subclass of: NLCS_Object
subclass of: Restriction
  author at start life: Marinus Vonhof
  date of start life: 2018-10-27
  on class: Hulpstuk
  on property: is represented by (inverse)
  max qualified cardinality: 1

NLCS_PERSLEIDING_HULPSTUK
author of change: Marinus Vonhof
date of change: 2018-11-07
definition: Lijntype: CONTINUOUS
notation: 2068
author at start life: Marinus Vonhof
date of start life: 2018-10-27
scope note: Collection of facts NLCS
type: Class
subclass of: NLCS_Object
subclass of: Restriction
  author at start life: Marinus Vonhof
  date of start life: 2018-10-27
  on class: Hulpstuk
  on property: is represented by (inverse)
  max qualified cardinality: 1

NLCS_SWA_HULPSTUK
author of change: Marinus Vonhof
date of change: 2018-11-07
definition: Lijntype: CONTINUOUS
notation: 2086
author at start life: Marinus Vonhof
date of start life: 2018-10-27
scope note: Collection of facts NLCS
type: Class
subclass of: NLCS_Object
subclass of: Restriction
  author at start life: Marinus Vonhof
  date of start life: 2018-10-27
  on class: Hulpstuk
  on property: is represented by (inverse)
  max qualified cardinality: 1

NLCS_VACUUMLEIDING_HULPSTUK
author of change: Marinus Vonhof
date of change: 2018-11-07
definition: Lijntype: CONTINUOUS
notation: 2208
author at start life: Marinus Vonhof
date of start life: 2018-10-27
scope note: Collection of facts NLCS
type: Class
subclass of: NLCS_Object
subclass of: Restriction
  author at start life: Marinus Vonhof
  date of start life: 2018-10-27
  on class: Hulpstuk
  on property: is represented by (inverse)
  max qualified cardinality: 1

NLCS_VWA_HULPSTUK
author of change: Marinus Vonhof
date of change: 2018-11-07
definition: Lijntype: CONTINUOUS
notation: 2241
author at start life: Marinus Vonhof
date of start life: 2018-10-27
scope note: Collection of facts NLCS
type: Class
subclass of: NLCS_Object
subclass of: Restriction
  author at start life: Marinus Vonhof
  date of start life: 2018-10-27
  on class: Hulpstuk
  on property: is represented by (inverse)
  max qualified cardinality: 1

Materiaal hulpstuk
author at start life: Marinus Vonhof
date of start life: 2021-08-05
validity context: 5t 11t
comment: Intrinsiek aspect
comment: [is aspect]
scope note: Collection of facts BAS
scope note: Collection of facts PLI
type: Class
subclass of: Materiaal
subclass of: Restriction
  author at start life: Marinus Vonhof
  date of start life: 2021-08-05
  validity context: 5t 11t
  on class: Hulpstuk
  on property: has as aspect (inverse)
  max qualified cardinality: 1
subclass of: Restriction
  on property: has as reference (qualification)
  all values from: Materiaal leiding (coll)

HWA perceelaansluitleiding
author of change: Marinus Vonhof
author of change: Johan Post
date of change: 2026-05-01
date of change: 2016-04-25
definition: Transport van hemelwater vanaf het perceel
author at start life: Marinus Vonhof
date of start life: 2013-02-05
scope note: Collection of facts MDS
type: Class
subclass of: Perceelaansluitleiding
subclass of: Restriction
  author at start life: Marinus Vonhof
  date of start life: 2018-10-27
  on class: NLCS_HWA_HUISAANSLUITING
  on property: is represented by
  max qualified cardinality: 1
subclass of: Restriction
  author at start life: Marinus Vonhof
  date of start life: 2018-10-27
  on class: NLCS_HWA_PERCEELAANSLUITING
  on property: is represented by
  max qualified cardinality: 1
subclass of: Restriction
  author at start life: Marinus Vonhof
  date of start life: 2018-11-07
  on class: Sym_Perceelaansluitleiding
  on property: is represented by
  max qualified cardinality: 1
subclass of: Restriction
  author at start life: Marinus Vonhof
  date of start life: 2019-10-08
  on class: Sym_Kolkaansluitleiding
  on property: is represented by
  max qualified cardinality: 1
subclass of: Restriction
  on property: heeft Functie
  has value: AanvoerVanHemelwater

NLCS_HWA_HUISAANSLUITING
author of change: Marinus Vonhof
date of change: 2018-11-07
definition: Lijntype: RI-HWA_HUISAANSLUITING
notation: 1795
author at start life: Marinus Vonhof
date of start life: 2018-10-27
scope note: Collection of facts NLCS
type: Class
subclass of: NLCS_Object
subclass of: Restriction
  author at start life: Marinus Vonhof
  date of start life: 2018-10-27
  on class: HWA perceelaansluitleiding
  on property: is represented by (inverse)
  max qualified cardinality: 1

NLCS_HWA_PERCEELAANSLUITING
author of change: Marinus Vonhof
date of change: 2018-11-07
definition: Lijntype: RI-HWA_PERCEELAANSLUITING
notation: 1828
author at start life: Marinus Vonhof
date of start life: 2018-10-27
scope note: Collection of facts NLCS
type: Class
subclass of: NLCS_Object
subclass of: Restriction
  author at start life: Marinus Vonhof
  date of start life: 2018-10-27
  on class: HWA perceelaansluitleiding
  on property: is represented by (inverse)
  max qualified cardinality: 1

Sym_Kolkaansluitleiding
author of change: Marinus Vonhof
date of change: 2019-10-08
definition: Standaard stijl: Lijntype doorgetrokken, Lijnkleur 0 0 255, Lijndikte 0.4
author at start life: Marinus Vonhof
date of start life: 2018-11-07
scope note: Collection of facts NLCS
type: Class
subclass of: Geo-symbool
subclass of: Restriction
  author at start life: Marinus Vonhof
  date of start life: 2018-11-07
  on class: Kolkaansluitleiding
  on property: is represented by (inverse)
  max qualified cardinality: 1
subclass of: Restriction
  author at start life: Marinus Vonhof
  date of start life: 2019-10-08
  on class: HWA perceelaansluitleiding
  on property: is represented by (inverse)
  max qualified cardinality: 1

Luchtinjectie-unit
author of change: Marinus Vonhof
author of change: Johan Post
date of change: 2025-01-16
date of change: 2021-11-17
definition: [IMBOR] Een apparaat in een ondergronds (riolerings)netwerk dat lucht (eventueel onder druk) kan toevoegen aan het netwerk.
author at start life: Marinus Vonhof
date of start life: 2020-04-17
validity context: 1d 10d
scope note: Collection of facts BAS
scope note: Collection of facts RGM
type: Class
subclass of: Apparatuur
subclass of: Restriction
  author at start life: Marinus Vonhof
  date of start life: 2020-04-17
  on class: Hybride drukriolering
  on property: has as part (inverse)
  max qualified cardinality: 1
subclass of: Restriction
  on property: heeft Functie
  has value: InjecterenVanLucht

Hydraulisch rioleringsmodel
author of change: Marinus Vonhof
date of change: 2020-04-18
definition: Een als netwerk gemodelleerd rioolstelsel
author at start life: Marinus Vonhof
date of start life: 2014-05-02
see also: [SUF-HYD 1.10] Een beschrijving van de geometrie en de samenhang van de onderdelen van een rioolstelsel.
alternative label: Netwerkmodel
scope note: Collection of facts HYD
type: Class
subclass of: Representatie fysiek object
subclass of: Restriction
  author of change: Marinus Vonhof
  date of change: 2020-11-25
  author at start life: Marinus Vonhof
  date of start life: 2014-05-02
  on class: Leidingoriëntatie
  on property: has as part
  min qualified cardinality: 1
subclass of: Restriction
  author of change: Marinus Vonhof
  date of change: 2020-11-25
  author at start life: Marinus Vonhof
  date of start life: 2014-05-02
  on class: Putoriëntatie
  on property: has as part
  min qualified cardinality: 2
subclass of: Restriction
  author at start life: Marinus Vonhof
  date of start life: 2017-12-12
  on class: Rioolstelsel
  on property: is represented by (inverse)
  max qualified cardinality: 1

Hydraulische berekening
definition: [NEN 3300:1996] Het door berekenen bepalen van het hydraulisch functioneren van een rioolstelsel
author at start life: Marinus Vonhof
date of start life: 2022-09-30
validity context: *d
scope note: Collection of facts BAS
type: Class
subclass of: NEN 3300 Term

Hydraulische controleberekening
definition: [NEN 3300:1996] Berekening ter controle van het hydraulisch functioneren van (onderdelen van) het rioolstelsel
author at start life: Marinus Vonhof
date of start life: 2022-09-30
validity context: *d
scope note: Collection of facts BAS
type: Class
subclass of: NEN 3300 Term

Lengte put
author of change: Marinus Vonhof
author of change: Johan Post
date of change: 2021-08-06
date of change: 2026-05-01
definition: De inwendige lengte (horizontaal, uit het bovenaanzicht). Indien aanwezig de lengte van de onderbak - zie afbeelding dc (bron EN13508-2)
author at start life: Marinus Vonhof
date of start life: 2016-08-05
units of measurements: mm
validity context: 15d
comment: Intrinsiek aspect
comment: [is aspect]
scope note: Collection of facts TOP
type: Class
subclass of: Lengte
subclass of: Restriction
  author of change: Marinus Vonhof
  date of change: 2014-08-01
  author at start life: Finy Teitsma (Oranjewoud)
  date of start life: 2006-02-25
  validity context: *t
  on class: Put
  on property: has as aspect (inverse)
  max qualified cardinality: 1
subclass of: Restriction
  on property: has as value
  all values from: Lengte put (datatype)

Lengte leiding
author of change: Marinus Vonhof
date of change: 2015-05-29
author at start life: Nic Roest (Idoro)
date of start life: 2006-02-21
units of measurements: m
comment: Intrinsiek aspect
comment: [is aspect]
scope note: Collection of facts TOP
type: Class
subclass of: Lengte
subclass of: Restriction
  author of change: Marinus Vonhof
  date of change: 2015-08-24
  author at start life: Finy Teitsma (Oranjewoud)
  date of start life: 2006-02-25
  validity context: *t
  on class: Leiding
  on property: has as aspect (inverse)
  max qualified cardinality: 1
subclass of: Restriction
  date of change: 2015-11-03
  author at start life: Marinus Vonhof
  date of start life: 2013-03-29
  on class: Inwinning
  on property: has as aspect
  max qualified cardinality: 1
subclass of: Restriction
  on property: has as value
  all values from: Lengte leiding (datatype)

Maaiveldschematisering
author of change: Marinus Vonhof
date of change: 2014-12-19
author at start life: Marinus Vonhof
date of start life: 2014-12-17
see also: [HYD] Aanduiding schematisering maaiveld bij uitstroom van water via de putdeksel
comment: [is aspect]
scope note: Collection of facts HYD
type: Class
subclass of: Kenmerk
subclass of: Restriction
  author of change: Marinus Vonhof
  date of change: 2018-05-03
  author at start life: Marinus Vonhof
  date of start life: 2011-12-15
  validity context: 5t 11t
  on class: Rioolput
  on property: has as aspect (inverse)
  max qualified cardinality: 1
subclass of: Restriction
  on property: has as reference (qualification)
  all values from: Maaiveldschematisering (coll)

Maaiveldhoogte
author of change: Marinus Vonhof
date of change: 2015-11-07
definition: Het niveau van het maaiveld
author at start life: Marinus Vonhof
date of start life: 2012-04-22
units of measurements: m
comment: [is aspect]
scope note: Collection of facts TOP
type: Class
subclass of: Hoogte t.o.v. NAP
subclass of: Restriction
  author of change: Marinus Vonhof
  date of change: 2018-12-12
  author at start life: Marinus Vonhof
  date of start life: 2012-04-22
  on class: Maaiveldoriëntatie
  on property: has as aspect (inverse)
  qualified cardinality: 1
subclass of: Restriction
  author at start life: Marinus Vonhof
  date of start life: 2015-11-07
  on class: Inwinning
  on property: has as aspect
  max qualified cardinality: 1
subclass of: Restriction
  on property: has as value
  all values from: decimal

Opdrachtgever
label: Employing authority @en
author of change: Marinus Vonhof
date of change: 2025-01-16
date of change: 2020-04-20
definition: Een rechtspersoon die opdracht geeft voor het uitvoeren van activiteiten dan wel het leveren van producten of diensten. De initiator van het project, dus ongeacht onderaanneming.
definition: [IMBOR] Een opdrachtgever is een organisatie die een bepaalde opdracht tot het verrichten van werkzaamheden verstrekt aan een andere (rechts)persoon, de opdrachtnemer.
notation: AAM
notation: CAM
notation: EAM
notation: GAM
notation: JAM
author at start life: Marinus Vonhof
date of start life: 2011-12-02
validity context: 3d 14d
see also: [KIB] De naam van de bevoegde instantie
alternative label: Bevoegde instantie
scope note: Collection of facts TOP
type: Class
subclass of: Levensvorm
subclass of: Restriction
  author at start life: Marinus Vonhof
  date of start life: 2015-10-26
  on class: Project
  on property: has as input (inverse)
  qualified cardinality: 1

Pompcapaciteit
author of change: Johan Post
date of change: 2022-11-25
definition: De in de praktijk maximaal leverbare hoeveelheid per tijdseenheid (de capaciteit kan variëren door wisselende drukhoogte)
definition: [Omgevingswet] De volume-productie van een pomp per tijdseenheid
author at start life: Nic Roest (Idoro)
date of start life: 2006-02-21
units of measurements: m3/h
alternative label: Geïnstalleerde pompcapaciteit
comment: [is aspect]
scope note: Collection of facts MDS
scope note: Collection of facts HYD
scope note: Collection of facts RGM
type: Class
subclass of: Capaciteit
subclass of: Restriction
  author of change: Marinus Vonhof
  date of change: 2018-12-12
  author at start life: Marinus Vonhof
  date of start life: 2011-12-15
  validity context: 5t 11t
  on class: Pomp
  on property: has as aspect (inverse)
  max qualified cardinality: 1
subclass of: Restriction
  on property: has as value
  all values from: decimal

Opdrachtnemer
author of change: Marinus Vonhof
date of change: 2017-05-08
definition: Rechtspersoon die door middel van een overeenkomst door een opdrachtgever tegen vergoeding in staat wordt gesteld tot het uitvoeren van bepaalde activiteiten dan wel het leveren van producten of diensten
author at start life: Marinus Vonhof
date of start life: 2015-10-26
validity context: 3d 6d 14d
scope note: Collection of facts TOP
type: Class
subclass of: Levensvorm
subclass of: Restriction
  author of change: Marinus Vonhof
  date of change: 2015-10-31
  author at start life: Marinus Vonhof
  date of start life: 2015-10-26
  on class: Project
  on property: has as output (inverse)
  qualified cardinality: 1

Vorm put
author of change: Marinus Vonhof
date of change: 2021-08-06
definition: De inwendige vorm (horizontaal, uit het bovenaanzicht). Indien aanwezig de vorm van de onderbak
author at start life: Marinus Vonhof
date of start life: 2012-05-01
comment: Intrinsiek aspect
comment: [is aspect]
scope note: Collection of facts TOP
type: Class
subclass of: Vorm
subclass of: Restriction
  author of change: Marinus Vonhof
  date of change: 2021-08-06
  author at start life: Finy Teitsma (Oranjewoud)
  date of start life: 2006-02-25
  validity context: *t
  on class: Put
  on property: has as aspect (inverse)
  max qualified cardinality: 1
subclass of: Restriction
  date of change: 2017-05-17
  author at start life: Marinus Vonhof
  date of start life: 2015-10-30
  on class: Inwinning
  on property: has as aspect
  max qualified cardinality: 1
subclass of: Restriction
  on property: has as reference (qualification)
  all values from: Vorm put (coll)

Vrije overstorthoogte
definition: De vrije ruimte boven de overstortdrempel
author at start life: Marinus Vonhof
date of start life: 2017-12-07
units of measurements: mm
validity context: 1d 10d
comment: [is aspect]
scope note: Collection of facts BAS
scope note: Collection of facts HYD
type: Class
subclass of: Afstand
subclass of: Restriction
  author of change: Marinus Vonhof
  date of change: 2017-12-07
  author at start life: Marinus Vonhof
  date of start life: 2015-09-20
  on class: Overstortdrempel
  on property: has as aspect (inverse)
  max qualified cardinality: 1
subclass of: Restriction
  author at start life: Marinus Vonhof
  date of start life: 2019-03-20
  on class: Stuwmuur
  on property: has as aspect (inverse)
  max qualified cardinality: 1
subclass of: Restriction
  on property: has as value
  all values from: integer

Lozingspunt bodem
definition: Locatie van de lozing bevindt zich in de bodem.
author at start life: Marinus Vonhof
date of start life: 2015-07-27
scope note: Collection of facts MDS
type: Class
subclass of: Lozingspunt
subclass of: Restriction
  author at start life: Marinus Vonhof
  date of start life: 2015-07-27
  on class: IBA
  on property: has as part (inverse)
  max qualified cardinality: 1

Lozingspunt oppervlaktewater
definition: Locatie van de lozing bevindt zich in het oppervlaktewater
author at start life: Marinus Vonhof
date of start life: 2015-07-27
validity context: 1d 10d
scope note: Collection of facts BAS
type: Class
subclass of: Lozingspunt
subclass of: Restriction
  author at start life: Marinus Vonhof
  date of start life: 2015-07-27
  on class: IBA
  on property: has as part (inverse)
  max qualified cardinality: 1

NLCS_VWA_IBA
author of change: Marinus Vonhof
date of change: 2018-11-07
definition: Lijntype: CONTINUOUS
notation: 2244
author at start life: Marinus Vonhof
date of start life: 2018-10-27
scope note: Collection of facts NLCS
type: Class
subclass of: NLCS_Object
subclass of: Restriction
  author at start life: Marinus Vonhof
  date of start life: 2018-10-27
  on class: IBA
  on property: is represented by (inverse)
  max qualified cardinality: 1

IBA Klasse I
author of change: Johan Post
date of change: 2021-10-01
definition: Een bijzondere septische put (septictank) welke gebaseerd dient te zijn op het lozingenbesluit bodembescherming.
author at start life: Marinus Vonhof
date of start life: 2014-08-01
scope note: Collection of facts BAS
type: Class
subclass of: IBA
subclass of: Restriction
  on property: heeft Uitvoering
  has value: BijzondereSeptischePutSeptictank
subclass of: Restriction
  on class: Sym_IBAKlasseI
  on property: is represented by
  max qualified cardinality: 1

Sym_IBAKlasseI
author at start life: Johan Post
date of start life: 2021-10-01
scope note: Collection of facts NLCS
type: Class
subclass of: Geo-symbool
subclass of: Restriction
  author at start life: Marinus Vonhof
  date of start life: 2018-11-07
  on class: IBA Klasse I
  on property: is represented by (inverse)
  max qualified cardinality: 1

IBA Klasse II
author of change: Marinus Vonhof
author of change: Johan Post
date of change: 2025-01-16
date of change: 2021-10-01
definition: Verwijdert met name zwevende stoffen
definition: [IMBOR] Een septische tank die met name zwevende stoffen verwijderd.
author at start life: Marinus Vonhof
date of start life: 2014-08-01
scope note: Collection of facts BAS
type: Class
subclass of: IBA
subclass of: Restriction
  on property: heeft Functie
  has value: VerwijderenZwevendeStoffen
subclass of: Restriction
  on class: Sym_IBAKlasseII
  on property: is represented by
  max qualified cardinality: 1

Sym_IBAKlasseII
author at start life: Johan Post
date of start life: 2021-10-01
scope note: Collection of facts NLCS
type: Class
subclass of: Geo-symbool
subclass of: Restriction
  author at start life: Marinus Vonhof
  date of start life: 2018-11-07
  on class: IBA Klasse II
  on property: is represented by (inverse)
  max qualified cardinality: 1

Sym_IBAKlasseIII
author at start life: Johan Post
date of start life: 2021-10-01
scope note: Collection of facts NLCS
type: Class
subclass of: Geo-symbool
subclass of: Restriction
  author at start life: Marinus Vonhof
  date of start life: 2018-11-07
  on class: IBA Klasse IIIa
  on property: is represented by (inverse)
  max qualified cardinality: 1
subclass of: Restriction
  on class: IBA Klasse IIIb
  on property: is represented by (inverse)
  max qualified cardinality: 1

IBA Klasse IIIb
author of change: Marinus Vonhof
author of change: Johan Post
date of change: 2025-01-16
date of change: 2021-10-01
definition: Als IBA klasse IIIa en verwijdert ook fosfaat
definition: [IMBOR] Een septische tank die met name zwevende stoffen, stikstof en fosfaat verwijderd.
author at start life: Marinus Vonhof
date of start life: 2014-08-01
scope note: Collection of facts BAS
type: Class
subclass of: IBA
subclass of: Restriction
  on property: heeft Functie
  has value: VerwijderenFosfaat
subclass of: Restriction
  on property: heeft Functie
  has value: VerwijderenStikstof
subclass of: Restriction
  on property: heeft Functie
  has value: VerwijderenZwevendeStoffen
subclass of: Restriction
  on class: Sym_IBAKlasseIII
  on property: is represented by
  max qualified cardinality: 1

Identificatie telemetriesysteem
author at start life: Marinus Vonhof
date of start life: 2013-02-05
comment: [is aspect]
scope note: Collection of facts BAS
scope note: Collection of facts PLI
scope note: Collection of facts DMO
type: Class
subclass of: Unieke identificatie
subclass of: Restriction
  author of change: Marinus Vonhof
  date of change: 2019-05-15
  author at start life: Marinus Vonhof
  date of start life: 2013-02-05
  on class: Mechanische afsluiter
  on property: has as aspect (inverse)
  max qualified cardinality: 1

Identificatiegegevens
definition: [NEN 3300:1996] Gegevens die de aard en de plaats van onderdelen beschrijven
author at start life: Marinus Vonhof
date of start life: 2022-09-30
validity context: *d
scope note: Collection of facts BAS
type: Class
subclass of: NEN 3300 Term

Industrieterrein
author at start life: Marinus Vonhof
date of start life: 2014-12-01
scope note: Collection of facts BAS
scope note: Collection of facts DMO
type: Class
subclass of: District

Infiltratiebassin
author of change: Marinus Vonhof
author of change: Johan Post
author of change: Eric van Gorkom
date of change: 2021-10-01
date of change: 2026-07-13
date of change: 2024-05-13
definition: Een open reservoir met waterdoorlatende wanden voor de tijdelijke berging van hemelwater, waarbij het hemelwater door middel van infiltratie door de wanden kan worden afgevoerd
author at start life: Finy Teitsma (Oranjewoud)
date of start life: 2007-10-23
scope note: Collection of facts MDS
scope note: Collection of facts HYD
type: Class
subclass of: Begroeide infiltratievoorziening
subclass of: Restriction
  on property: heeft Uitvoering
  has value: WaterdoorlatendeWanden

Infiltratieberm
definition: Een strook grond langs een weg, tussen rijstroken of tussen een rijweg en een fiets- of voetpad in die het afstromende hemelwater van de verharding ernaast laat infiltreren. Dit kan bedoeld zijn om (schoon) water niet af te voeren, om grondwater aan te vullen en ook om de beplanting in bermen van voldoende water te voorzien.
author at start life: Marinus Vonhof
date of start life: 2026-07-14
scope note: Collection of facts MDS
scope note: Collection of facts HYD
type: Class
subclass of: Begroeide infiltratievoorziening
subclass of: Restriction
  on property: heeft Uitvoering
  has value: InDeBerm

Taludhelling
definition: De verhouding van de hoogte ten opzichte van de horizontale lengte van de taludhelling, uitgedrukt in hoogte/lengte*100%
author at start life: Marinus Vonhof
date of start life: 2026-07-24
units of measurements: %
comment: [is aspect]
scope note: Collection of facts BAS
type: Class
subclass of: Kenmerk
subclass of: Restriction
  on property: has as value
  all values from: integer
subclass of: Restriction
  on class: Infiltratiecompartiment
  on property: has as aspect (inverse)
  max qualified cardinality: 1

Infiltratiegoot
author of change: Marinus Vonhof
date of change: 2025-01-16
date of change: 2026-07-13
definition: Een goot met waterdoorlatende wanden bestemd voor de inzameling en transport van hemelwater, waarbij het hemelwater door middel van infiltratie door de wanden kan worden afgevoerd. Kan ook beschouwd worden als een soort infiltratievoorziening.
author at start life: Marinus Vonhof
date of start life: 2021-08-06
scope note: Collection of facts MDS
scope note: Collection of facts HYD
type: Class
subclass of: Goot
subclass of: Restriction
  on property: heeft Uitvoering
  has value: InDeVormVanEenGoot

Infiltratiegreppel
author of change: Marinus Vonhof
author of change: Johan Post
date of change: 2021-10-01
date of change: 2026-07-13
definition: Een natuurlijk open reservoir met waterdoorlatende wanden voor de tijdelijke berging van hemelwater, waarbij het hemelwater door middel van infiltratie door de wanden kan worden afgevoerd.
author at start life: Finy Teitsma (Oranjewoud)
date of start life: 2007-10-23
alternative label: Zaksloot
scope note: Collection of facts MDS
scope note: Collection of facts HYD
type: Class
subclass of: Begroeide infiltratievoorziening
subclass of: Restriction
  on property: heeft Uitvoering
  has value: InDeVormVanEenGreppel

Uitstroomniveau
author of change: Marinus Vonhof
date of change: 2018-05-03
definition: Hoogte waarop het water uitstroomt
author at start life: Nic Roest (Idoro)
date of start life: 2006-02-21
units of measurements: m
validity context: 15d
comment: [is aspect]
scope note: Collection of facts BAS
type: Class
subclass of: Hoogte t.o.v. NAP
subclass of: Restriction
  author of change: Marinus Vonhof
  date of change: 2016-04-20
  author at start life: Nic Roest (Idoro)
  date of start life: 2007-11-29
  on class: Infiltratiekoffer
  on property: has as aspect (inverse)
  max qualified cardinality: 1
subclass of: Restriction
  on property: has as value
  all values from: decimal

Substraat omstorting
definition: De omstorting van de constructie
author at start life: Marinus Vonhof
date of start life: 2026-08-05
alternative label: Omgestorte substraat
scope note: Collection of facts MDS
scope note: Collection of facts HYD
type: Class
subclass of: Substraat
subclass of: Restriction
  on class: Infiltratiekolk
  on property: has as part (inverse)
  max qualified cardinality: 1
subclass of: Restriction
  on class: Infiltratieput
  on property: has as part (inverse)
  max qualified cardinality: 1
subclass of: Restriction
  on property: heeft Toepassing
  has value: OmstortingVanDeConstructie

Niveau bovenkant filterdeel
author at start life: Marinus Vonhof
date of start life: 2026-07-24
units of measurements: m
comment: [is aspect]
scope note: Collection of facts MDS
type: Class
subclass of: Hoogte t.o.v. NAP
subclass of: Restriction
  on property: has as value
  all values from: decimal
subclass of: Restriction
  validity context: *t
  on class: Infiltratieput
  on property: has as aspect (inverse)
  qualified cardinality: 1

Niveau onderkant filterdeel
author at start life: Marinus Vonhof
date of start life: 2026-07-24
units of measurements: m
comment: [is aspect]
scope note: Collection of facts MDS
type: Class
subclass of: Hoogte t.o.v. NAP
subclass of: Restriction
  on property: has as value
  all values from: decimal
subclass of: Restriction
  validity context: *t
  on class: Infiltratieput
  on property: has as aspect (inverse)
  qualified cardinality: 1

Sym_Infiltratieriool
author of change: Marinus Vonhof
date of change: 2019-10-08
definition: Standaard stijl: Lijntype doorgetrokken, Lijnkleur 230 230 0, Lijndikte 1.0
author at start life: Marinus Vonhof
date of start life: 2018-11-07
scope note: Collection of facts NLCS
type: Class
subclass of: Geo-symbool
subclass of: Restriction
  author at start life: Marinus Vonhof
  date of start life: 2018-11-07
  on class: Infiltratieriool
  on property: is represented by (inverse)
  max qualified cardinality: 1

Infiltrerend oppervlak
author of change: Marinus Vonhof
author of change: Wouter van Riel
date of change: 2025-01-16
date of change: 2024-04-23
definition: [IMBOR] Aanduiding voor het oppervlak (binnen het object) waarbinnen water kan infiltreren.
author at start life: Marinus Vonhof
date of start life: 2013-10-01
units of measurements: m2
comment: [is aspect]
scope note: Collection of facts MDS
type: Class
subclass of: Kenmerk
subclass of: Restriction
  author at start life: Nic Roest (Idoro)
  date of start life: 2007-11-29
  on class: Infiltratiekoffer
  on property: has as aspect (inverse)
  max qualified cardinality: 1
subclass of: Restriction
  on property: has as value
  all values from: decimal

Retentiewaarde
author of change: Eric van Gorkom
date of change: 2024-05-13
definition: De maximale verblijftijd van water boven de oppervlakte van het veld
author at start life: Marinus Vonhof
date of start life: 2022-10-01
units of measurements: h
validity context: 1d 3d 10d 15d
alternative label: Verblijftijd
comment: [is aspect]
scope note: Collection of facts BAS
scope note: Collection of facts HYD
type: Class
subclass of: Kenmerk
subclass of: Restriction
  author at start life: Marinus Vonhof
  date of start life: 2022-10-01
  on class: Wadi
  on property: has as aspect (inverse)
  max qualified cardinality: 1
subclass of: Restriction
  author at start life: Marinus Vonhof
  date of start life: 2026-07-26
  on class: Inwinning
  on property: has as aspect
  max qualified cardinality: 1
subclass of: Restriction
  on property: has as value
  all values from: integer

Infiltrerende wegconstructie
definition: Een verharding (doorlatend, passerend, halfverharding of traditioneel uitgevoerde verharding) op een constructielaag, met daar direct onder een infiltratiekoffer (fundatie/cunet met substraat met een hoge porositeit) of een infiltratiekrat. Het hemelwater wordt via een waterpasserende verharding, waterdoorlatende verharding, halfverharding, kolken met infiltratieriool en/of infiltratiegoot in het cunet of de infiltratiekrat gebracht en geborgen, waarbij het hemelwater via de bodem en wanden infiltreert in de ondergrond. Bij overbelasting en voor de vertraagde leegloop van de voorziening kunnen onderdelen (drainage, noodoverstort, slokop etc.) zijn aangebracht voor het reguleren van hemelwater- en grondwater.
author at start life: Marinus Vonhof
date of start life: 2026-07-13
scope note: Collection of facts MDS
scope note: Collection of facts HYD
type: Class
subclass of: Infiltratievoorziening
subclass of: Restriction
  author at start life: Marinus Vonhof
  date of start life: 2026-07-14
  on class: Infiltratiegoot
  on property: has as part
  min qualified cardinality: 0
subclass of: Restriction
  on property: heeft Uitvoering
  has value: OnderdeelWeg

Influent
definition: [NEN 3300:1996] Het op de afvalwaterzuiveringinrichting aankomende afvalwater
author at start life: Marinus Vonhof
date of start life: 2022-09-30
validity context: *d
scope note: Collection of facts BAS
type: Class
subclass of: NEN 3300 Term

Ingrijpmaatstaf
definition: [NEN 3300:1996] Grenstoestand waarbij ingrijpen in de actuele toestand noodzakelijk is en waarbij maatregelen moeten worden opgesteld
author at start life: Marinus Vonhof
date of start life: 2022-09-30
validity context: *d
scope note: Collection of facts BAS
type: Class
subclass of: NEN 3300 Term

Inhangend voegmateriaal
definition: [NEN 3300:1996] Voegmateriaal (kit, bitumineuze profielstrip) dat uit de voeg in het doorstroomprofiel is gezakt of gedrukt
author at start life: Marinus Vonhof
date of start life: 2022-09-30
validity context: *d
alternative label: Indringend voegmateriaal
scope note: Collection of facts BAS
type: Class
subclass of: NEN 3300 Term

Inhangende rubberring
definition: [NEN 3300:1996] Een niet gescheurde rubberring die zichtbaar is of een gescheurde rubberring waarvan een gedeelte in het doorstroomprofiel hangt
author at start life: Marinus Vonhof
date of start life: 2022-09-30
validity context: *d
scope note: Collection of facts BAS
type: Class
subclass of: NEN 3300 Term

Injectiepunt
author of change: Marinus Vonhof
date of change: 2021-08-06
definition: Het positie waar een stof aan het afvalwater wordt toegevoegd. Bijvoorbeeld het toevoegen van waterstofperoxide ter voorkoming van biochemische aantasting (door bijvoorbeeld H2S-vorming).
author at start life: Marinus Vonhof
date of start life: 2019-05-15
validity context: 1d 3d 10d 12d 14d
scope note: Collection of facts BAS
type: Class
subclass of: Vertex
subclass of: Restriction
  author of change: Marinus Vonhof
  date of change: 2020-04-17
  author at start life: Marinus Vonhof
  date of start life: 2019-05-15
  on class: Tubelure
  on property: has as aspect (inverse)
  max qualified cardinality: 1
subclass of: Restriction
  author of change: Marinus Vonhof
  date of change: 2021-08-06
  author at start life: Marinus Vonhof
  date of start life: 2019-05-15
  on class: Punt
  on property: has as aspect
  qualified cardinality: 1

Tubelure
author of change: Marinus Vonhof
date of change: 2025-01-16
definition: [IMBOR] Een verbindingsstuk dat drie leidingen verbindt.
author at start life: Marinus Vonhof
date of start life: 2019-05-15
validity context: 1d
scope note: Collection of facts MDS
scope note: Collection of facts REV
scope note: Collection of facts PLI
scope note: Collection of facts HYD
type: Class
subclass of: Verbindingsstuk
subclass of: Restriction
  author of change: Marinus Vonhof
  date of change: 2020-04-17
  author at start life: Marinus Vonhof
  date of start life: 2019-05-15
  on class: Injectiepunt
  on property: has as aspect
  max qualified cardinality: 1
subclass of: Restriction
  on property: heeft Toepassing
  has value: ToegangVoorInjecteren

NLCS_DRAINAGE_INLAAT
author of change: Marinus Vonhof
date of change: 2018-11-07
definition: Lijntype: CONTINUOUS
notation: 3491
author at start life: Marinus Vonhof
date of start life: 2018-10-27
scope note: Collection of facts NLCS
type: Class
subclass of: NLCS_Object
subclass of: Restriction
  author at start life: Marinus Vonhof
  date of start life: 2018-10-27
  on class: Inlaat
  on property: is represented by (inverse)
  max qualified cardinality: 1

NLCS_GWA_HULPSTUK_INLAAT
author of change: Marinus Vonhof
date of change: 2018-11-07
definition: Lijntype: CONTINUOUS / Symbool: 984 - HULP_INLAAT
notation: 1683
author at start life: Marinus Vonhof
date of start life: 2018-10-27
scope note: Collection of facts NLCS
type: Class
subclass of: NLCS_Object
subclass of: Restriction
  author at start life: Marinus Vonhof
  date of start life: 2018-10-27
  on class: Inlaat
  on property: is represented by (inverse)
  max qualified cardinality: 1

NLCS_HWA_HULPSTUK_INLAAT
author of change: Marinus Vonhof
date of change: 2018-11-07
definition: Lijntype: CONTINUOUS / Symbool: 984 - HULP_INLAAT
notation: 1810
author at start life: Marinus Vonhof
date of start life: 2018-10-27
scope note: Collection of facts NLCS
type: Class
subclass of: NLCS_Object
subclass of: Restriction
  author at start life: Marinus Vonhof
  date of start life: 2018-10-27
  on class: Inlaat
  on property: is represented by (inverse)
  max qualified cardinality: 1

NLCS_ITR_HULPSTUK_INLAAT
author of change: Marinus Vonhof
date of change: 2018-11-07
definition: Lijntype: CONTINUOUS / Symbool: 984 - HULP_INLAAT
notation: 1959
author at start life: Marinus Vonhof
date of start life: 2018-10-27
scope note: Collection of facts NLCS
type: Class
subclass of: NLCS_Object
subclass of: Restriction
  author at start life: Marinus Vonhof
  date of start life: 2018-10-27
  on class: Inlaat
  on property: is represented by (inverse)
  max qualified cardinality: 1

NLCS_PERSLEIDING_HULPSTUK_INLAAT
author of change: Marinus Vonhof
date of change: 2018-11-07
definition: Lijntype: CONTINUOUS / Symbool: 984 - HULP_INLAAT
notation: 2069
author at start life: Marinus Vonhof
date of start life: 2018-10-27
scope note: Collection of facts NLCS
type: Class
subclass of: NLCS_Object
subclass of: Restriction
  author at start life: Marinus Vonhof
  date of start life: 2018-10-27
  on class: Inlaat
  on property: is represented by (inverse)
  max qualified cardinality: 1

NLCS_SWA_HULPSTUK_INLAAT
author of change: Marinus Vonhof
date of change: 2018-11-07
definition: Lijntype: CONTINUOUS / Symbool: 984 - HULP_INLAAT
notation: 2088
author at start life: Marinus Vonhof
date of start life: 2018-10-27
scope note: Collection of facts NLCS
type: Class
subclass of: NLCS_Object
subclass of: Restriction
  author at start life: Marinus Vonhof
  date of start life: 2018-10-27
  on class: Inlaat
  on property: is represented by (inverse)
  max qualified cardinality: 1

NLCS_VACUUMLEIDING_HULPSTUK_INLAAT
author of change: Marinus Vonhof
date of change: 2018-11-07
definition: Lijntype: CONTINUOUS / Symbool: 984 - HULP_INLAAT
notation: 2209
author at start life: Marinus Vonhof
date of start life: 2018-10-27
scope note: Collection of facts NLCS
type: Class
subclass of: NLCS_Object
subclass of: Restriction
  author at start life: Marinus Vonhof
  date of start life: 2018-10-27
  on class: Inlaat
  on property: is represented by (inverse)
  max qualified cardinality: 1

NLCS_VWA_HULPSTUK_INLAAT
author of change: Marinus Vonhof
date of change: 2018-11-07
definition: Lijntype: CONTINUOUS / Symbool: 984 - HULP_INLAAT
notation: 2242
author at start life: Marinus Vonhof
date of start life: 2018-10-27
scope note: Collection of facts NLCS
type: Class
subclass of: NLCS_Object
subclass of: Restriction
  author at start life: Marinus Vonhof
  date of start life: 2018-10-27
  on class: Inlaat
  on property: is represented by (inverse)
  max qualified cardinality: 1

Zadel
author of change: Marinus Vonhof
date of change: 2025-01-16
date of change: 2026-07-20
definition: Een verstevingingsstuk bestemd voor het verstevigen van een leidingaansluiting.
author at start life: Wouter van Riel
date of start life: 2021-09-24
scope note: Collection of facts MDS
type: Class
subclass of: Hulpstuk
subclass of: Restriction
  author at start life: Wouter van Riel
  date of start life: 2021-09-24
  on class: Inlaat
  on property: has as part (inverse)
  max qualified cardinality: 1
subclass of: Restriction
  on property: heeft Functie
  has value: LeidingaansluitingVerstevigen

Sym_Inlaat
author at start life: Johan Post
date of start life: 2021-10-01
scope note: Collection of facts NLCS
type: Class
subclass of: Geo-symbool
subclass of: Restriction
  author at start life: Marinus Vonhof
  date of start life: 2018-11-07
  on class: Inlaat
  on property: is represented by (inverse)
  max qualified cardinality: 1
subclass of: Restriction
  on class: Inlaat leiding
  on property: is represented by (inverse)
  max qualified cardinality: 1
subclass of: Restriction
  on class: Inlaat rioolput
  on property: is represented by (inverse)
  max qualified cardinality: 1

Inlaat oppervlaktewater
definition: Constructie om oppervlaktewater in te nemen
author at start life: Marinus Vonhof
date of start life: 2015-03-01
scope note: Collection of facts BAS
type: Class
subclass of: Kunstwerk
subclass of: Restriction
  author at start life: Marinus Vonhof
  date of start life: 2019-05-15
  on class: Spoelklep
  on property: has as part
  max qualified cardinality: 1
subclass of: Restriction
  on property: heeft Functie
  has value: InlatenVanOppervlaktewater

Spoelklep
author of change: Marinus Vonhof
author of change: Johan Post
date of change: 2024-05-01
date of change: 2022-10-03
date of change: 2019-01-08
definition: Klep onder de oppervlaktewaterspiegel die geopend kan worden om het rioolstelsel door te spoelen met oppervlaktewater
author at start life: Marinus Vonhof
date of start life: 2015-03-01
scope note: Collection of facts BAS
scope note: Collection of facts HYD
scope note: Collection of facts DMO
type: Class
subclass of: Mechanische afsluiter
subclass of: Restriction
  author at start life: Marinus Vonhof
  date of start life: 2019-05-15
  on class: Inlaat oppervlaktewater
  on property: has as part (inverse)
  max qualified cardinality: 1
subclass of: Restriction
  on property: heeft Functie
  has value: AfsluitenInTweeStroomrichtingen
subclass of: Restriction
  on property: heeft Functie
  has value: DoorspoelenRioolstelsel
subclass of: Restriction
  on class: Spoelvoorziening
  on property: has as part (inverse)
  max qualified cardinality: 1

Inloophydrogram
definition: [NEN 3300:1996] De grafische weergave van de hoeveelheid neerslag die in de riolering terecht komt uitgezet tegen de tijd
author at start life: Marinus Vonhof
date of start life: 2022-09-30
validity context: *d
scope note: Collection of facts BAS
type: Class
subclass of: NEN 3300 Term

Inloopmodel
definition: [NEN 3300:1996] De mathematische beschrijving van het proces van neerslag inloop in het rioolstelsel
author at start life: Marinus Vonhof
date of start life: 2022-09-30
validity context: *d
scope note: Collection of facts BAS
type: Class
subclass of: NEN 3300 Term

Meten
author of change: Marinus Vonhof
author of change: Johan Post
date of change: 2014-04-29
date of change: 2024-09-10
author at start life: Marinus Vonhof
date of start life: 2013-09-28
validity context: 6d
scope note: Collection of facts REV
scope note: Collection of facts BAS
scope note: Collection of facts DMO
type: Class
subclass of: Onderzoeken

Wijze van inwinning
author of change: Johan Post
date of change: 2022-09-29
definition: Wijze waarop gegevens verzameld zijn
author at start life: Marinus Vonhof
date of start life: 2013-02-05
alternative label: Wijze van inwinnen
comment: [is aspect]
scope note: Collection of facts TOP
type: Class
subclass of: Kenmerk
subclass of: Restriction
  author of change: Marinus Vonhof
  date of change: 2026-07-26
  date of change: 2024-05-15
  date of change: 2019-04-25
  author at start life: Marinus Vonhof
  date of start life: 2015-10-29
  on class: Inwinning
  on property: has as aspect (inverse)
  max qualified cardinality: 1
subclass of: Restriction
  on property: has as reference (qualification)
  all values from: Wijze van inwinning (coll)

Inspecteren
author of change: Marinus Vonhof
date of change: 2022-09-30
date of change: 2015-08-24
definition: [NEN 3300:1996] (Inspectie) Het waarnemen, herkennen en beschrijven van de toestand
author at start life: Marinus Vonhof
date of start life: 2013-03-26
validity context: 1f 3f 5d 10f 11d 12f 14f
scope note: Collection of facts TOP
type: Class
subclass of: Onderzoeken

Mechanische transportleiding
author of change: Marinus Vonhof
author of change: Johan Post
author of change: Wouter van Riel
date of change: 2025-01-16
date of change: 2024-05-02
date of change: 2015-09-20
date of change: 2024-04-23
date of change: 2024-07-26
date of change: 2024-05-04
definition: [IMBOR] Een transportleiding waarin de materie op basis van onder- en bovendruk wordt verplaatst.
author at start life: Marinus Vonhof
date of start life: 2014-12-02
validity context: *f
scope note: Collection of facts TOP
type: Class
subclass of: Transportleiding
subclass of: Restriction
  author of change: Marinus Vonhof
  date of change: 2018-12-05
  author at start life: Marinus Vonhof
  date of start life: 2014-12-02
  on class: Ontspanningsventiel
  on property: has as part
  min qualified cardinality: 0
subclass of: Restriction
  author at start life: Marinus Vonhof
  date of start life: 2014-12-02
  on class: Ontluchter
  on property: has as part
  min qualified cardinality: 0
subclass of: Restriction
  on property: heeft Structuur
  has value: Gesloten
subclass of: Restriction
  on property: heeft Technologie
  has value: TransportOnderOverdrukOfOnderdruk

Inspecteur
label: Inspector @en
author of change: Marinus Vonhof
date of change: 2015-10-31
definition: [EN13508-2+A1] De naam van de inspecteur en de naam van het bedrijf van de inspecteur
definition: [EN13508-2+A1] The name of the inspector and the name of the inspector’s company @en
notation: ABH
notation: CBH
notation: EBH
author at start life: Marinus Vonhof
date of start life: 2013-04-23
validity context: 3d 14d
alternative label: Naam inspectiebedrijf (EN)
scope note: Collection of facts MDS
scope note: Collection of facts EN
type: Class
subclass of: Opdrachtnemer

Inspectieplan
author of change: Marinus Vonhof
author of change: Johan Post
date of change: 2024-05-02
date of change: 2018-12-12
definition: Een plan dat beschrijft hoe en wanneer de riolering geïnspecteerd wordt
author at start life: Marinus Vonhof
date of start life: 2018-12-06
scope note: Collection of facts BAS
scope note: Collection of facts PLI
scope note: Collection of facts DMO
type: Class
subclass of: Rioleringsplan
subclass of: Restriction
  author at start life: Marinus Vonhof
  date of start life: 2018-12-13
  on class: Planvorming rioleringsbeheer
  on property: has as output (inverse)
  max qualified cardinality: 1
subclass of: Restriction
  author at start life: Marinus Vonhof
  date of start life: 2018-12-13
  on class: Inspectieproject riolering
  on property: has as output
  min qualified cardinality: 0

Inspectieproject riolering
author of change: Marinus Vonhof
author of change: Johan Post
date of change: 2024-05-02
date of change: 2017-04-06
definition: Een project dat tot doel heeft het rioleringssysteem te inspecteren.
author at start life: Marinus Vonhof
date of start life: 2011-12-02
validity context: 3d 14d
scope note: Collection of facts MDS
scope note: Collection of facts LDR
type: Class
subclass of: Project
subclass of: Restriction
  author of change: Marinus Vonhof
  date of change: 2014-09-03
  author at start life: Marinus Vonhof
  date of start life: 2014-04-29
  on class: Visueel inspecteren vrijverval leiding
  on property: has as part
  min qualified cardinality: 0
subclass of: Restriction
  author of change: Marinus Vonhof
  date of change: 2017-03-23
  author at start life: Marinus Vonhof
  date of start life: 2013-01-05
  on class: Visueel inspecteren rioolput
  on property: has as part
  min qualified cardinality: 0
subclass of: Restriction
  author at start life: Marinus Vonhof
  date of start life: 2015-10-26
  on class: Reinigen rioolput
  on property: has as part
  min qualified cardinality: 0
subclass of: Restriction
  author at start life: Marinus Vonhof
  date of start life: 2015-10-26
  on class: Reinigen vrijverval leiding
  on property: has as part
  min qualified cardinality: 0
subclass of: Restriction
  author at start life: Marinus Vonhof
  date of start life: 2018-12-13
  on class: Inspectieplan
  on property: has as output (inverse)
  qualified cardinality: 1

Project
author of change: Marinus Vonhof
date of change: 2025-01-16
definition: [IMBOR] Afbakening van het gebied (begrenzing) waarbinnen werkzaamheden gepland zijn, uitgevoerd worden of uitgevoerd zijn.
author at start life: Marinus Vonhof
date of start life: 2013-09-03
validity context: 3d 14d
scope note: Collection of facts TOP
type: Class
subclass of: Activiteit
subclass of: Restriction
  author of change: Marinus Vonhof
  date of change: 2015-10-26
  author at start life: Marinus Vonhof
  date of start life: 2011-12-02
  validity context: 1t 10t 12t
  on class: Projectreferentie opdrachtgever
  on property: has as aspect
  max qualified cardinality: 1
subclass of: Restriction
  author of change: Marinus Vonhof
  date of change: 2015-10-31
  author at start life: Marinus Vonhof
  date of start life: 2015-10-26
  on class: Opdrachtnemer
  on property: has as output
  min qualified cardinality: 1
subclass of: Restriction
  author at start life: Marinus Vonhof
  date of start life: 2015-10-26
  validity context: 1t 10t 12t
  on class: Projectreferentie opdrachtnemer
  on property: has as aspect
  max qualified cardinality: 1
subclass of: Restriction
  author at start life: Marinus Vonhof
  date of start life: 2015-10-26
  on class: Opdrachtgever
  on property: has as input
  qualified cardinality: 1

Vrijverval transportstelsel
author of change: Marinus Vonhof
author of change: Johan Post
date of change: 2025-01-16
date of change: 2021-10-01
definition: [IMBOR] Een netwerk van leidingen en putten ten behoeve van het transport van materie dat door middel van zwaartekracht plaatsvindt.
author at start life: Marinus Vonhof
date of start life: 2014-12-02
scope note: Collection of facts TOP
type: Class
subclass of: Transportstelsel
subclass of: Restriction
  author of change: Marinus Vonhof
  date of change: 2015-04-21
  author at start life: Marinus Vonhof
  date of start life: 2014-12-02
  on class: Inspectieput
  on property: has as part
  min qualified cardinality: 1
subclass of: Restriction
  author of change: Marinus Vonhof
  date of change: 2015-09-20
  author at start life: Marinus Vonhof
  date of start life: 2014-12-02
  validity context: 1t 10t 12t
  on class: Vrijverval transportleiding
  on property: has as part
  min qualified cardinality: 1
subclass of: Restriction
  author at start life: Marinus Vonhof
  date of start life: 2014-12-02
  on class: Transportsysteem
  on property: has as part (inverse)
  max qualified cardinality: 1
subclass of: Restriction
  author at start life: Marinus Vonhof
  date of start life: 2014-12-02
  on class: Afvalwatersysteem
  on property: has as part (inverse)
  qualified cardinality: 1
subclass of: Restriction
  on property: heeft Technologie
  has value: TransportDoorDeZwaartekracht
subclass of: Restriction
  on class: Sym VrijvervalTransportstelsel
  on property: is represented by
  max qualified cardinality: 1

Zonk
author of change: Finy Teitsma (Oranjewoud)
date of change: 2007-11-12
definition: Een toestel waarin ten gevolge van het verschil in dichtheid en het vertragen van de vloeistofstroom het zand door bezinking grotendeels van het afvalwater wordt gescheiden.
definition: [NEN 3300:1996] Zandvang is synoniem van zonk
author at start life: Finy Teitsma (Oranjewoud)
date of start life: 2007-10-23
validity context: 10d
alternative label: Zandvang
scope note: Collection of facts REV
scope note: Collection of facts BAS
type: Class
subclass of: Constructieonderdeel
subclass of: Restriction
  author of change: Marinus Vonhof
  date of change: 2018-12-11
  author at start life: Marinus Vonhof
  date of start life: 2012-04-29
  on class: Inspectieput
  on property: has as part (inverse)
  qualified cardinality: 1
subclass of: Restriction
  author at start life: Marinus Vonhof
  date of start life: 2018-10-27
  on class: NLCS_HWA_GOOT_LIJNGOOT_ZANDVANGER
  on property: is represented by
  max qualified cardinality: 1
subclass of: Restriction
  author at start life: Marinus Vonhof
  date of start life: 2018-10-27
  on class: NLCS_HWA_GOOT_ROOSTERGOOT_ZANDVANGER
  on property: is represented by
  max qualified cardinality: 1
subclass of: Restriction
  author at start life: Marinus Vonhof
  date of start life: 2018-12-10
  on class: VerdieptePut
  on property: has as part (inverse)
  qualified cardinality: 1
subclass of: Restriction
  on property: heeft Functie
  has value: BezinkenStoffen
subclass of: Restriction
  on property: heeft Functie
  has value: ReinigenAfvalwater

NLCS_GWA_RIOOLPUT_INSPECTIEPUT
author of change: Marinus Vonhof
date of change: 2018-11-07
definition: Lijntype: CONTINUOUS / Symbool: 2973 - PUT_INSPECTIE
notation: 1710
author at start life: Marinus Vonhof
date of start life: 2018-10-27
scope note: Collection of facts NLCS
type: Class
subclass of: NLCS_Object
subclass of: Restriction
  author at start life: Marinus Vonhof
  date of start life: 2018-10-27
  on class: Inspectieput
  on property: is represented by (inverse)
  max qualified cardinality: 1

NLCS_HWA_RIOOLPUT_INSPECTIEPUT
author of change: Marinus Vonhof
date of change: 2018-11-07
definition: Lijntype: CONTINUOUS / Symbool: 2973 - PUT_INSPECTIE
notation: 1839
author at start life: Marinus Vonhof
date of start life: 2018-10-27
scope note: Collection of facts NLCS
type: Class
subclass of: NLCS_Object
subclass of: Restriction
  author at start life: Marinus Vonhof
  date of start life: 2018-10-27
  on class: Inspectieput
  on property: is represented by (inverse)
  max qualified cardinality: 1

NLCS_ITR_RIOOLPUT_INSPECTIEPUT
author of change: Marinus Vonhof
date of change: 2018-11-07
definition: Lijntype: CONTINUOUS / Symbool: 2973 - PUT_INSPECTIE
notation: 1996
author at start life: Marinus Vonhof
date of start life: 2018-10-27
scope note: Collection of facts NLCS
type: Class
subclass of: NLCS_Object
subclass of: Restriction
  author at start life: Marinus Vonhof
  date of start life: 2018-10-27
  on class: Inspectieput
  on property: is represented by (inverse)
  max qualified cardinality: 1

NLCS_PERSLEIDING_RIOOLPUT_INSPECTIEPUT
author of change: Marinus Vonhof
date of change: 2018-11-07
definition: Lijntype: CONTINUOUS / Symbool: 2973 - PUT_INSPECTIE
notation: 2075
author at start life: Marinus Vonhof
date of start life: 2018-10-27
scope note: Collection of facts NLCS
type: Class
subclass of: NLCS_Object
subclass of: Restriction
  author at start life: Marinus Vonhof
  date of start life: 2018-10-27
  on class: Inspectieput
  on property: is represented by (inverse)
  max qualified cardinality: 1

NLCS_SWA_RIOOLPUT_INSPECTIEPUT
author of change: Marinus Vonhof
date of change: 2018-11-07
definition: Lijntype: CONTINUOUS / Symbool: 2973 - PUT_INSPECTIE
notation: 2117
author at start life: Marinus Vonhof
date of start life: 2018-10-27
scope note: Collection of facts NLCS
type: Class
subclass of: NLCS_Object
subclass of: Restriction
  author at start life: Marinus Vonhof
  date of start life: 2018-10-27
  on class: Inspectieput
  on property: is represented by (inverse)
  max qualified cardinality: 1

NLCS_VACUUMLEIDING_RIOOLPUT_INSPECTIEPUT
author of change: Marinus Vonhof
date of change: 2018-11-07
definition: Lijntype: CONTINUOUS / Symbool: 2973 - PUT_INSPECTIE
notation: 2215
author at start life: Marinus Vonhof
date of start life: 2018-10-27
scope note: Collection of facts NLCS
type: Class
subclass of: NLCS_Object
subclass of: Restriction
  author at start life: Marinus Vonhof
  date of start life: 2018-10-27
  on class: Inspectieput
  on property: is represented by (inverse)
  max qualified cardinality: 1

NLCS_VWA_RIOOLPUT_INSPECTIEPUT
author of change: Marinus Vonhof
date of change: 2018-11-07
definition: Lijntype: CONTINUOUS / Symbool: 2973 - PUT_INSPECTIE
notation: 2257
author at start life: Marinus Vonhof
date of start life: 2018-10-27
scope note: Collection of facts NLCS
type: Class
subclass of: NLCS_Object
subclass of: Restriction
  author at start life: Marinus Vonhof
  date of start life: 2018-10-27
  on class: Inspectieput
  on property: is represented by (inverse)
  max qualified cardinality: 1

Sym_Inspectieput
author of change: Johan Post
date of change: 2021-10-01
definition: Standaard stijl: Vorm cirkel, Lijnkleur 0 0 0, Grootte 6
author at start life: Marinus Vonhof
date of start life: 2018-11-10
scope note: Collection of facts NLCS
type: Class
subclass of: Geo-symbool
subclass of: Restriction
  author at start life: Marinus Vonhof
  date of start life: 2018-11-10
  on class: Inspectieput
  on property: is represented by (inverse)
  max qualified cardinality: 1

Interne overstortconstructie
author of change: Marinus Vonhof
date of change: 2015-09-01
definition: Een overstortconstructie die loost op een voorziening binnen hetzelfde rioolstelsel.
author at start life: Marinus Vonhof
date of start life: 2015-05-29
scope note: Collection of facts MDS
scope note: Collection of facts HYD
type: Class
subclass of: Overstortconstructie
subclass of: Restriction
  on property: heeft Functie
  has value: LozenBinnenHetStelsel

Interne overstortput
author of change: Marinus Vonhof
author of change: Finy Teitsma (Oranjewoud)
author of change: Wouter van Riel
date of change: 2024-04-20
date of change: 2007-11-12
date of change: 2025-03-20
definition: Een overstortput die loost op een voorziening binnen hetzelfde rioolstelsel.
definition: [NEN 3300:1996] rioolput voorzien van een overstortdrempel die loost binnen het in beschouwing genomen rioolstelsel
author at start life: Finy Teitsma (Oranjewoud)
date of start life: 2006-05-23
alternative label: Interne overstort
scope note: Collection of facts MDS
scope note: Collection of facts REV
scope note: Collection of facts HYD
scope note: Collection of facts DMO
type: Class
subclass of: Overstortput
subclass of: Restriction
  author at start life: Marinus Vonhof
  date of start life: 2018-11-07
  on class: Sym_InterneOverstortput
  on property: is represented by
  max qualified cardinality: 1
subclass of: Restriction
  on property: heeft Functie
  has value: LozenBinnenHetStelsel

Sym_InterneOverstortput
author of change: Marinus Vonhof
date of change: 2018-11-10
definition: Aangepaste stijl: Lijnkleur 255 0 0, Vulkleur 255 0 0, Grootte 10
author at start life: Marinus Vonhof
date of start life: 2018-11-07
scope note: Collection of facts NLCS
type: Class
subclass of: Geo-symbool
subclass of: Restriction
  author at start life: Marinus Vonhof
  date of start life: 2018-11-07
  on class: Interne overstortput
  on property: is represented by (inverse)
  max qualified cardinality: 1

Interval maatregel
author of change: Marinus Vonhof
date of change: 2019-07-10
author at start life: Marinus Vonhof
date of start life: 2013-03-26
units of measurements: year
validity context: 6d
comment: [is aspect]
scope note: Collection of facts BAS
scope note: Collection of facts MTR
type: Class
subclass of: Kenmerk
subclass of: Restriction
  author of change: Marinus Vonhof
  date of change: 2019-07-10
  author at start life: Marinus Vonhof
  date of start life: 2013-03-26
  on class: Maatregel
  on property: has as aspect (inverse)
  max qualified cardinality: 1
subclass of: Restriction
  on property: has as value
  all values from: integer

Inventarisatiegegevens
definition: [NEN 3300:1996] Gegevens betreffende het ontwerp van onderdelen en de omgevingsfactoren waarop dit ontwerp is gebaseerd
author at start life: Marinus Vonhof
date of start life: 2022-09-30
validity context: *d
scope note: Collection of facts BAS
type: Class
subclass of: NEN 3300 Term

Waterpeil
author of change: Marinus Vonhof
date of change: 2018-12-06
definition: Gemiddeld peil van het oppervlaktewater. Waarbij meetpunt op het waperoppervlak ligt
author at start life: Nic Roest (Idoro)
date of start life: 2006-02-21
units of measurements: m
comment: [is aspect]
scope note: Collection of facts MDS
scope note: Collection of facts HYD
type: Class
subclass of: Hoogte t.o.v. NAP
subclass of: Restriction
  author of change: Marinus Vonhof
  date of change: 2018-12-12
  author at start life: Finy Teitsma (Oranjewoud)
  date of start life: 2006-02-25
  on class: Waterdeel
  on property: has as aspect (inverse)
  max qualified cardinality: 1
subclass of: Restriction
  author at start life: Marinus Vonhof
  date of start life: 2018-12-06
  on class: Inwinning
  on property: has as aspect
  max qualified cardinality: 1
subclass of: Restriction
  on property: has as value
  all values from: decimal

Zekering kabel
author of change: Eric van Gorkom
date of change: 2024-05-13
definition: Beschermt de kabel tegen overbelasting door de stroomkring te onderbreken als de stroomsterkte te hoog wordt
author at start life: Marinus Vonhof
date of start life: 2014-08-01
comment: [is aspect]
scope note: Collection of facts BAS
type: Class
subclass of: Kenmerk
subclass of: Restriction
  author of change: Marinus Vonhof
  date of change: 2016-04-23
  author at start life: Marinus Vonhof
  date of start life: 2014-08-01
  on class: Kabel
  on property: has as part (inverse)
  qualified cardinality: 1

Kabeloriëntatie
definition: Een topologisch element (edge) dat de ligging van het object beschrijft. De geometrie volgt het hart van de kabel.
author at start life: Marinus Vonhof
date of start life: 2020-04-18
validity context: 1d 3d 10d 12d
scope note: Collection of facts BAS
type: Class
subclass of: Representatie fysiek object
subclass of: Restriction
  author of change: Marinus Vonhof
  date of change: 2020-04-18
  author at start life: Marinus Vonhof
  date of start life: 2016-04-21
  on class: Kabel
  on property: has as aspect (inverse)
  max qualified cardinality: 1
subclass of: Restriction
  author at start life: Marinus Vonhof
  date of start life: 2020-04-18
  on class: Lijn
  on property: has as aspect
  max qualified cardinality: 1

Kanaal
author of change: Marinus Vonhof
date of change: 2025-01-16
definition: [IMBOR] Een natuurlijk of kunstmatige waterloop die twee watervlaktes verbindt.
author at start life: Marinus Vonhof
date of start life: 2017-05-31
validity context: 1d 3d 10d 12d 14d
scope note: Collection of facts MDS
type: Class
subclass of: Waterloop
subclass of: Restriction
  on property: heeft Functie
  has value: Waterweg functie

Vacuümopslagtank
definition: Afgesloten tank binnen een vacuümpompstation waarin afvalwater uit één of meerdere vacuümleidingen tijdelijk wordt geborgen voordat het verder wordt verpompt naar een benedenstrooms rioolstelsel of zuiveringsinstallatie.
definition: [NEN 3300:1996] Onderdrukopslagtank is synoniem van vacuümopslagtank
definition: [NEN 3300:1996] Opslagruimte voor het afvalwater dat via een vacuümleiding wordt aangevoerd en waarin onderdruk in stand wordt gehouden.
author at start life: Johan Post
date of start life: 2026-05-21
alternative label: Onderdrukopslagtank
scope note: Collection of facts MDS
scope note: Collection of facts RGM
type: Class
subclass of: Constructieonderdeel
subclass of: Restriction
  on property: heeft Functie
  has value: TijdelijkeBergingVanVuilwater
subclass of: Restriction
  on property: heeft Technologie
  has value: ViaOnderdruk
subclass of: Restriction
  on class: Kathodische bescherming
  on property: has as aspect
  max qualified cardinality: 1
subclass of: Restriction
  on class: Sym_Vacuumopslagtank
  on property: is represented by
  max qualified cardinality: 1
subclass of: Restriction
  on class: Vacuümriolering
  on property: has as part (inverse)
  max qualified cardinality: 1
subclass of: Restriction
  on class: Vacuümpompstation
  on property: has as part (inverse)
  qualified cardinality: 1

Uitlaatconstructie
author of change: Marinus Vonhof
author of change: Johan Post
date of change: 2022-09-30
date of change: 2026-05-21
date of change: 2020-04-18
definition: [NEN-EN 752:2008] constructie of punt van waaruit afvalwater wordt geloosd naar een afvalwaterzuiveringsinstallatie of ontvangend water [EN 1085:2007, definitie 1280]
definition: Een bouwwerk bestaande uit een constructief vormgegeven uitstroomelement dat de uitstroming van water uit een leiding naar het oppervlaktewater mogelijk maakt.
definition: [NEN 3300:1996] constructie waar uitstroming van afvalwater uit het in beschouwing genomen rioolstelsel naar het oppervlaktewater mogelijk is
author at start life: Marinus Vonhof
date of start life: 2013-10-01
scope note: Collection of facts MDS
scope note: Collection of facts HYD
scope note: Collection of facts DMO
type: Class
subclass of: Bouwwerk
subclass of: Restriction
  author at start life: Marinus Vonhof
  date of start life: 2016-04-24
  validity context: 5t 11t
  on class: Uitlaat (punt)
  on property: has as aspect
  max qualified cardinality: 1
subclass of: Restriction
  author at start life: Marinus Vonhof
  date of start life: 2018-10-27
  on class: NLCS_DRAINAGE_UITSTROOMBAK
  on property: is represented by
  max qualified cardinality: 1
subclass of: Restriction
  author at start life: Marinus Vonhof
  date of start life: 2018-10-27
  on class: NLCS_HWA_UITSTROOMBAK
  on property: is represented by
  max qualified cardinality: 1
subclass of: Restriction
  author at start life: Marinus Vonhof
  date of start life: 2018-10-27
  on class: NLCS_ITR_UITSTROOMBAK
  on property: is represented by
  max qualified cardinality: 1
subclass of: Restriction
  author at start life: Marinus Vonhof
  date of start life: 2019-11-07
  on class: Sym_UitlaatPunt
  on property: is represented by
  max qualified cardinality: 1
subclass of: Restriction
  author at start life: Marinus Vonhof
  date of start life: 2026-07-17
  on class: Keerklep
  on property: has as part
  max qualified cardinality: 1
subclass of: Restriction
  on property: heeft Functie
  has value: UitstroomVanAfvalwaterNaarOppervlaktewater

Kegelstuk
definition: Een opzetstuk met een kegelvorm
author at start life: Marinus Vonhof
date of start life: 2026-07-17
scope note: Collection of facts BAS
type: Class
subclass of: Opzetstuk
subclass of: Restriction
  on property: heeft Uitvoering
  has value: Kegelvormig
subclass of: Restriction
  on class: Rioolput
  on property: has as part (inverse)
  qualified cardinality: 1

Opzetstuk
definition: Het element van de putconstructie tussen onderbak en stellaag
author at start life: Marinus Vonhof
date of start life: 2026-07-17
alternative label: Tussenstuk
scope note: Collection of facts BAS
type: Class
subclass of: Constructieonderdeel
subclass of: Restriction
  on property: heeft Toepassing
  has value: ElementPutconstructie
subclass of: Restriction
  on class: Rioolput
  on property: has as part (inverse)
  qualified cardinality: 1

Ketelzand fundering
author of change: Marinus Vonhof
date of change: 2025-01-16
date of change: 2018-12-10
definition: [IMBOR] Een funderingslaag gemaakt van gewalst of gestreken ketelzand, een E-bodemas dat een goed waterdoorlatend materiaal is met een hakerige korrelstructuur.
author at start life: Marinus Vonhof
date of start life: 2018-12-06
validity context: 1d 10d
scope note: Collection of facts BAS
scope note: Collection of facts RGM
type: Class
subclass of: Fundering
subclass of: Restriction
  on property: heeft Uitvoering
  has value: LaagKetelzand

Ketting
author of change: Marinus Vonhof
date of change: 2025-01-16
date of change: 2023-01-13
definition: Ketting welke aanwezig is in een rioolbuis.
author at start life: Eric van Gorkom
date of start life: 2022-12-24
validity context: *d
scope note: Collection of facts REV
scope note: Collection of facts BAS
type: Class
subclass of: Constructieonderdeel
subclass of: Restriction
  on property: heeft Uitvoering
  has value: BestaatUitSchakels
subclass of: Restriction
  on class: Vrijverval rioolleiding
  on property: has as part (inverse)
  min qualified cardinality: 0

Kleur
definition: De kleur van de leiding aan de buitenzijde, ter onderscheiding van het type afvalwater
author at start life: Marinus Vonhof
date of start life: 2018-12-06
validity context: 15d
comment: [is aspect]
scope note: Collection of facts BAS
scope note: Collection of facts PLI
type: Class
subclass of: Kenmerk
subclass of: Restriction
  author at start life: Marinus Vonhof
  date of start life: 2024-05-16
  on class: Rioolleiding
  on property: has as aspect (inverse)
  max qualified cardinality: 1
subclass of: Restriction
  author at start life: Marinus Vonhof
  date of start life: 2024-05-16
  on class: Transportleiding
  on property: has as aspect (inverse)
  max qualified cardinality: 1

Klokaanduiding
definition: [NEN 3300:1996] De wijze van vastleggen van de positie van een toestandsaspect langs de buisomtrek overeenkomstig de wijzerplaat van een klok
author at start life: Marinus Vonhof
date of start life: 2022-09-30
validity context: *d
scope note: Collection of facts BAS
type: Class
subclass of: NEN 3300 Term

Knevelvoorziening
author of change: Marinus Vonhof
author of change: Johan Post
date of change: 2025-01-16
date of change: 2024-04-30
definition: Voorziening om een putdeksel aan de rand te fixeren, waardoor deze niet opdrijft bij hoge water- en/of luchtdruk.
author at start life: Marinus Vonhof
date of start life: 2018-12-06
validity context: 10d
scope note: Collection of facts REV
scope note: Collection of facts BAS
type: Class
subclass of: Constructieonderdeel
subclass of: Restriction
  author at start life: Marinus Vonhof
  date of start life: 2018-12-06
  on class: Putdeksel
  on property: has as part (inverse)
  max qualified cardinality: 1
subclass of: Restriction
  on property: heeft Functie
  has value: FixerenPutdeksel

Materiaal omhulling (coll)
validity context: 1d 3d 10d 12d 14d
comment: [is coll]
scope note: Collection of facts BAS
type: Class
subclass of: Verzameling soorten
subclass of: Class
  one of: Kokosvezels
  one of: PPVezels
  one of: NylonKous

Verwachte type reiniging
author of change: Marinus Vonhof
date of change: 2020-05-28
definition: De verwachte reinigingsmethode voor de kolk afhankelijk van geschiedenis, toegankelijkheid en constructie
notation: ECM
author at start life: Marinus Vonhof
date of start life: 2013-10-18
validity context: 6d
see also: [KIB] Wijze waarop de kolk eerder gereinigd is
comment: [is aspect]
scope note: Collection of facts RRB
scope note: Collection of facts BAS
type: Class
subclass of: Kenmerk
subclass of: Restriction
  author of change: Marinus Vonhof
  date of change: 2016-03-25
  author at start life: Marinus Vonhof
  date of start life: 2013-10-18
  on class: Reinigen en inspecteren kolk
  on property: has as output (inverse)
  max qualified cardinality: 1
subclass of: Restriction
  author of change: Marinus Vonhof
  date of change: 2021-08-06
  author at start life: Marinus Vonhof
  date of start life: 2020-04-18
  on class: Kolk
  on property: has as aspect (inverse)
  max qualified cardinality: 1
subclass of: Restriction
  on property: has as reference (qualification)
  all values from: Type reiniging (kolk) (coll)

Stankscherm
definition: Vaak toegepast in een kolk, dan voorzien van een losse ophanging voor betere bereikbaarheid van het dieper gelegen kolkdeel
author at start life: Marinus Vonhof
date of start life: 2020-05-26
validity context: 1d 3d 10d 12d 14d
scope note: Collection of facts RRB
scope note: Collection of facts REV
scope note: Collection of facts BAS
type: Class
subclass of: Stankafsluiter
subclass of: Restriction
  author of change: Marinus Vonhof
  date of change: 2021-08-06
  author at start life: Marinus Vonhof
  date of start life: 2020-05-26
  on class: Kolk
  on property: has as part (inverse)
  max qualified cardinality: 1
subclass of: Restriction
  on property: heeft Uitvoering
  has value: StankAfsluitenMetScherm

NLCS_GWA_KOLK
author of change: Marinus Vonhof
date of change: 2018-11-07
definition: Lijntype: CONTINUOUS
notation: 1685
author at start life: Marinus Vonhof
date of start life: 2018-10-27
scope note: Collection of facts NLCS
type: Class
subclass of: NLCS_Object
subclass of: Restriction
  author at start life: Marinus Vonhof
  date of start life: 2018-10-27
  on class: Kolk
  on property: is represented by (inverse)
  max qualified cardinality: 1

NLCS_HWA_KOLK
author of change: Marinus Vonhof
date of change: 2018-11-07
definition: Lijntype: CONTINUOUS
notation: 1812
author at start life: Marinus Vonhof
date of start life: 2018-10-27
scope note: Collection of facts NLCS
type: Class
subclass of: NLCS_Object
subclass of: Restriction
  author at start life: Marinus Vonhof
  date of start life: 2018-10-27
  on class: Kolk
  on property: is represented by (inverse)
  max qualified cardinality: 1

NLCS_ITR_KOLK
author of change: Marinus Vonhof
date of change: 2018-11-07
definition: Lijntype: CONTINUOUS
notation: 1961
author at start life: Marinus Vonhof
date of start life: 2018-10-27
scope note: Collection of facts NLCS
type: Class
subclass of: NLCS_Object
subclass of: Restriction
  author at start life: Marinus Vonhof
  date of start life: 2018-10-27
  on class: Kolk
  on property: is represented by (inverse)
  max qualified cardinality: 1

NLCS_SWA_KOLK
author of change: Marinus Vonhof
date of change: 2018-11-07
definition: Lijntype: CONTINUOUS
notation: 2090
author at start life: Marinus Vonhof
date of start life: 2018-10-27
scope note: Collection of facts NLCS
type: Class
subclass of: NLCS_Object
subclass of: Restriction
  author at start life: Marinus Vonhof
  date of start life: 2018-10-27
  on class: Kolk
  on property: is represented by (inverse)
  max qualified cardinality: 1

Uitklimvoorziening
author of change: Marinus Vonhof
date of change: 2025-01-16
date of change: 2015-02-28
notation: EXL
author at start life: Marinus Vonhof
date of start life: 2013-10-18
validity context: 10d
see also: [KIB] De kolk is voorzien van een constructie die het mogelijk maakt dat amfibieën en kleine zoogdieren uit de kolk kunnen klimmen.
scope note: Collection of facts RRB
scope note: Collection of facts REV
scope note: Collection of facts BAS
type: Class
subclass of: Constructieonderdeel
subclass of: Restriction
  author of change: Marinus Vonhof
  date of change: 2016-01-21
  author at start life: Marinus Vonhof
  date of start life: 2013-10-18
  on class: Reinigen en inspecteren kolk
  on property: has as output (inverse)
  max qualified cardinality: 1
subclass of: Restriction
  author at start life: Johan Post
  date of start life: 2026-05-04
  on class: Spuikolk
  on property: has as part (inverse)
  max qualified cardinality: 1
subclass of: Restriction
  author at start life: Marinus Vonhof
  date of start life: 2020-04-18
  on class: Kolk
  on property: has as part (inverse)
  max qualified cardinality: 1
subclass of: Restriction
  on property: heeft Functie
  has value: AmfibieenEnZoogdierenRedden

Kolkaansluitleiding
author of change: Marinus Vonhof
date of change: 2016-10-17
definition: Een aansluitleiding tussen een kolk en de inlaat.
author at start life: Marinus Vonhof
author at start life: Finy Teitsma (Oranjewoud)
date of start life: 2006-02-20
scope note: Collection of facts MDS
scope note: Collection of facts RRB
scope note: Collection of facts LDR
type: Class
subclass of: Aansluitleiding
subclass of: Restriction
  author of change: Marinus Vonhof
  date of change: 2019-04-03
  author at start life: Finy Teitsma (Oranjewoud)
  date of start life: 2007-11-30
  on class: Kolkaansluiting
  on property: has as part (inverse)
  qualified cardinality: 1
subclass of: Restriction
  author at start life: Marinus Vonhof
  date of start life: 2018-10-27
  on class: NLCS_GWA_KOLKAANSLUITING
  on property: is represented by
  max qualified cardinality: 1
subclass of: Restriction
  author at start life: Marinus Vonhof
  date of start life: 2018-10-27
  on class: NLCS_HWA_KOLKAANSLUITING
  on property: is represented by
  max qualified cardinality: 1
subclass of: Restriction
  author at start life: Marinus Vonhof
  date of start life: 2018-10-27
  on class: NLCS_ITR_KOLKAANSLUITING
  on property: is represented by
  max qualified cardinality: 1
subclass of: Restriction
  author at start life: Marinus Vonhof
  date of start life: 2018-10-27
  on class: NLCS_SWA_KOLKAANSLUITING
  on property: is represented by
  max qualified cardinality: 1
subclass of: Restriction
  author at start life: Marinus Vonhof
  date of start life: 2018-11-07
  on class: Sym_Kolkaansluitleiding
  on property: is represented by
  max qualified cardinality: 1
subclass of: Restriction
  on property: heeft Functie
  has value: AanvoerVanHemelwater

NLCS_GWA_KOLKAANSLUITING
author of change: Marinus Vonhof
date of change: 2018-11-07
definition: Lijntype: RI-GWA_KOLKAANSLUITING
notation: 1690
author at start life: Marinus Vonhof
date of start life: 2018-10-27
scope note: Collection of facts NLCS
type: Class
subclass of: NLCS_Object
subclass of: Restriction
  author at start life: Marinus Vonhof
  date of start life: 2018-10-27
  on class: Kolkaansluitleiding
  on property: is represented by (inverse)
  max qualified cardinality: 1

NLCS_HWA_KOLKAANSLUITING
author of change: Marinus Vonhof
date of change: 2018-11-07
definition: Lijntype: RI-HWA_KOLKAANSLUITING
notation: 1817
author at start life: Marinus Vonhof
date of start life: 2018-10-27
scope note: Collection of facts NLCS
type: Class
subclass of: NLCS_Object
subclass of: Restriction
  author at start life: Marinus Vonhof
  date of start life: 2018-10-27
  on class: Kolkaansluitleiding
  on property: is represented by (inverse)
  max qualified cardinality: 1

NLCS_ITR_KOLKAANSLUITING
author of change: Marinus Vonhof
date of change: 2018-11-07
definition: Lijntype: RI-ITR_KOLKAANSLUITING
notation: 1966
author at start life: Marinus Vonhof
date of start life: 2018-10-27
scope note: Collection of facts NLCS
type: Class
subclass of: NLCS_Object
subclass of: Restriction
  author at start life: Marinus Vonhof
  date of start life: 2018-10-27
  on class: Kolkaansluitleiding
  on property: is represented by (inverse)
  max qualified cardinality: 1

NLCS_SWA_KOLKAANSLUITING
author of change: Marinus Vonhof
date of change: 2018-11-07
definition: Lijntype: RI-SWA_KOLKAANSLUITING
notation: 2095
author at start life: Marinus Vonhof
date of start life: 2018-10-27
scope note: Collection of facts NLCS
type: Class
subclass of: NLCS_Object
subclass of: Restriction
  author at start life: Marinus Vonhof
  date of start life: 2018-10-27
  on class: Kolkaansluitleiding
  on property: is represented by (inverse)
  max qualified cardinality: 1

Straatkolk
author of change: Marinus Vonhof
date of change: 2016-04-15
definition: Een kolk met de inlaat aan de bovenzijde, bestemd om te worden aangebracht in het vlak van de wegverharding
definition: [NEN 3300:1996] kolk met horizontaal boveninlaatrooster, waarvan de bovenzijde gelijk ligt met het wegoppervlak
notation: A
author at start life: Finy Teitsma (Oranjewoud)
date of start life: 2006-11-29
scope note: Collection of facts MDS
scope note: Collection of facts RRB
scope note: Collection of facts LDR
scope note: Collection of facts REV
type: Class
subclass of: Kolk
subclass of: Restriction
  author at start life: Marinus Vonhof
  date of start life: 2018-10-27
  on class: NLCS_GWA_KOLK_STRAATKOLK
  on property: is represented by
  max qualified cardinality: 1
subclass of: Restriction
  author at start life: Marinus Vonhof
  date of start life: 2018-10-27
  on class: NLCS_HWA_KOLK_STRAATKOLK
  on property: is represented by
  max qualified cardinality: 1
subclass of: Restriction
  author at start life: Marinus Vonhof
  date of start life: 2018-10-27
  on class: NLCS_ITR_KOLK_STRAATKOLK
  on property: is represented by
  max qualified cardinality: 1
subclass of: Restriction
  author at start life: Marinus Vonhof
  date of start life: 2018-10-27
  on class: NLCS_SWA_KOLK_STRAATKOLK
  on property: is represented by
  max qualified cardinality: 1
subclass of: Restriction
  author at start life: Marinus Vonhof
  date of start life: 2018-11-11
  on class: Sym_Kolk
  on property: is represented by
  max qualified cardinality: 1
subclass of: Restriction
  on property: heeft Functie
  has value: AfvoerNaarKolkaansluitleiding
subclass of: Restriction
  on property: heeft Uitvoering
  has value: MetDeInlaatAanDeBovenzijde

Trottoirkolk
author of change: Finy Teitsma (Oranjewoud)
date of change: 2007-11-12
definition: Een kolk met de inlaat aan de voorzijde, bestemd om te worden aangebracht in de in het zicht blijvende vlakken van de aansluitende trottoirbanden.
definition: [NEN 3300:1996] kolk met een verticaal voorinlaatrooster, waarvan de voorkant strookt met de trottoirband
notation: B
author at start life: Finy Teitsma (Oranjewoud)
date of start life: 2006-11-29
scope note: Collection of facts MDS
scope note: Collection of facts RRB
scope note: Collection of facts LDR
scope note: Collection of facts REV
type: Class
subclass of: Kolk
subclass of: Restriction
  author at start life: Marinus Vonhof
  date of start life: 2018-10-27
  on class: NLCS_GWA_KOLK_TROTTOIRKOLK
  on property: is represented by
  max qualified cardinality: 1
subclass of: Restriction
  author at start life: Marinus Vonhof
  date of start life: 2018-10-27
  on class: NLCS_HWA_KOLK_TROTTOIRKOLK
  on property: is represented by
  max qualified cardinality: 1
subclass of: Restriction
  author at start life: Marinus Vonhof
  date of start life: 2018-10-27
  on class: NLCS_ITR_KOLK_TROTTOIRKOLK
  on property: is represented by
  max qualified cardinality: 1
subclass of: Restriction
  author at start life: Marinus Vonhof
  date of start life: 2018-10-27
  on class: NLCS_SWA_KOLK_TROTTOIRKOLK
  on property: is represented by
  max qualified cardinality: 1
subclass of: Restriction
  author at start life: Marinus Vonhof
  date of start life: 2018-11-11
  on class: Sym_Kolk
  on property: is represented by
  max qualified cardinality: 1
subclass of: Restriction
  on property: heeft Functie
  has value: AfvoerNaarKolkaansluitleiding
subclass of: Restriction
  on property: heeft Uitvoering
  has value: MetDeInlaatAanDeVoorzijde

Ter plaatse uitgeharde lining
label: Cured in place lining @en
author of change: Marinus Vonhof
date of change: 2025-01-16
definition: [IMBOR] Nieuwe bekleding of een geheel nieuwe leiding, van een materiaal dat ter plaatse uithardt tegen de randen van de buitenste leiding, die in een bestaande leiding wordt aangebracht.
notation: C
author at start life: Marinus Vonhof
date of start life: 2018-12-12
comment: Bron afbeelding: https://www.unitracc.com
scope note: Collection of facts MDS
scope note: Collection of facts LDR
scope note: Collection of facts MTR
type: Class
subclass of: Lining
subclass of: Restriction
  on property: heeft Uitvoering
  has value: UithardendOpBinnenwand

Kruisingsput
author of change: Johan Post
date of change: 2021-10-01
definition: [NEN 3300:1996] rioolput voor de kruising van riolen, zonder dat de stromen elkaar raken
author at start life: Marinus Vonhof
date of start life: 2012-04-29
scope note: Collection of facts MDS
scope note: Collection of facts RRB
scope note: Collection of facts LDR
scope note: Collection of facts REV
scope note: Collection of facts HYD
type: Class
subclass of: Rioolput
subclass of: Restriction
  author at start life: Marinus Vonhof
  date of start life: 2018-10-27
  on class: NLCS_GWA_RIOOLPUT_KRUISPUT
  on property: is represented by
  max qualified cardinality: 1
subclass of: Restriction
  author at start life: Marinus Vonhof
  date of start life: 2018-10-27
  on class: NLCS_HWA_RIOOLPUT_KRUISPUT
  on property: is represented by
  max qualified cardinality: 1
subclass of: Restriction
  author at start life: Marinus Vonhof
  date of start life: 2018-10-27
  on class: NLCS_ITR_RIOOLPUT_KRUISPUT
  on property: is represented by
  max qualified cardinality: 1
subclass of: Restriction
  author at start life: Marinus Vonhof
  date of start life: 2018-10-27
  on class: NLCS_SWA_RIOOLPUT_KRUISPUT
  on property: is represented by
  max qualified cardinality: 1
subclass of: Restriction
  author at start life: Marinus Vonhof
  date of start life: 2018-10-27
  on class: NLCS_VWA_RIOOLPUT_KRUISPUT
  on property: is represented by
  max qualified cardinality: 1
subclass of: Restriction
  on property: heeft Functie
  has value: LeidingGescheidenLatenKruisen
subclass of: Restriction
  on property: heeft Functie
  has value: VoorkomenDatStromenElkaarRaken
subclass of: Restriction
  on class: Sym_Kruisingsput
  on property: is represented by
  max qualified cardinality: 1

NLCS_GWA_RIOOLPUT_KRUISPUT
author of change: Marinus Vonhof
date of change: 2018-11-07
definition: Lijntype: CONTINUOUS / Symbool: 2611 - PUT_KRUISPUT
notation: 1729
author at start life: Marinus Vonhof
date of start life: 2018-10-27
scope note: Collection of facts NLCS
type: Class
subclass of: NLCS_Object
subclass of: Restriction
  author at start life: Marinus Vonhof
  date of start life: 2018-10-27
  on class: Kruisingsput
  on property: is represented by (inverse)
  max qualified cardinality: 1

NLCS_HWA_RIOOLPUT_KRUISPUT
author of change: Marinus Vonhof
date of change: 2018-11-07
definition: Lijntype: CONTINUOUS / Symbool: 2611 - PUT_KRUISPUT
notation: 1858
author at start life: Marinus Vonhof
date of start life: 2018-10-27
scope note: Collection of facts NLCS
type: Class
subclass of: NLCS_Object
subclass of: Restriction
  author at start life: Marinus Vonhof
  date of start life: 2018-10-27
  on class: Kruisingsput
  on property: is represented by (inverse)
  max qualified cardinality: 1

NLCS_ITR_RIOOLPUT_KRUISPUT
author of change: Marinus Vonhof
date of change: 2018-11-07
definition: Lijntype: CONTINUOUS / Symbool: 2611 - PUT_KRUISPUT
notation: 2015
author at start life: Marinus Vonhof
date of start life: 2018-10-27
scope note: Collection of facts NLCS
type: Class
subclass of: NLCS_Object
subclass of: Restriction
  author at start life: Marinus Vonhof
  date of start life: 2018-10-27
  on class: Kruisingsput
  on property: is represented by (inverse)
  max qualified cardinality: 1

NLCS_SWA_RIOOLPUT_KRUISPUT
author of change: Marinus Vonhof
date of change: 2018-11-07
definition: Lijntype: CONTINUOUS / Symbool: 2611 - PUT_KRUISPUT
notation: 2136
author at start life: Marinus Vonhof
date of start life: 2018-10-27
scope note: Collection of facts NLCS
type: Class
subclass of: NLCS_Object
subclass of: Restriction
  author at start life: Marinus Vonhof
  date of start life: 2018-10-27
  on class: Kruisingsput
  on property: is represented by (inverse)
  max qualified cardinality: 1

NLCS_VWA_RIOOLPUT_KRUISPUT
author of change: Marinus Vonhof
date of change: 2018-11-07
definition: Lijntype: CONTINUOUS / Symbool: 2611 - PUT_KRUISPUT
notation: 2283
author at start life: Marinus Vonhof
date of start life: 2018-10-27
scope note: Collection of facts NLCS
type: Class
subclass of: NLCS_Object
subclass of: Restriction
  author at start life: Marinus Vonhof
  date of start life: 2018-10-27
  on class: Kruisingsput
  on property: is represented by (inverse)
  max qualified cardinality: 1

Sym_Kruisingsput
author at start life: Johan Post
date of start life: 2021-10-01
scope note: Collection of facts NLCS
type: Class
subclass of: Geo-symbool
subclass of: Restriction
  author at start life: Marinus Vonhof
  date of start life: 2018-11-07
  on class: Kruisingsput
  on property: is represented by (inverse)
  max qualified cardinality: 1

Kruisstuk
definition: Een verbindingsstuk dat vier (drainage) leidingen onder een rechte hoek verbindt
author at start life: Marinus Vonhof
date of start life: 2018-12-06
validity context: 1d
scope note: Collection of facts MDS
scope note: Collection of facts LDR
scope note: Collection of facts REV
scope note: Collection of facts PLI
scope note: Collection of facts HYD
type: Class
subclass of: Verbindingsstuk
subclass of: Restriction
  on property: heeft Functie
  has value: VerbindenVanVierLeidingen

Kwaliteitssensor
author of change: Wouter van Riel
date of change: 2024-04-22
definition: Een instrument dat de kwaliteit van het afvalwater meet.
author at start life: Finy Teitsma (Oranjewoud)
date of start life: 2007-10-23
scope note: Collection of facts BAS
type: Class
subclass of: Meetinstrument
subclass of: Restriction
  author at start life: Wouter van Riel
  date of start life: 2024-04-22
  on class: Bouwwerk
  on property: has as part (inverse)
  max qualified cardinality: 1
subclass of: Restriction
  author at start life: Wouter van Riel
  date of start life: 2024-04-22
  on class: Compartiment
  on property: has as part (inverse)
  max qualified cardinality: 1
subclass of: Restriction
  author at start life: Wouter van Riel
  date of start life: 2024-04-22
  on class: Put
  on property: has as part (inverse)
  max qualified cardinality: 1
subclass of: Restriction
  on property: heeft Functie
  has value: MetenKwaliteitAfvalwater
subclass of: Restriction
  on class: Sym_Kwaliteitssensor
  on property: is represented by
  max qualified cardinality: 1

Sym_Kwaliteitssensor
author at start life: Johan Post
date of start life: 2021-10-01
scope note: Collection of facts NLCS
type: Class
subclass of: Geo-symbool
subclass of: Restriction
  author at start life: Marinus Vonhof
  date of start life: 2018-11-07
  on class: Kwaliteitssensor
  on property: is represented by (inverse)
  max qualified cardinality: 1

Kwetsbaar gebied
definition: Gebied waarbinnen speciale normen voor lozing gelden
author at start life: Marinus Vonhof
date of start life: 2015-07-23
validity context: 1d 3d 10d 12d 14d
scope note: Collection of facts MDS
type: Class
subclass of: Gebied
subclass of: Restriction
  author of change: Marinus Vonhof
  date of change: 2016-04-24
  author at start life: Marinus Vonhof
  date of start life: 2015-07-23
  on class: Zuiveringsreservoir
  on property: has as part
  min qualified cardinality: 0

Laagspanningskabel
author of change: Marinus Vonhof
author of change: Johan Post
date of change: 2025-01-16
date of change: 2021-10-01
author at start life: Marinus Vonhof
date of start life: 2015-07-28
validity context: 1d 3d
see also: [IMKL: 1.1/2008] LS = laagspanning (230 V en 400 V)
scope note: Collection of facts BAS
type: Class
subclass of: Voedingskabel
subclass of: Restriction
  on property: heeft Uitvoering
  has value: OntworpenVoorLaagspanning
subclass of: Restriction
  on class: Sym_Kabel
  on property: is represented by
  max qualified cardinality: 1

Pigging-installatie
author of change: Marinus Vonhof
author of change: Johan Post
date of change: 2024-05-02
date of change: 2017-05-31
definition: Installatie voor het verzenden, ontvangen of afsluiten van pigs (rubberen mollen)
author at start life: Marinus Vonhof
date of start life: 2015-07-09
validity context: 1d 3d 10d
scope note: Collection of facts BAS
scope note: Collection of facts PLI
type: Class
subclass of: Apparatuur
subclass of: Restriction
  author at start life: Marinus Vonhof
  date of start life: 2018-12-05
  on class: Lanceerpunt
  on property: has as part
  qualified cardinality: 1
subclass of: Restriction
  on property: heeft Doel
  has value: OnderhoudPlegen
subclass of: Restriction
  on class: Persleidingstelsel
  on property: has as part (inverse)
  max qualified cardinality: 1

Lozingsdebiet
author of change: Johan Post
date of change: 2022-11-25
author at start life: Marinus Vonhof
date of start life: 2013-02-05
units of measurements: m3/h
comment: [is aspect]
scope note: Collection of facts HYD
type: Class
subclass of: Capaciteit
subclass of: Restriction
  on property: has as value
  all values from: decimal

Lateraal debiet DWA
author of change: Johan Post
date of change: 2022-11-25
definition: DWA lozingsdebiet vanuit ander rioolstelsel
author at start life: Marinus Vonhof
date of start life: 2017-08-31
units of measurements: m3/h
comment: [is aspect]
scope note: Collection of facts HYD
type: Class
subclass of: Lateraal debiet
subclass of: Restriction
  author at start life: Marinus Vonhof
  date of start life: 2017-08-31
  on class: Vuilwaterriool
  on property: has as aspect (inverse)
  max qualified cardinality: 1
subclass of: Restriction
  on property: has as value
  all values from: decimal

Lavakoffer
author of change: Marinus Vonhof
date of change: 2025-01-16
date of change: 2026-07-13
definition: [IMBOR] Een constructie gevuld met een granulaat met lavasteen waar regenwater de tijd krijgt om langzaam in de bodem opgenomen te worden.
author at start life: Marinus Vonhof
date of start life: 2021-08-06
scope note: Collection of facts MDS
type: Class
subclass of: Infiltratiekoffer
subclass of: Restriction
  on property: heeft Uitvoering
  has value: GevuldMetLavasteen

Wandruwheid
author of change: Marinus Vonhof
date of change: 2025-01-16
definition: [IMBOR] Aanduiding voor de ruwheid van de buiswand.
author at start life: Marinus Vonhof
date of start life: 2011-12-15
units of measurements: mm
validity context: 15d
alternative label: K-Nikuradse waarde profielwand
comment: [is aspect]
scope note: Collection of facts BAS
scope note: Collection of facts DMO
type: Class
subclass of: Kenmerk
subclass of: Restriction
  author of change: Marinus Vonhof
  date of change: 2015-06-01
  author at start life: Marinus Vonhof
  date of start life: 2011-12-15
  on class: Leiding
  on property: has as aspect (inverse)
  max qualified cardinality: 1
subclass of: Restriction
  on property: has as value
  all values from: Wandruwheid (datatype)

Toegankelijk
author of change: Eric van Gorkom
date of change: 2019-08-16
definition: Aanduiding van de toegankelijkheid op basis van constructieve eigenschappen
author at start life: Finy Teitsma (Oranjewoud)
date of start life: 2007-10-25
validity context: 15d
comment: [is aspect]
scope note: Collection of facts BAS
type: Class
subclass of: Kenmerk
subclass of: Restriction
  author at start life: Finy Teitsma (Oranjewoud)
  date of start life: 2007-10-24
  on class: Leiding
  on property: has as aspect (inverse)
  max qualified cardinality: 1
subclass of: Restriction
  on property: has as reference (qualification)
  all values from: Toegankelijk (coll)

Wandruwheid binnenboven
author of change: Marinus Vonhof
date of change: 2025-01-16
definition: [IMBOR] Aanduiding voor de ruwheid van de buiswand binnenboven.
author at start life: Marinus Vonhof
date of start life: 2013-02-05
units of measurements: mm
comment: [is aspect]
scope note: Collection of facts BAS
scope note: Collection of facts DMO
type: Class
subclass of: Wandruwheid
subclass of: Restriction
  author at start life: Marinus Vonhof
  date of start life: 2013-02-05
  on class: Leiding
  on property: has as aspect (inverse)
  max qualified cardinality: 1
subclass of: Restriction
  on property: has as value
  all values from: integer

Wandruwheid binnenonder
author of change: Marinus Vonhof
date of change: 2025-01-16
definition: [IMBOR] Aanduiding voor de ruwheid van de buiswand binnenonder.
author at start life: Marinus Vonhof
date of start life: 2013-02-05
units of measurements: mm
comment: [is aspect]
scope note: Collection of facts BAS
scope note: Collection of facts DMO
type: Class
subclass of: Wandruwheid
subclass of: Restriction
  author at start life: Marinus Vonhof
  date of start life: 2013-02-05
  on class: Leiding
  on property: has as aspect (inverse)
  max qualified cardinality: 1
subclass of: Restriction
  on property: has as value
  all values from: integer

WIBON thema
author of change: Marinus Vonhof
date of change: 2025-01-16
definition: [IMBOR] Het thema geeft aan welk type leiding het betreft en welke functie de leidingen hebben. Bijvoorbeeld: datatransport, gas lage druk, laagspanning, riool etc. Opmerking: signaleringskabels die data vervoeren vallen onder datatransport.
author at start life: Marinus Vonhof
date of start life: 2020-04-17
validity context: 15d
comment: [is aspect]
scope note: Collection of facts MDS
scope note: Collection of facts DMO
type: Class
subclass of: Kenmerk
subclass of: Restriction
  author at start life: Marinus Vonhof
  date of start life: 2020-04-17
  on class: Leiding
  on property: has as aspect (inverse)
  max qualified cardinality: 1
subclass of: Restriction
  author at start life: Marinus Vonhof
  date of start life: 2020-04-17
  on class: Put
  on property: has as aspect (inverse)
  max qualified cardinality: 1
subclass of: Restriction
  author at start life: Marinus Vonhof
  date of start life: 2026-07-24
  on class: Reservoir
  on property: has as aspect (inverse)
  max qualified cardinality: 1
subclass of: Restriction
  on property: has as reference (qualification)
  all values from: WIBON thema (coll)

Leidingbrug
author of change: Marinus Vonhof
date of change: 2025-01-16
definition: Constructie om leidingen over een weg of ander object te geleiden
author at start life: Marinus Vonhof
date of start life: 2021-08-06
validity context: 10d
scope note: Collection of facts BAS
type: Class
subclass of: Bouwwerk
subclass of: Restriction
  on property: heeft Functie
  has value: LeidingenOverEenObjectGeleiden

Leidingregistratie
definition: [NEN 3300:1996] De verzamelde gegevens van leidingen bestaande uit ligging in het horizontale en verticale vlak, gebiedskenmerken, afmetingen en hoedanigheid van leidingen
author at start life: Marinus Vonhof
date of start life: 2022-09-30
validity context: *d
scope note: Collection of facts BAS
type: Class
subclass of: NEN 3300 Term

Leidingsegment
author of change: Marinus Vonhof
author of change: Johan Post
author of change: Eric van Gorkom
date of change: 2022-09-27
date of change: 2022-09-29
date of change: 2018-12-12
author at start life: Marinus Vonhof
date of start life: 2014-12-02
validity context: 12d
see also: [WSH 20141028] Deel van een persleiding begrensd door wijziging materiaal, wijziging afmeting, locatie inprikpunt of locatie appendages
scope note: Collection of facts MDS
scope note: Collection of facts PLI
scope note: Collection of facts HYD
scope note: Collection of facts DMO
type: Class
subclass of: Mechanische transportleiding
subclass of: Restriction
  author of change: Marinus Vonhof
  date of change: 2016-04-28
  author at start life: Marinus Vonhof
  date of start life: 2014-12-02
  on class: Persleiding
  on property: has as part (inverse)
  max qualified cardinality: 1
subclass of: Restriction
  on property: heeft Uitvoering
  has value: DeelVanMechanischeTransportleiding
subclass of: Restriction
  on class: Sym_Leidingsegment
  on property: is represented by
  max qualified cardinality: 1

Sym_Leidingsegment
definition: Standaard stijl: Lijntype doorgetrokken, Lijnkleur 204 0 204, Lijndikte 2.0
author at start life: Johan Post
date of start life: 2021-10-01
scope note: Collection of facts NLCS
type: Class
subclass of: Geo-symbool
subclass of: Restriction
  author at start life: Marinus Vonhof
  date of start life: 2019-10-08
  on class: Leidingsegment
  on property: is represented by (inverse)
  max qualified cardinality: 1

Lekkage
definition: [NEN 3300:1996] Het intreden of uittreden van water via voegen, scheuren, langs inlaten of door de buiswand
author at start life: Marinus Vonhof
date of start life: 2022-09-30
validity context: *d
scope note: Collection of facts BAS
type: Class
subclass of: NEN 3300 Term

Lekwater
definition: [NEN 3300:1996] Ongecontroleerd intredend (grond)water of uittredend afvalwater bij de riolering
author at start life: Marinus Vonhof
date of start life: 2022-09-30
validity context: *d
scope note: Collection of facts BAS
type: Class
subclass of: NEN 3300 Term

Lengte
author of change: Marinus Vonhof
date of change: 2025-01-16
date of change: 2015-05-29
definition: In de richting van de langste afstand
definition: [IMBOR] Kenmerk voor de registratie van de langste horizontale dimensie van het beheerobject.
author at start life: Nic Roest (Idoro)
date of start life: 2006-02-17
comment: [is aspect]
scope note: Collection of facts TOP
type: Class
subclass of: Afstand

Lengte toegang
author of change: Marinus Vonhof
author of change: Nic Roest (Idoro)
date of change: 2025-01-16
date of change: 2006-11-23
definition: [IMBOR] Kenmerk voor de registratie van de langste horizontale dimensie van de opening die het mogelijk maakt tot het object te komen.
notation: JCB
author at start life: Nic Roest (Idoro)
date of start life: 2006-03-23
units of measurements: mm
validity context: 5d
comment: [is aspect]
scope note: Collection of facts RRB
scope note: Collection of facts LDR
scope note: Collection of facts HYD
type: Class
subclass of: Lengte
subclass of: Restriction
  author of change: Marinus Vonhof
  date of change: 2018-05-03
  author at start life: Finy Teitsma (Oranjewoud)
  date of start life: 2006-02-25
  on class: Rioolput
  on property: has as aspect (inverse)
  max qualified cardinality: 1
subclass of: Restriction
  author at start life: Marinus Vonhof
  date of start life: 2015-02-01
  on class: Reinigen rioolput
  on property: has as output (inverse)
  max qualified cardinality: 1
subclass of: Restriction
  on property: has as value
  all values from: integer

Lijngoot
author of change: Marinus Vonhof
author of change: Johan Post
date of change: 2025-01-16
date of change: 2021-10-01
definition: Goot in de lengterichting van de verharding, voorzien van een afdekking
author at start life: Marinus Vonhof
date of start life: 2014-09-06
scope note: Collection of facts MDS
scope note: Collection of facts HYD
type: Class
subclass of: Goot
subclass of: Restriction
  author of change: Marinus Vonhof
  date of change: 2026-08-04
  author at start life: Marinus Vonhof
  date of start life: 2016-04-15
  on class: Rooster
  on property: has as part
  qualified cardinality: 1
subclass of: Restriction
  author at start life: Marinus Vonhof
  date of start life: 2018-10-27
  on class: NLCS_HWA_GOOT_LIJNGOOT
  on property: is represented by
  max qualified cardinality: 1
subclass of: Restriction
  on property: heeft Uitvoering
  has value: LangsVerhardingMetAfdekking
subclass of: Restriction
  on class: Sym_Goot
  on property: is represented by
  max qualified cardinality: 1

NLCS_HWA_GOOT_LIJNGOOT
author of change: Marinus Vonhof
date of change: 2018-11-07
definition: Lijntype: CONTINUOUS
notation: 1790
author at start life: Marinus Vonhof
date of start life: 2018-10-27
scope note: Collection of facts NLCS
type: Class
subclass of: NLCS_Object
subclass of: Restriction
  author at start life: Marinus Vonhof
  date of start life: 2018-10-27
  on class: Lijngoot
  on property: is represented by (inverse)
  max qualified cardinality: 1

Lijngootaansluiting
definition: De aansluiting van een lijngoot op een rioolstelsel
author at start life: Marinus Vonhof
date of start life: 2026-08-04
scope note: Collection of facts BAS
type: Class
subclass of: Aansluiting
subclass of: Restriction
  on property: heeft Uitvoering
  has value: InzamelenMetLijngoot
subclass of: Restriction
  on class: Lijngoot
  on property: has as part
  min qualified cardinality: 1

Vrijverval transportleiding
author of change: Johan Post
author of change: Wouter van Riel
date of change: 2026-05-01
date of change: 2024-04-22
definition: Een transportleiding waarin de materie door de zwaartekracht wordt verplaatst
author at start life: Marinus Vonhof
date of start life: 2015-09-20
validity context: 3f
scope note: Collection of facts TOP
type: Class
subclass of: Transportleiding
subclass of: Restriction
  author of change: Marinus Vonhof
  date of change: 2015-09-20
  author at start life: Marinus Vonhof
  date of start life: 2014-12-02
  validity context: 1t 10t 12t
  on class: Vrijverval transportstelsel
  on property: has as part (inverse)
  qualified cardinality: 1
subclass of: Restriction
  author of change: Marinus Vonhof
  date of change: 2018-09-03
  author at start life: Marinus Vonhof
  date of start life: 2015-07-28
  on class: Lining
  on property: has as part
  max qualified cardinality: 1
subclass of: Restriction
  author at start life: Johan Post
  date of start life: 2026-05-01
  on class: Vrijverval rioolstelsel
  on property: has as part (inverse)
  max qualified cardinality: 1
subclass of: Restriction
  author at start life: Marinus Vonhof
  date of start life: 2018-10-27
  on class: NLCS_GWA_TRANSPORTLEIDING
  on property: is represented by
  max qualified cardinality: 1
subclass of: Restriction
  author at start life: Marinus Vonhof
  date of start life: 2018-10-27
  on class: NLCS_HWA_TRANSPORTLEIDING
  on property: is represented by
  max qualified cardinality: 1
subclass of: Restriction
  author at start life: Marinus Vonhof
  date of start life: 2018-10-27
  on class: NLCS_ITR_TRANSPORTLEIDING
  on property: is represented by
  max qualified cardinality: 1
subclass of: Restriction
  author at start life: Marinus Vonhof
  date of start life: 2018-10-27
  on class: NLCS_SWA_TRANSPORTLEIDING
  on property: is represented by
  max qualified cardinality: 1
subclass of: Restriction
  author at start life: Marinus Vonhof
  date of start life: 2018-10-27
  on class: NLCS_VWA_TRANSPORTLEIDING
  on property: is represented by
  max qualified cardinality: 1
subclass of: Restriction
  author at start life: Marinus Vonhof
  date of start life: 2019-05-15
  on class: Profiel leiding
  on property: has as aspect
  max qualified cardinality: 1
subclass of: Restriction
  on property: heeft Technologie
  has value: TransportDoorDeZwaartekracht

NLCS_RELINEN
author of change: Marinus Vonhof
date of change: 2018-11-07
definition: Lijntype: RI-RELINEN
notation: 2081
author at start life: Marinus Vonhof
date of start life: 2018-10-27
scope note: Collection of facts NLCS
type: Class
subclass of: NLCS_Object
subclass of: Restriction
  author at start life: Marinus Vonhof
  date of start life: 2018-10-27
  on class: Lining
  on property: is represented by (inverse)
  max qualified cardinality: 1

Lining aangebracht tijdens fabricage
label: Lining inserted during manufacture @en
author of change: Marinus Vonhof
date of change: 2025-01-16
definition: [IMBOR] Bekleding of een gehele leiding die reeds in een bestaande leiding wordt aangebracht tijden fabricage.
notation: A
author at start life: Marinus Vonhof
date of start life: 2018-12-12
scope note: Collection of facts MDS
scope note: Collection of facts LDR
scope note: Collection of facts MTR
type: Class
subclass of: Lining
subclass of: Restriction
  on property: heeft Uitvoering
  has value: AangebrachtTijdensFabricageLeiding

Wikkelbuis relining
label: Spirally wound lining @en
author of change: Marinus Vonhof
date of change: 2025-01-16
definition: [IMBOR] Een relining techniek waarbij een dunne holle buis wordt afgewikkeld van een haspel en tegen de binnenwand van de leiding wordt gespannen op spiraalvormige wijze.
notation: H
author at start life: Marinus Vonhof
date of start life: 2018-12-12
scope note: Collection of facts MDS
scope note: Collection of facts LDR
scope note: Collection of facts MTR
type: Class
subclass of: Lining
subclass of: Restriction
  on property: heeft Uitvoering
  has value: SpiraalvormigGespannenOpBinnenwand

Renoveren
author of change: Marinus Vonhof
date of change: 2019-04-04
definition: [NEN 3300:1996] herstel van het oorspronkelijke functioneren, waarbij een ingrijpende toestandswijziging wordt doorgevoerd; evenaren technische staat van nieuwaanleg
definition: [NEN-EN 752:2008] werkzaamheden aan gehele of gedeeltelijke oorspronkelijke aansluitleiding of riool waarmee de huidige prestaties worden verbeterd
author at start life: Marinus Vonhof
date of start life: 2013-03-26
validity context: 6d
see also: [EN ISO 11298-1:2018] work incorporating all or part of the original fabric of the pipeline, by means of which its current performance is improved
scope note: Collection of facts BAS
scope note: Collection of facts MTR
type: Class
subclass of: Maatregel
subclass of: Restriction
  on property: heeft Functie
  has value: DoorvoerenIngrijpendeToestandswijziging

Sym_LozeLeiding
author of change: Marinus Vonhof
date of change: 2018-11-10
definition: Standaard stijl: Lijntype doorgetrokken, Lijnkleur 127 127 127, Lijndikte 0.4
author at start life: Marinus Vonhof
date of start life: 2018-11-07
scope note: Collection of facts NLCS
type: Class
subclass of: Geo-symbool
subclass of: Restriction
  author at start life: Marinus Vonhof
  date of start life: 2018-11-07
  on class: Loze leiding
  on property: is represented by (inverse)
  max qualified cardinality: 1

NLCS_DRAINAGE_LOZINGSPUNT
author of change: Marinus Vonhof
date of change: 2018-11-07
definition: Lijntype: CONTINUOUS
notation: 1654
author at start life: Marinus Vonhof
date of start life: 2018-10-27
scope note: Collection of facts NLCS
type: Class
subclass of: NLCS_Object
subclass of: Restriction
  author at start life: Marinus Vonhof
  date of start life: 2018-10-27
  on class: Lozingspunt
  on property: is represented by (inverse)
  max qualified cardinality: 1

NLCS_GWA_LOZINGSPUNT
author of change: Marinus Vonhof
date of change: 2018-11-07
definition: Lijntype: CONTINUOUS
notation: 1699
author at start life: Marinus Vonhof
date of start life: 2018-10-27
scope note: Collection of facts NLCS
type: Class
subclass of: NLCS_Object
subclass of: Restriction
  author at start life: Marinus Vonhof
  date of start life: 2018-10-27
  on class: Lozingspunt
  on property: is represented by (inverse)
  max qualified cardinality: 1

NLCS_HWA_LOZINGSPUNT
author of change: Marinus Vonhof
date of change: 2018-11-07
definition: Lijntype: CONTINUOUS
notation: 1826
author at start life: Marinus Vonhof
date of start life: 2018-10-27
scope note: Collection of facts NLCS
type: Class
subclass of: NLCS_Object
subclass of: Restriction
  author at start life: Marinus Vonhof
  date of start life: 2018-10-27
  on class: Lozingspunt
  on property: is represented by (inverse)
  max qualified cardinality: 1

NLCS_ITR_LOZINGSPUNT
author of change: Marinus Vonhof
date of change: 2018-11-07
definition: Lijntype: CONTINUOUS
notation: 1975
author at start life: Marinus Vonhof
date of start life: 2018-10-27
scope note: Collection of facts NLCS
type: Class
subclass of: NLCS_Object
subclass of: Restriction
  author at start life: Marinus Vonhof
  date of start life: 2018-10-27
  on class: Lozingspunt
  on property: is represented by (inverse)
  max qualified cardinality: 1

NLCS_SWA_LOZINGSPUNT
author of change: Marinus Vonhof
date of change: 2018-11-07
definition: Lijntype: CONTINUOUS
notation: 2104
author at start life: Marinus Vonhof
date of start life: 2018-10-27
scope note: Collection of facts NLCS
type: Class
subclass of: NLCS_Object
subclass of: Restriction
  author at start life: Marinus Vonhof
  date of start life: 2018-10-27
  on class: Lozingspunt
  on property: is represented by (inverse)
  max qualified cardinality: 1

Sym_Lozingsput
author of change: Marinus Vonhof
date of change: 2018-11-11
definition: Aangepaste stijl: Vulkleur 0 0 0, Grootte 10
author at start life: Marinus Vonhof
date of start life: 2018-11-07
scope note: Collection of facts NLCS
type: Class
subclass of: Geo-symbool
subclass of: Restriction
  author at start life: Marinus Vonhof
  date of start life: 2018-11-07
  on class: Lozingsput
  on property: is represented by (inverse)
  max qualified cardinality: 1

Lozingsvergunning
definition: [NEN 3300:1996] Vergunning op grond van een wet om te mogen lozen
author at start life: Marinus Vonhof
date of start life: 2022-09-30
validity context: *d
scope note: Collection of facts BAS
type: Class
subclass of: NEN 3300 Term

Luchtpersgemaal
author of change: Marinus Vonhof
date of change: 2025-01-16
date of change: 2018-11-07
definition: Een gemaal uitgevoerd met een luchtcompressor die het afvalwater door de persleiding drukt
author at start life: Marinus Vonhof
date of start life: 2018-05-03
scope note: Collection of facts MDS
scope note: Collection of facts HYD
scope note: Collection of facts RGM
scope note: Collection of facts DMO
type: Class
subclass of: Rioolgemaal
subclass of: Restriction
  author of change: Marinus Vonhof
  date of change: 2018-11-07
  author at start life: Marinus Vonhof
  date of start life: 2018-05-03
  on class: Luchtpersriolering
  on property: has as part (inverse)
  qualified cardinality: 1
subclass of: Restriction
  on property: heeft Uitvoering
  has value: VerpomptMetEenLuchtcompressor

Luchtpersleiding
author of change: Marinus Vonhof
date of change: 2021-08-06
definition: Leiding bestemd voor de inzameling en het transport van huishoudelijk- en bedrijfsafvalwater, niet zijnde neerslag waarin het afvalwater door middel van lucht onder overdruk wordt getransporteerd
author at start life: Marinus Vonhof
date of start life: 2018-05-03
validity context: 1d
alternative label: Luchtpersriool
scope note: Collection of facts MDS
scope note: Collection of facts RGM
type: Class
subclass of: Mechanische rioolleiding
subclass of: Restriction
  author of change: Marinus Vonhof
  date of change: 2018-11-07
  author at start life: Marinus Vonhof
  date of start life: 2018-05-03
  on class: Luchtpersriolering
  on property: has as part (inverse)
  qualified cardinality: 1
subclass of: Restriction
  author at start life: Marinus Vonhof
  date of start life: 2018-11-07
  on class: Sym_Luchtpersleiding
  on property: is represented by
  max qualified cardinality: 1
subclass of: Restriction
  on property: heeft Functie
  has value: TransportVanVuilwater

Sym_Luchtpersleiding
author of change: Marinus Vonhof
date of change: 2018-11-10
definition: Standaard stijl: Lijntype doorgetrokken, Lijnkleur 255 127 255, Lijndikte 1.5
author at start life: Marinus Vonhof
date of start life: 2018-11-07
scope note: Collection of facts NLCS
type: Class
subclass of: Geo-symbool
subclass of: Restriction
  author at start life: Marinus Vonhof
  date of start life: 2018-11-07
  on class: Luchtpersleiding
  on property: is represented by (inverse)
  max qualified cardinality: 1

Luik
author of change: Marinus Vonhof
date of change: 2025-01-16
definition: [IMBOR] Een soort poort of deur ter bescherming van een raam of venster of als onderdeel van een kunstwerk of constructie.
author at start life: Marinus Vonhof
date of start life: 2020-04-17
scope note: Collection of facts MDS
scope note: Collection of facts REV
type: Class
subclass of: Afdekking
subclass of: Restriction
  on property: heeft Functie
  has value: Afsluiten
subclass of: Restriction
  on property: heeft Uitvoering
  has value: Scharnierend
subclass of: Restriction
  on property: heeft Functie
  has value: ToegankelijkHouden

Maasstructuur
definition: [NEN 3300:1996] Opbouw van een rioolstelsel in de vorm van met elkaar verbonden veelhoeken, waarbij de weg waarlangs afvalwater afvloeit ondermeer afhankelijk is van hoeveelheid afvalwater, leidingafmetingen en diepteligging van leidingen
author at start life: Marinus Vonhof
date of start life: 2022-09-30
validity context: *d
scope note: Collection of facts BAS
type: Class
subclass of: NEN 3300 Term

Status maatregel
author of change: Marinus Vonhof
date of change: 2020-04-18
definition: De realisatie-status van de maatregel in de volgorde: gepland - in voorbereiding - in uitvoering - uitgevoerd
author at start life: Marinus Vonhof
date of start life: 2013-03-26
validity context: 6d
comment: [is aspect]
scope note: Collection of facts BAS
scope note: Collection of facts MTR
type: Class
subclass of: Kenmerk
subclass of: Restriction
  author of change: Marinus Vonhof
  date of change: 2019-07-10
  author at start life: Marinus Vonhof
  date of start life: 2013-03-26
  on class: Maatregel
  on property: has as aspect (inverse)
  max qualified cardinality: 1
subclass of: Restriction
  on property: has as reference (qualification)
  all values from: Status maatregel (coll)

Maatstaf
definition: [NEN 3300:1996] Grenswaarde (getalsmatig) op basis waarvan geconcludeerd wordt of aan een functionele eis wordt voldaan
author at start life: Marinus Vonhof
date of start life: 2022-09-30
validity context: *d
scope note: Collection of facts BAS
type: Class
subclass of: NEN 3300 Term

Maninspectie
author of change: Johan Post
date of change: 2024-04-30
definition: [NEN 3300:1996] Inspectie waarbij het riool, het gemaal, e.d. door personen wordt betreden
author at start life: Marinus Vonhof
date of start life: 2022-09-30
validity context: *d
scope note: Collection of facts BAS
type: Class
subclass of: NEN 3300 Term

Mantelbuis
definition: [NEN 3300:1996] Buis bestemd voor de doorvoer van een andere buis
author at start life: Marinus Vonhof
date of start life: 2014-12-02
validity context: 10d
see also: [IMKL:1.1/2008] Beschermingsbuis.
scope note: Collection of facts BAS
type: Class
subclass of: Leiding
subclass of: Restriction
  author at start life: Marinus Vonhof
  date of start life: 2018-10-27
  on class: NLCS_GWA_MANTELBUIZEN
  on property: is represented by
  max qualified cardinality: 1
subclass of: Restriction
  author at start life: Marinus Vonhof
  date of start life: 2018-10-27
  on class: NLCS_HWA_MANTELBUIS
  on property: is represented by
  max qualified cardinality: 1
subclass of: Restriction
  author at start life: Marinus Vonhof
  date of start life: 2018-10-27
  on class: NLCS_ITR_MANTELBUIS
  on property: is represented by
  max qualified cardinality: 1
subclass of: Restriction
  author at start life: Marinus Vonhof
  date of start life: 2018-10-27
  on class: NLCS_MANTELBUIS
  on property: is represented by
  max qualified cardinality: 1
subclass of: Restriction
  author at start life: Marinus Vonhof
  date of start life: 2018-10-27
  on class: NLCS_PERSLEIDING_MANTELBUIS
  on property: is represented by
  max qualified cardinality: 1
subclass of: Restriction
  author at start life: Marinus Vonhof
  date of start life: 2018-10-27
  on class: NLCS_SWA_MANTELBUIS
  on property: is represented by
  max qualified cardinality: 1
subclass of: Restriction
  author at start life: Marinus Vonhof
  date of start life: 2018-10-27
  on class: NLCS_VACUUMLEIDING_MANTELBUIS
  on property: is represented by
  max qualified cardinality: 1
subclass of: Restriction
  author at start life: Marinus Vonhof
  date of start life: 2018-10-27
  on class: NLCS_VWA_MANTELBUIS
  on property: is represented by
  max qualified cardinality: 1
subclass of: Restriction
  author at start life: Marinus Vonhof
  date of start life: 2018-11-07
  on class: Sym_Mantelbuis
  on property: is represented by
  max qualified cardinality: 1
subclass of: Restriction
  on property: heeft Functie
  has value: DoorvoerenLeidingenEn ofKabels

NLCS_GWA_MANTELBUIZEN
author of change: Marinus Vonhof
date of change: 2018-11-07
definition: Lijntype: CONTINUOUS
notation: 1700
author at start life: Marinus Vonhof
date of start life: 2018-10-27
scope note: Collection of facts NLCS
type: Class
subclass of: NLCS_Object
subclass of: Restriction
  author at start life: Marinus Vonhof
  date of start life: 2018-10-27
  on class: Mantelbuis
  on property: is represented by (inverse)
  max qualified cardinality: 1

NLCS_HWA_MANTELBUIS
author of change: Marinus Vonhof
date of change: 2018-11-07
definition: Lijntype: CONTINUOUS
notation: 1827
author at start life: Marinus Vonhof
date of start life: 2018-10-27
scope note: Collection of facts NLCS
type: Class
subclass of: NLCS_Object
subclass of: Restriction
  author at start life: Marinus Vonhof
  date of start life: 2018-10-27
  on class: Mantelbuis
  on property: is represented by (inverse)
  max qualified cardinality: 1

NLCS_ITR_MANTELBUIS
author of change: Marinus Vonhof
date of change: 2018-11-07
definition: Lijntype: CONTINUOUS
notation: 1976
author at start life: Marinus Vonhof
date of start life: 2018-10-27
scope note: Collection of facts NLCS
type: Class
subclass of: NLCS_Object
subclass of: Restriction
  author at start life: Marinus Vonhof
  date of start life: 2018-10-27
  on class: Mantelbuis
  on property: is represented by (inverse)
  max qualified cardinality: 1

NLCS_MANTELBUIS
author of change: Marinus Vonhof
date of change: 2018-11-07
definition: Lijntype: CONTINUOUS
notation: 2051
author at start life: Marinus Vonhof
date of start life: 2018-10-27
scope note: Collection of facts NLCS
type: Class
subclass of: NLCS_Object
subclass of: Restriction
  author at start life: Marinus Vonhof
  date of start life: 2018-10-27
  on class: Mantelbuis
  on property: is represented by (inverse)
  max qualified cardinality: 1

NLCS_PERSLEIDING_MANTELBUIS
author of change: Marinus Vonhof
date of change: 2018-11-07
definition: Lijntype: CONTINUOUS
notation: 2071
author at start life: Marinus Vonhof
date of start life: 2018-10-27
scope note: Collection of facts NLCS
type: Class
subclass of: NLCS_Object
subclass of: Restriction
  author at start life: Marinus Vonhof
  date of start life: 2018-10-27
  on class: Mantelbuis
  on property: is represented by (inverse)
  max qualified cardinality: 1

NLCS_SWA_MANTELBUIS
author of change: Marinus Vonhof
date of change: 2018-11-07
definition: Lijntype: CONTINUOUS
notation: 2105
author at start life: Marinus Vonhof
date of start life: 2018-10-27
scope note: Collection of facts NLCS
type: Class
subclass of: NLCS_Object
subclass of: Restriction
  author at start life: Marinus Vonhof
  date of start life: 2018-10-27
  on class: Mantelbuis
  on property: is represented by (inverse)
  max qualified cardinality: 1

NLCS_VACUUMLEIDING_MANTELBUIS
author of change: Marinus Vonhof
date of change: 2018-11-07
definition: Lijntype: CONTINUOUS
notation: 2211
author at start life: Marinus Vonhof
date of start life: 2018-10-27
scope note: Collection of facts NLCS
type: Class
subclass of: NLCS_Object
subclass of: Restriction
  author at start life: Marinus Vonhof
  date of start life: 2018-10-27
  on class: Mantelbuis
  on property: is represented by (inverse)
  max qualified cardinality: 1

NLCS_VWA_MANTELBUIS
author of change: Marinus Vonhof
date of change: 2018-11-07
definition: Lijntype: CONTINUOUS
notation: 2245
author at start life: Marinus Vonhof
date of start life: 2018-10-27
scope note: Collection of facts NLCS
type: Class
subclass of: NLCS_Object
subclass of: Restriction
  author at start life: Marinus Vonhof
  date of start life: 2018-10-27
  on class: Mantelbuis
  on property: is represented by (inverse)
  max qualified cardinality: 1

Sym_Mantelbuis
author of change: Marinus Vonhof
date of change: 2018-11-10
definition: Standaard stijl: Lijntype doorgetrokken, Lijnkleur 255 0 0, Lijndikte 2.0
author at start life: Marinus Vonhof
date of start life: 2018-11-07
scope note: Collection of facts NLCS
type: Class
subclass of: Geo-symbool
subclass of: Restriction
  author at start life: Marinus Vonhof
  date of start life: 2018-11-07
  on class: Mantelbuis
  on property: is represented by (inverse)
  max qualified cardinality: 1

Mantoegankelijke put
author of change: Johan Post
author of change: Eric van Gorkom
date of change: 2024-04-30
date of change: 2021-09-23
definition: [NEN-EN 752:2008] put met een verwijderbaar deksel, die aan personeel toegang geeft tot een aansluitleiding of riool. Dient minimaal 600mm doorsnede te hebben.
author at start life: Marinus Vonhof
date of start life: 2013-10-01
alternative label: Menstoegankelijke put
scope note: Collection of facts BAS
type: Class
subclass of: Rioolput
subclass of: Extra objecttype (rol)
subclass of: Restriction
  on property: heeft Uitvoering
  has value: Mantoegankelijk
subclass of: Restriction
  on property: heeft Uitvoering
  has value: VerwijderbaarDeksel

Materiaal afsluiter
author at start life: Wouter van Riel
date of start life: 2024-04-22
comment: Intrinsiek aspect
comment: [is aspect]
scope note: Collection of facts BAS
scope note: Collection of facts PLI
type: Class
subclass of: Materiaal
subclass of: Restriction
  author at start life: Wouter van Riel
  date of start life: 2024-04-22
  on class: Mechanische afsluiter
  on property: has as aspect (inverse)
  max qualified cardinality: 1
subclass of: Restriction
  on property: has as reference (qualification)
  all values from: Materiaal afsluiter (coll)

Materiaal omhulling
author of change: Wouter van Riel
date of change: 2024-04-20
author at start life: Marinus Vonhof
date of start life: 2018-12-06
validity context: 1d 3d 10d 12d
comment: [is aspect]
scope note: Collection of facts BAS
type: Class
subclass of: Materiaal
subclass of: Restriction
  author of change: Marinus Vonhof
  date of change: 2026-07-13
  author at start life: Marinus Vonhof
  date of start life: 2018-12-06
  on class: Omhulling
  on property: has as aspect (inverse)
  max qualified cardinality: 1
subclass of: Restriction
  on property: has as reference (qualification)
  all values from: Materiaal omhulling (coll)

Materiaal substraat
author at start life: Marinus Vonhof
date of start life: 2026-07-13
comment: [is aspect]
scope note: Collection of facts MDS
type: Class
subclass of: Materiaal
subclass of: Restriction
  on property: has as reference (qualification)
  all values from: Materiaal substraat (coll)
subclass of: Restriction
  on class: Substraat
  on property: has as aspect (inverse)
  max qualified cardinality: 1

Substraat
definition: De vulling van een ruimte met een variabele porositeit en doorlaatbaarheid
author at start life: Marinus Vonhof
date of start life: 2026-08-05
scope note: Collection of facts MDS
scope note: Collection of facts HYD
type: Class
subclass of: Constructieonderdeel
subclass of: Restriction
  on class: Doorlaatbaarheid
  on property: has as aspect
  max qualified cardinality: 1
subclass of: Restriction
  on property: heeft Functie
  has value: OpslagVanHemelwater
subclass of: Restriction
  on property: heeft Functie
  has value: TransportVanHemelwater
subclass of: Restriction
  on class: Materiaal substraat
  on property: has as aspect
  max qualified cardinality: 1
subclass of: Restriction
  on class: Porositeit
  on property: has as aspect
  max qualified cardinality: 1

Standmeter
author of change: Marinus Vonhof
date of change: 2025-01-16
definition: [IMBOR] Aanwijzen afsluiterstand.
author at start life: Marinus Vonhof
date of start life: 2015-02-28
validity context: 10d
scope note: Collection of facts BAS
type: Class
subclass of: Constructieonderdeel
subclass of: Restriction
  author of change: Marinus Vonhof
  date of change: 2016-04-13
  author at start life: Marinus Vonhof
  date of start life: 2013-02-05
  on class: Mechanische afsluiter
  on property: has as part (inverse)
  qualified cardinality: 1
subclass of: Restriction
  on property: heeft Functie
  has value: AanwijzenAfsluiterstand

Niveau benedenstrooms openen
author of change: Marinus Vonhof
date of change: 2025-01-16
date of change: 2019-07-11
definition: [IMBOR] Hoogte t.o.v. NAP om de afsluiter benedenstrooms te openen.
author at start life: Marinus Vonhof
date of start life: 2016-04-23
units of measurements: m
alternative label: Niveau stroomafwaarts openen
comment: [is aspect]
scope note: Collection of facts HYD
type: Class
subclass of: Hoogte t.o.v. NAP
subclass of: Restriction
  author of change: Marinus Vonhof
  date of change: 2019-05-15
  author at start life: Marinus Vonhof
  date of start life: 2013-02-05
  on class: Mechanische afsluiter
  on property: has as aspect (inverse)
  max qualified cardinality: 1
subclass of: Restriction
  on property: has as value
  all values from: decimal

Niveau benedenstrooms sluiten
author of change: Marinus Vonhof
date of change: 2025-01-16
date of change: 2019-07-11
definition: [IMBOR] Hoogte t.o.v. NAP om de afsluiter benedenstrooms te sluiten.
author at start life: Marinus Vonhof
date of start life: 2013-02-05
units of measurements: m
alternative label: Niveau stroomafwaarts sluiten
comment: [is aspect]
scope note: Collection of facts HYD
type: Class
subclass of: Hoogte t.o.v. NAP
subclass of: Restriction
  author of change: Marinus Vonhof
  date of change: 2019-05-15
  author at start life: Marinus Vonhof
  date of start life: 2013-02-05
  on class: Mechanische afsluiter
  on property: has as aspect (inverse)
  max qualified cardinality: 1
subclass of: Restriction
  on property: has as value
  all values from: decimal

Niveau bovenstrooms openen
author of change: Marinus Vonhof
date of change: 2025-01-16
date of change: 2019-07-11
definition: [IMBOR] Hoogte t.o.v. NAP om de afsluiter bovenstrooms te openen.
author at start life: Marinus Vonhof
date of start life: 2013-02-05
units of measurements: m
alternative label: Niveau stroomopwaarts openen
comment: [is aspect]
scope note: Collection of facts HYD
type: Class
subclass of: Hoogte t.o.v. NAP
subclass of: Restriction
  author of change: Marinus Vonhof
  date of change: 2019-05-15
  author at start life: Marinus Vonhof
  date of start life: 2013-02-05
  on class: Mechanische afsluiter
  on property: has as aspect (inverse)
  max qualified cardinality: 1
subclass of: Restriction
  on property: has as value
  all values from: decimal

Niveau bovenstrooms sluiten
author of change: Marinus Vonhof
date of change: 2025-01-16
date of change: 2019-07-11
definition: [IMBOR] Hoogte t.o.v. NAP om de afsluiter bovenstrooms te sluiten.
author at start life: Marinus Vonhof
date of start life: 2013-02-05
units of measurements: m
alternative label: Niveau stroomopwaarts sluiten
comment: [is aspect]
scope note: Collection of facts HYD
type: Class
subclass of: Hoogte t.o.v. NAP
subclass of: Restriction
  author of change: Marinus Vonhof
  date of change: 2019-05-15
  author at start life: Marinus Vonhof
  date of start life: 2013-02-05
  on class: Mechanische afsluiter
  on property: has as aspect (inverse)
  max qualified cardinality: 1
subclass of: Restriction
  on property: has as value
  all values from: decimal

Serienummer
author of change: Marinus Vonhof
date of change: 2025-01-16
definition: [IMBOR] Unieke code die door de fabrikant aan dit beheerobject (een exemplaar uit een reeks producten) gegeven wordt.
author at start life: Marinus Vonhof
date of start life: 2013-02-05
comment: [is aspect]
scope note: Collection of facts BAS
scope note: Collection of facts PLI
scope note: Collection of facts RGM
type: Class
subclass of: Unieke identificatie
subclass of: Restriction
  author of change: Marinus Vonhof
  date of change: 2013-09-10
  author at start life: Marinus Vonhof
  date of start life: 2013-02-05
  on class: Pomp
  on property: has as aspect (inverse)
  max qualified cardinality: 1
subclass of: Restriction
  author of change: Marinus Vonhof
  date of change: 2019-05-15
  author at start life: Marinus Vonhof
  date of start life: 2013-02-05
  on class: Mechanische afsluiter
  on property: has as aspect (inverse)
  max qualified cardinality: 1
subclass of: Restriction
  author at start life: Marinus Vonhof
  date of start life: 2020-04-17
  on class: Rioolafsluiter
  on property: has as aspect (inverse)
  max qualified cardinality: 1

Stopcode stroomgroep
author of change: Marinus Vonhof
date of change: 2025-01-16
definition: [IMBOR] Stopcode van de stroomgroep waarop het object aangesloten is.
author at start life: Marinus Vonhof
date of start life: 2013-02-05
comment: [is aspect]
scope note: Collection of facts BAS
scope note: Collection of facts PLI
type: Class
subclass of: Kenmerk
subclass of: Restriction
  author of change: Marinus Vonhof
  date of change: 2019-05-15
  author at start life: Marinus Vonhof
  date of start life: 2013-02-05
  on class: Mechanische afsluiter
  on property: has as aspect (inverse)
  max qualified cardinality: 1

Standaard afsluiterstand
author at start life: Marinus Vonhof
date of start life: 2018-12-06
comment: [is aspect]
scope note: Collection of facts BAS
scope note: Collection of facts PLI
type: Class
subclass of: Kenmerk
subclass of: Restriction
  author at start life: Marinus Vonhof
  date of start life: 2018-12-06
  on class: Mechanische afsluiter
  on property: has as aspect (inverse)
  max qualified cardinality: 1
subclass of: Restriction
  on property: has as reference (qualification)
  all values from: Standaard afsluiterstand (coll)

Mechanische perceelaansluiting
definition: Een aansluiting waarin het afvalwater door middel van onder-/overdruk wordt getransporteerd.
author at start life: Marinus Vonhof
date of start life: 2019-07-10
scope note: Collection of facts MDS
type: Class
subclass of: Perceelaansluiting
subclass of: Restriction
  on property: heeft Technologie
  has value: TransportOnderOverdrukOfOnderdruk

Voorzorgsmaatregel-document
author of change: Marinus Vonhof
date of change: 2025-01-16
date of change: 2025-07-23
definition: In kader WIBON, document met bijzondere maatregelen bij ontgraven
definition: [IMBOR] Een document dat een (set van) maatregel(en) vastlegt om problemen te voorkomen met betrekking tot uitvoerend werk bij, aan of op een object.
author at start life: Marinus Vonhof
date of start life: 2018-12-05
validity context: *f
scope note: Collection of facts BAS
type: Class
subclass of: Informatiedrager
subclass of: Restriction
  author of change: Marinus Vonhof
  date of change: 2026-07-23
  author at start life: Marinus Vonhof
  date of start life: 2018-12-05
  on class: Mechanische rioolleiding
  on property: is represented by (inverse)
  max qualified cardinality: 1
subclass of: Restriction
  author of change: Marinus Vonhof
  date of change: 2026-07-23
  author at start life: Marinus Vonhof
  date of start life: 2018-12-05
  on class: Transportleiding
  on property: is represented by (inverse)
  max qualified cardinality: 1

Meer
author of change: Marinus Vonhof
date of change: 2025-01-16
definition: [IMBOR] Een massa stilstaand landoppervlaktewater. (Bron: definities.geostandaarden.nl)
author at start life: Marinus Vonhof
date of start life: 2017-05-31
validity context: 1d 3d 10d 12d 14d
scope note: Collection of facts MDS
type: Class
subclass of: Watervlakte
subclass of: Restriction
  on property: heeft Structuur
  has value: NietStromend

Sensor
author of change: Marinus Vonhof
date of change: 2025-01-16
date of change: 2023-01-13
definition: Onderdeel wat een natuurkundige grootheid meet.
definition: [IMBOR] Apparaat voor de meting van een fysieke grootheid (bijv. temperatuur, licht, druk, elektriciteit).
author at start life: Eric van Gorkom
date of start life: 2022-12-24
validity context: 10d
scope note: Collection of facts BAS
type: Class
subclass of: Constructieonderdeel
subclass of: Restriction
  on property: heeft Functie
  has value: MetenVanNatuurkundigeGrootheid
subclass of: Restriction
  on class: Meetinstrument
  on property: has as part (inverse)
  min qualified cardinality: 0

PLC
author of change: Finy Teitsma (Oranjewoud)
date of change: 2007-11-12
definition: Een apparaat met een microprocessor die bij de besturing van pompen wordt toegepast (PLC=Programmable Logic Controller).
author at start life: Finy Teitsma (Oranjewoud)
date of start life: 2007-10-23
scope note: Collection of facts BAS
type: Class
subclass of: Elektronisch component
subclass of: Restriction
  author at start life: Finy Teitsma (Oranjewoud)
  date of start life: 2007-11-30
  on class: Meetinstrument
  on property: is connected to
  max qualified cardinality: 1
subclass of: Restriction
  on property: heeft Functie
  has value: AansturenVanEenPompDoorMiddelVanEenMicroproc

Meetput
definition: [NEN 3300:1996] Rioolput geschikt voor het doen van metingen
author at start life: Marinus Vonhof
date of start life: 2022-09-30
validity context: *d
scope note: Collection of facts BAS
type: Class
subclass of: NEN 3300 Term

Meetwaarde
author of change: Marinus Vonhof
date of change: 2025-01-16
date of change: 2016-04-29
definition: [IMBOR] Het getal of de categorie die op grond van een meting aan een attribuut bij een entiteit wordt toegewezen.
author at start life: Nic Roest (Idoro)
date of start life: 2008-03-11
comment: [is aspect]
scope note: Collection of facts BAS
scope note: Collection of facts DMO
type: Class
subclass of: Kenmerk
subclass of: Restriction
  author of change: Marinus Vonhof
  date of change: 2016-04-29
  author at start life: Finy Teitsma (Oranjewoud)
  date of start life: 2007-10-23
  on class: Meten
  on property: has as aspect (inverse)
  max qualified cardinality: 1

Middenspanningskabel
author of change: Marinus Vonhof
author of change: Johan Post
date of change: 2025-01-16
date of change: 2021-10-01
author at start life: Marinus Vonhof
date of start life: 2015-07-28
validity context: 1d 3d
see also: [IMKL: 1.1/2008] MS = middenspanning (0,4 kV tot 30 kV)
scope note: Collection of facts BAS
type: Class
subclass of: Voedingskabel
subclass of: Restriction
  on property: heeft Uitvoering
  has value: OntworpenVoorMiddenspanning
subclass of: Restriction
  on class: Sym_Kabel
  on property: is represented by
  max qualified cardinality: 1

Mof
definition: Een hulpstuk bestemd voor het verbinden van twee leidingen
author at start life: Wouter van Riel
date of start life: 2024-04-20
scope note: Collection of facts MDS
scope note: Collection of facts LDR
scope note: Collection of facts PLI
scope note: Collection of facts HYD
type: Class
subclass of: Verbindingsstuk
subclass of: Restriction
  on property: heeft Functie
  has value: VerbindenVanTweeLeidingen

Molgoot
author of change: Marinus Vonhof
date of change: 2019-04-30
definition: Goot in de lengterichting van de verharding, met veelal een cirkelsegment als dwarsprofiel.
definition: [NEN 3300:1996] verdieping langs de rand van het wegoppervlak voor de afvoer van op het wegoppervlak gevallen neerslag
author at start life: Finy Teitsma (Oranjewoud)
date of start life: 2007-10-23
scope note: Collection of facts MDS
scope note: Collection of facts HYD
type: Class
subclass of: Goot
subclass of: Restriction
  on property: heeft Uitvoering
  has value: MetEenCirkelsegmentAlsDwarsprofiel

Monsternamepunt
author of change: Marinus Vonhof
date of change: 2025-01-16
definition: [IMBOR] Een meetpunt dat dient om een 'monster', met andere worden een specimen, van de ondergrond, het water etc. op de locatie van het meetpunt af te nemen.
author at start life: Marinus Vonhof
date of start life: 2015-07-09
validity context: 1d 3d 10d 12d 14d
scope note: Collection of facts MDS
type: Class
subclass of: Meetpunt

Motorvermogen
author of change: Marinus Vonhof
date of change: 2025-01-16
definition: [IMBOR] De productiecapaciteit van een apparaat in kW.
author at start life: Marinus Vonhof
date of start life: 2018-12-06
units of measurements: kW
comment: [is aspect]
scope note: Collection of facts BAS
scope note: Collection of facts RGM
type: Class
subclass of: Kenmerk
subclass of: Restriction
  author at start life: Marinus Vonhof
  date of start life: 2018-12-06
  on class: Pomp
  on property: has as aspect (inverse)
  max qualified cardinality: 1
subclass of: Restriction
  on property: has as value
  all values from: decimal

NLCS_AWZI
author of change: Marinus Vonhof
date of change: 2018-11-07
definition: Lijntype: CONTINUOUS
notation: 3451
author at start life: Marinus Vonhof
date of start life: 2018-10-27
scope note: Collection of facts NLCS
type: Class
subclass of: NLCS_Object
subclass of: Restriction
  author at start life: Marinus Vonhof
  date of start life: 2018-10-27
  on class: RWZI
  on property: is represented by (inverse)
  max qualified cardinality: 1

NLCS_Object
author of change: Marinus Vonhof
date of change: 2018-11-11
author at start life: Marinus Vonhof
date of start life: 2018-10-27
scope note: Collection of facts NLCS
type: Class
subclass of: Informatiedrager

NLCS_DRAINAGE_HULPSTUK_T STUK
author of change: Marinus Vonhof
date of change: 2018-11-07
definition: Lijntype: CONTINUOUS / Symbool: 3367 - DRAIN_T STUK
notation: 3501
author at start life: Marinus Vonhof
date of start life: 2018-10-27
scope note: Collection of facts NLCS
type: Class
subclass of: NLCS_Object
subclass of: Restriction
  author at start life: Marinus Vonhof
  date of start life: 2018-10-27
  on class: T-stuk
  on property: is represented by (inverse)
  max qualified cardinality: 1

NLCS_DRAINAGE_PUTDEKSELHOOGTE
author of change: Marinus Vonhof
date of change: 2018-11-07
definition: Lijntype: CONTINUOUS / Symbool: 1018 - PUTDEKSELHOOGTE
notation: 1659
author at start life: Marinus Vonhof
date of start life: 2018-10-27
scope note: Collection of facts NLCS
type: Class
subclass of: NLCS_Object
subclass of: Restriction
  author at start life: Marinus Vonhof
  date of start life: 2018-10-27
  on class: Putdekselniveau
  on property: is represented by (inverse)
  max qualified cardinality: 1

NLCS_DRAINAGE_TALUDGOOT
author of change: Marinus Vonhof
date of change: 2018-11-07
definition: Lijntype: CONTINUOUS / Symbool: 972 - DRAIN_TALUDGOOT
notation: 1662
author at start life: Marinus Vonhof
date of start life: 2018-10-27
scope note: Collection of facts NLCS
type: Class
subclass of: NLCS_Object
subclass of: Restriction
  author at start life: Marinus Vonhof
  date of start life: 2018-10-27
  on class: Taludgoot
  on property: is represented by (inverse)
  max qualified cardinality: 1

Taludgoot
author of change: Johan Post
date of change: 2021-10-01
definition: Goot die in het talud loodrecht op de kruinlijn is aangebracht.
author at start life: Finy Teitsma (Oranjewoud)
date of start life: 2007-10-23
scope note: Collection of facts MDS
scope note: Collection of facts HYD
type: Class
subclass of: Goot
subclass of: Restriction
  author at start life: Marinus Vonhof
  date of start life: 2018-10-27
  on class: NLCS_DRAINAGE_TALUDGOOT
  on property: is represented by
  max qualified cardinality: 1
subclass of: Restriction
  on property: heeft Uitvoering
  has value: InEenTaludLoodrechtOpDeKruinlijnAangebracht
subclass of: Restriction
  on class: Sym_Goot
  on property: is represented by
  max qualified cardinality: 1

NLCS_DRAINAGE_UITSTROOMBAK
author of change: Marinus Vonhof
date of change: 2018-11-07
definition: Lijntype: CONTINUOUS / Symbool: 1022 - UITSTROOMBAK
notation: 3500
author at start life: Marinus Vonhof
date of start life: 2018-10-27
scope note: Collection of facts NLCS
type: Class
subclass of: NLCS_Object
subclass of: Restriction
  author at start life: Marinus Vonhof
  date of start life: 2018-10-27
  on class: Uitlaatconstructie
  on property: is represented by (inverse)
  max qualified cardinality: 1

NLCS_GWA_HULPSTUK_ONTSTOPPINGSSTUK
author of change: Marinus Vonhof
date of change: 2018-11-07
definition: Lijntype: CONTINUOUS / Symbool: 989 - HULP_ONTSTOP
notation: 1684
author at start life: Marinus Vonhof
date of start life: 2018-10-27
scope note: Collection of facts NLCS
type: Class
subclass of: NLCS_Object
subclass of: Restriction
  author at start life: Marinus Vonhof
  date of start life: 2018-10-27
  on class: Ontstoppingsstuk
  on property: is represented by (inverse)
  max qualified cardinality: 1

NLCS_GWA_KOLK_STRAATKOLK
author of change: Marinus Vonhof
date of change: 2018-11-07
definition: Lijntype: CONTINUOUS / Symbool: 2848 - KOLK_STRAAT_300X300
notation: 1688
author at start life: Marinus Vonhof
date of start life: 2018-10-27
scope note: Collection of facts NLCS
type: Class
subclass of: NLCS_Object
subclass of: Restriction
  author at start life: Marinus Vonhof
  date of start life: 2018-10-27
  on class: Straatkolk
  on property: is represented by (inverse)
  max qualified cardinality: 1

NLCS_GWA_KOLK_TROTTOIRKOLK
author of change: Marinus Vonhof
date of change: 2018-11-07
definition: Lijntype: CONTINUOUS / Symbool: 2117 - KOLK_TROTTOIR
notation: 1689
author at start life: Marinus Vonhof
date of start life: 2018-10-27
scope note: Collection of facts NLCS
type: Class
subclass of: NLCS_Object
subclass of: Restriction
  author at start life: Marinus Vonhof
  date of start life: 2018-10-27
  on class: Trottoirkolk
  on property: is represented by (inverse)
  max qualified cardinality: 1

NLCS_GWA_PUTDEKSELHOOGTE
author of change: Marinus Vonhof
date of change: 2018-11-07
definition: Lijntype: CONTINUOUS / Symbool: 1018 - PUTDEKSELHOOGTE
notation: 1701
author at start life: Marinus Vonhof
date of start life: 2018-10-27
scope note: Collection of facts NLCS
type: Class
subclass of: NLCS_Object
subclass of: Restriction
  author at start life: Marinus Vonhof
  date of start life: 2018-10-27
  on class: Putdekselniveau
  on property: is represented by (inverse)
  max qualified cardinality: 1

NLCS_GWA_RIOOLPUT
author of change: Marinus Vonhof
date of change: 2018-11-07
definition: Lijntype: CONTINUOUS
notation: 1703
author at start life: Marinus Vonhof
date of start life: 2018-10-27
scope note: Collection of facts NLCS
type: Class
subclass of: NLCS_Object
subclass of: Restriction
  author at start life: Marinus Vonhof
  date of start life: 2018-10-27
  on class: Rioolput
  on property: is represented by (inverse)
  max qualified cardinality: 1

NLCS_GWA_RIOOLPUT_ONTSTOPPINGSPUT
author of change: Marinus Vonhof
date of change: 2018-11-07
definition: Lijntype: CONTINUOUS / Symbool: 1009 - PUT_ONTSTOPPINGSPUT
notation: 1713
author at start life: Marinus Vonhof
date of start life: 2018-10-27
scope note: Collection of facts NLCS
type: Class
subclass of: NLCS_Object
subclass of: Restriction
  author at start life: Marinus Vonhof
  date of start life: 2018-10-27
  on class: Ontstoppingsput
  on property: is represented by (inverse)
  max qualified cardinality: 1

Ontstoppingsput
definition: Een put waarop een aansluitleiding is aangesloten, bestemd voor inspectie en reiniging van de aansluitleiding.
author at start life: Marinus Vonhof
date of start life: 2013-10-04
scope note: Collection of facts BAS
type: Class
subclass of: Aansluitput
subclass of: Restriction
  author at start life: Marinus Vonhof
  date of start life: 2018-10-27
  on class: NLCS_GWA_RIOOLPUT_ONTSTOPPINGSPUT
  on property: is represented by
  max qualified cardinality: 1
subclass of: Restriction
  author at start life: Marinus Vonhof
  date of start life: 2018-10-27
  on class: NLCS_HWA_RIOOLPUT_ONTSTOPPINGSPUT
  on property: is represented by
  max qualified cardinality: 1
subclass of: Restriction
  author at start life: Marinus Vonhof
  date of start life: 2018-10-27
  on class: NLCS_ITR_RIOOLPUT_ONTSTOPPINGSPUT
  on property: is represented by
  max qualified cardinality: 1
subclass of: Restriction
  author at start life: Marinus Vonhof
  date of start life: 2018-10-27
  on class: NLCS_SWA_RIOOLPUT_ONTSTOPPINGSPUT
  on property: is represented by
  max qualified cardinality: 1
subclass of: Restriction
  author at start life: Marinus Vonhof
  date of start life: 2018-10-27
  on class: NLCS_VWA_RIOOLPUT_ONTSTOPPINGSPUT
  on property: is represented by
  max qualified cardinality: 1
subclass of: Restriction
  on property: heeft Doel
  has value: Ontstoppen
subclass of: Restriction
  on property: heeft Functie
  has value: ToegangGevenTotAansluitleiding

NLCS_GWA_RIOOLPUT_OVERSTORTPUT
author of change: Marinus Vonhof
date of change: 2018-11-07
definition: Lijntype: CONTINUOUS / Symbool: 2124 - PUT_OVERSTORT
notation: 1716
author at start life: Marinus Vonhof
date of start life: 2018-10-27
scope note: Collection of facts NLCS
type: Class
subclass of: NLCS_Object
subclass of: Restriction
  author at start life: Marinus Vonhof
  date of start life: 2018-10-27
  on class: Overstortput
  on property: is represented by (inverse)
  max qualified cardinality: 1

NLCS_GWA_RIOOLPUT_POMPPUT
author of change: Marinus Vonhof
date of change: 2018-11-07
definition: Lijntype: CONTINUOUS / Symbool: 2125 - PUT_POMPPUT
notation: 1719
author at start life: Marinus Vonhof
date of start life: 2018-10-27
scope note: Collection of facts NLCS
type: Class
subclass of: NLCS_Object
subclass of: Restriction
  author at start life: Marinus Vonhof
  date of start life: 2018-10-27
  on class: Pompput
  on property: is represented by (inverse)
  max qualified cardinality: 1

NLCS_GWA_RIOOLPUT_STUWPUT
author of change: Marinus Vonhof
date of change: 2018-11-07
definition: Lijntype: CONTINUOUS / Symbool: 1013 - PUT_STUWPUT
notation: 1722
author at start life: Marinus Vonhof
date of start life: 2018-10-27
scope note: Collection of facts NLCS
type: Class
subclass of: NLCS_Object
subclass of: Restriction
  author at start life: Marinus Vonhof
  date of start life: 2018-10-27
  on class: Stuwput
  on property: is represented by (inverse)
  max qualified cardinality: 1

NLCS_GWA_SCHILDMUUR
author of change: Marinus Vonhof
date of change: 2018-11-07
definition: Lijntype: CONTINUOUS / Symbool: 3365 - SCHILDMUUR
notation: 3485
author at start life: Marinus Vonhof
date of start life: 2018-10-27
scope note: Collection of facts NLCS
type: Class
subclass of: NLCS_Object
subclass of: Restriction
  author at start life: Marinus Vonhof
  date of start life: 2018-10-27
  on class: Schildmuur
  on property: is represented by (inverse)
  max qualified cardinality: 1

Schildmuur
author of change: Marinus Vonhof
author of change: Johan Post
date of change: 2025-01-16
date of change: 2019-04-05
definition: [IMBOR] Een scheiding, vaak gemaakt van metselwerk, die in een put aangebracht kan worden om de stroming door de put aan te passen.
author at start life: Marinus Vonhof
date of start life: 2013-10-04
validity context: 1d
comment: Een schildmuur is topologisch gezien een verbinding (zoals wand, pomp, doorlaat). Een schildmuur kan ook als knooppunt beschreven worden, gebruik dan het concept "Schildmuur (eindkap)".
scope note: Collection of facts MDS
scope note: Collection of facts HYD
scope note: Collection of facts DMO
type: Class
subclass of: Wand
subclass of: Restriction
  author at start life: Marinus Vonhof
  date of start life: 2018-10-27
  on class: NLCS_GWA_SCHILDMUUR
  on property: is represented by
  max qualified cardinality: 1
subclass of: Restriction
  author at start life: Marinus Vonhof
  date of start life: 2018-10-27
  on class: NLCS_HWA_SCHILDMUUR
  on property: is represented by
  max qualified cardinality: 1
subclass of: Restriction
  author at start life: Marinus Vonhof
  date of start life: 2018-10-27
  on class: NLCS_SWA_SCHILDMUUR
  on property: is represented by
  max qualified cardinality: 1
subclass of: Restriction
  on property: heeft Functie
  has value: VolledigKerenVanWater
subclass of: Restriction
  on class: Sym_Schildmuur
  on property: is represented by
  max qualified cardinality: 1

NLCS_GWA_TRANSPORTLEIDING
author of change: Marinus Vonhof
date of change: 2018-11-07
definition: Lijntype: RI-GWA
notation: 1731
author at start life: Marinus Vonhof
date of start life: 2018-10-27
scope note: Collection of facts NLCS
type: Class
subclass of: NLCS_Object
subclass of: Restriction
  author at start life: Marinus Vonhof
  date of start life: 2018-10-27
  on class: Vrijverval transportleiding
  on property: is represented by (inverse)
  max qualified cardinality: 1

NLCS_HUISAANSLUITING
author of change: Marinus Vonhof
date of change: 2018-11-07
definition: Lijntype: RI-HUISAANSLUITING
notation: 1785
author at start life: Marinus Vonhof
date of start life: 2018-10-27
scope note: Collection of facts NLCS
type: Class
subclass of: NLCS_Object
subclass of: Restriction
  author at start life: Marinus Vonhof
  date of start life: 2018-10-27
  on class: Perceelaansluitleiding
  on property: is represented by (inverse)
  max qualified cardinality: 1

NLCS_HWA_GOOT_LIJNGOOT_ZANDVANGER
author of change: Marinus Vonhof
date of change: 2018-11-07
definition: Lijntype: CONTINUOUS
notation: 1791
author at start life: Marinus Vonhof
date of start life: 2018-10-27
scope note: Collection of facts NLCS
type: Class
subclass of: NLCS_Object
subclass of: Restriction
  author at start life: Marinus Vonhof
  date of start life: 2018-10-27
  on class: Zonk
  on property: is represented by (inverse)
  max qualified cardinality: 1

NLCS_HWA_GOOT_ROOSTERGOOT
author of change: Marinus Vonhof
date of change: 2018-11-07
definition: Lijntype: CONTINUOUS
notation: 1792
author at start life: Marinus Vonhof
date of start life: 2018-10-27
scope note: Collection of facts NLCS
type: Class
subclass of: NLCS_Object
subclass of: Restriction
  author at start life: Marinus Vonhof
  date of start life: 2018-10-27
  on class: Roostergoot
  on property: is represented by (inverse)
  max qualified cardinality: 1

Roostergoot
author of change: Johan Post
date of change: 2021-10-01
definition: Goot die aan de bovenzijde is afgedekt met een metalen rooster.
author at start life: Finy Teitsma (Oranjewoud)
date of start life: 2007-10-23
scope note: Collection of facts MDS
scope note: Collection of facts HYD
type: Class
subclass of: Lijngoot
subclass of: Restriction
  author at start life: Marinus Vonhof
  date of start life: 2016-04-15
  on class: Rooster
  on property: has as part
  qualified cardinality: 1
subclass of: Restriction
  author at start life: Marinus Vonhof
  date of start life: 2018-10-27
  on class: NLCS_HWA_GOOT_ROOSTERGOOT
  on property: is represented by
  max qualified cardinality: 1
subclass of: Restriction
  on property: heeft Uitvoering
  has value: AfgedektMetEenMetalenRooster
subclass of: Restriction
  on class: Sym_Goot
  on property: is represented by
  max qualified cardinality: 1

NLCS_HWA_GOOT_ROOSTERGOOT_ZANDVANGER
author of change: Marinus Vonhof
date of change: 2018-11-07
definition: Lijntype: CONTINUOUS
notation: 1793
author at start life: Marinus Vonhof
date of start life: 2018-10-27
scope note: Collection of facts NLCS
type: Class
subclass of: NLCS_Object
subclass of: Restriction
  author at start life: Marinus Vonhof
  date of start life: 2018-10-27
  on class: Zonk
  on property: is represented by (inverse)
  max qualified cardinality: 1

NLCS_HWA_HULPSTUK_ONTSTOPPINGSSTUK
author of change: Marinus Vonhof
date of change: 2018-11-07
definition: Lijntype: CONTINUOUS / Symbool: 989 - HULP_ONTSTOP
notation: 1811
author at start life: Marinus Vonhof
date of start life: 2018-10-27
scope note: Collection of facts NLCS
type: Class
subclass of: NLCS_Object
subclass of: Restriction
  author at start life: Marinus Vonhof
  date of start life: 2018-10-27
  on class: Ontstoppingsstuk
  on property: is represented by (inverse)
  max qualified cardinality: 1

NLCS_HWA_KOLK_STRAATKOLK
author of change: Marinus Vonhof
date of change: 2018-11-07
definition: Lijntype: CONTINUOUS / Symbool: 2848 - KOLK_STRAAT_300X301
notation: 1815
author at start life: Marinus Vonhof
date of start life: 2018-10-27
scope note: Collection of facts NLCS
type: Class
subclass of: NLCS_Object
subclass of: Restriction
  author at start life: Marinus Vonhof
  date of start life: 2018-10-27
  on class: Straatkolk
  on property: is represented by (inverse)
  max qualified cardinality: 1

NLCS_HWA_KOLK_TROTTOIRKOLK
author of change: Marinus Vonhof
date of change: 2018-11-07
definition: Lijntype: CONTINUOUS / Symbool: 2117 - KOLK_TROTTOIR
notation: 1816
author at start life: Marinus Vonhof
date of start life: 2018-10-27
scope note: Collection of facts NLCS
type: Class
subclass of: NLCS_Object
subclass of: Restriction
  author at start life: Marinus Vonhof
  date of start life: 2018-10-27
  on class: Trottoirkolk
  on property: is represented by (inverse)
  max qualified cardinality: 1

NLCS_HWA_PUTDEKSELHOOGTE
author of change: Marinus Vonhof
date of change: 2018-11-07
definition: Lijntype: CONTINUOUS / Symbool: 1018 - PUTDEKSELHOOGTE
notation: 1830
author at start life: Marinus Vonhof
date of start life: 2018-10-27
scope note: Collection of facts NLCS
type: Class
subclass of: NLCS_Object
subclass of: Restriction
  author at start life: Marinus Vonhof
  date of start life: 2018-10-27
  on class: Putdekselniveau
  on property: is represented by (inverse)
  max qualified cardinality: 1

NLCS_HWA_RIOOLPUT
author of change: Marinus Vonhof
date of change: 2018-11-07
definition: Lijntype: CONTINUOUS
notation: 1832
author at start life: Marinus Vonhof
date of start life: 2018-10-27
scope note: Collection of facts NLCS
type: Class
subclass of: NLCS_Object
subclass of: Restriction
  author at start life: Marinus Vonhof
  date of start life: 2018-10-27
  on class: Rioolput
  on property: is represented by (inverse)
  max qualified cardinality: 1

NLCS_HWA_RIOOLPUT_ONTSTOPPINGSPUT
author of change: Marinus Vonhof
date of change: 2018-11-07
definition: Lijntype: CONTINUOUS / Symbool: 1009 - PUT_ONTSTOPPINGSPUT
notation: 1842
author at start life: Marinus Vonhof
date of start life: 2018-10-27
scope note: Collection of facts NLCS
type: Class
subclass of: NLCS_Object
subclass of: Restriction
  author at start life: Marinus Vonhof
  date of start life: 2018-10-27
  on class: Ontstoppingsput
  on property: is represented by (inverse)
  max qualified cardinality: 1

NLCS_HWA_RIOOLPUT_OVERSTORTPUT
author of change: Marinus Vonhof
date of change: 2018-11-07
definition: Lijntype: CONTINUOUS / Symbool: 2124 - PUT_OVERSTORT
notation: 1845
author at start life: Marinus Vonhof
date of start life: 2018-10-27
scope note: Collection of facts NLCS
type: Class
subclass of: NLCS_Object
subclass of: Restriction
  author at start life: Marinus Vonhof
  date of start life: 2018-10-27
  on class: Overstortput
  on property: is represented by (inverse)
  max qualified cardinality: 1

NLCS_HWA_RIOOLPUT_POMPPUT
author of change: Marinus Vonhof
date of change: 2018-11-07
definition: Lijntype: CONTINUOUS / Symbool: 2125 - PUT_POMPPUT
notation: 1848
author at start life: Marinus Vonhof
date of start life: 2018-10-27
scope note: Collection of facts NLCS
type: Class
subclass of: NLCS_Object
subclass of: Restriction
  author at start life: Marinus Vonhof
  date of start life: 2018-10-27
  on class: Pompput
  on property: is represented by (inverse)
  max qualified cardinality: 1

NLCS_HWA_RIOOLPUT_STUWPUT
author of change: Marinus Vonhof
date of change: 2018-11-07
definition: Lijntype: CONTINUOUS / Symbool: 1013 - PUT_STUWPUT
notation: 1851
author at start life: Marinus Vonhof
date of start life: 2018-10-27
scope note: Collection of facts NLCS
type: Class
subclass of: NLCS_Object
subclass of: Restriction
  author at start life: Marinus Vonhof
  date of start life: 2018-10-27
  on class: Stuwput
  on property: is represented by (inverse)
  max qualified cardinality: 1

NLCS_HWA_SCHILDMUUR
author of change: Marinus Vonhof
date of change: 2018-11-07
definition: Lijntype: CONTINUOUS / Symbool: 3365 - SCHILDMUUR
notation: 3486
author at start life: Marinus Vonhof
date of start life: 2018-10-27
scope note: Collection of facts NLCS
type: Class
subclass of: NLCS_Object
subclass of: Restriction
  author at start life: Marinus Vonhof
  date of start life: 2018-10-27
  on class: Schildmuur
  on property: is represented by (inverse)
  max qualified cardinality: 1

NLCS_HWA_TRANSPORTLEIDING
author of change: Marinus Vonhof
date of change: 2018-11-07
definition: Lijntype: RI-HWA
notation: 1860
author at start life: Marinus Vonhof
date of start life: 2018-10-27
scope note: Collection of facts NLCS
type: Class
subclass of: NLCS_Object
subclass of: Restriction
  author at start life: Marinus Vonhof
  date of start life: 2018-10-27
  on class: Vrijverval transportleiding
  on property: is represented by (inverse)
  max qualified cardinality: 1

NLCS_HWA_UITSTROOMBAK
author of change: Marinus Vonhof
date of change: 2018-11-07
definition: Lijntype: CONTINUOUS / Symbool: 1022 - UITSTROOMBAK
notation: 1942
author at start life: Marinus Vonhof
date of start life: 2018-10-27
scope note: Collection of facts NLCS
type: Class
subclass of: NLCS_Object
subclass of: Restriction
  author at start life: Marinus Vonhof
  date of start life: 2018-10-27
  on class: Uitlaatconstructie
  on property: is represented by (inverse)
  max qualified cardinality: 1

NLCS_ITR_HULPSTUK_ONTSTOPPINGSSTUK
author of change: Marinus Vonhof
date of change: 2018-11-07
definition: Lijntype: CONTINUOUS / Symbool: 989 - HULP_ONTSTOP
notation: 1960
author at start life: Marinus Vonhof
date of start life: 2018-10-27
scope note: Collection of facts NLCS
type: Class
subclass of: NLCS_Object
subclass of: Restriction
  author at start life: Marinus Vonhof
  date of start life: 2018-10-27
  on class: Ontstoppingsstuk
  on property: is represented by (inverse)
  max qualified cardinality: 1

NLCS_ITR_KOLK_STRAATKOLK
author of change: Marinus Vonhof
date of change: 2018-11-07
definition: Lijntype: CONTINUOUS / Symbool: 2848 - KOLK_STRAAT_300X302
notation: 1964
author at start life: Marinus Vonhof
date of start life: 2018-10-27
scope note: Collection of facts NLCS
type: Class
subclass of: NLCS_Object
subclass of: Restriction
  author at start life: Marinus Vonhof
  date of start life: 2018-10-27
  on class: Straatkolk
  on property: is represented by (inverse)
  max qualified cardinality: 1

NLCS_ITR_KOLK_TROTTOIRKOLK
author of change: Marinus Vonhof
date of change: 2018-11-07
definition: Lijntype: CONTINUOUS / Symbool: 2117 - KOLK_TROTTOIR
notation: 1965
author at start life: Marinus Vonhof
date of start life: 2018-10-27
scope note: Collection of facts NLCS
type: Class
subclass of: NLCS_Object
subclass of: Restriction
  author at start life: Marinus Vonhof
  date of start life: 2018-10-27
  on class: Trottoirkolk
  on property: is represented by (inverse)
  max qualified cardinality: 1

NLCS_ITR_PUTDEKSELHOOGTE
author of change: Marinus Vonhof
date of change: 2018-11-07
definition: Lijntype: CONTINUOUS / Symbool: 1018 - PUTDEKSELHOOGTE
notation: 1977
author at start life: Marinus Vonhof
date of start life: 2018-10-27
scope note: Collection of facts NLCS
type: Class
subclass of: NLCS_Object
subclass of: Restriction
  author at start life: Marinus Vonhof
  date of start life: 2018-10-27
  on class: Putdekselniveau
  on property: is represented by (inverse)
  max qualified cardinality: 1

NLCS_ITR_RETENTIE_WADI
author of change: Marinus Vonhof
author of change: Johan Post
date of change: 2024-04-30
date of change: 2018-11-07
definition: Lijntype: CONTINUOUS
notation: 1985
author at start life: Marinus Vonhof
date of start life: 2018-10-27
scope note: Collection of facts NLCS
type: Class
subclass of: NLCS_Object
subclass of: Restriction
  author at start life: Marinus Vonhof
  date of start life: 2018-10-27
  on class: Wadi
  on property: is represented by (inverse)
  max qualified cardinality: 1

Wadi
author of change: Marinus Vonhof
author of change: Johan Post
date of change: 2025-01-16
date of change: 2024-04-30
date of change: 2017-05-31
definition: Een verdiept terrein, bestemd om het hemelwater tijdelijk te bergen, voorzien van waterdoorlatende bodem waardoor water door middel van infiltratie door de bodem kan worden afgevoerd.
definition: [IMBOR] Een (beplante) laagte, bestemd om het hemelwater tijdelijk te bergen en in de bodem te laten infiltreren. Voorzien van een infiltratiebed en veelal van infiltratiekratten.
definition: [IMBOR] Een verdiept terrein met waterdoorlatende bodem bestemd voor de inzameling van hemelwater, waarbij dit water door middel van infiltratie door de bodem kan worden afgevoerd.
definition: [NEN 3300:1996] verdiept terrein waarop overstort- of regenwater wordt geloosd om in de bodem te infiltreren.
author at start life: Finy Teitsma (Oranjewoud)
date of start life: 2007-10-23
comment: Vanaf versie 1.7.0 is de wadi een groepering van objecten geworden (was een reservoir), daarmee vervallen de kenmerken Breedte Bouwwerk, Lengte Bouwwerk en dergelijke. Gebruik nu de geometrie Buitengrens om de afmeting te beschijven.
see also: [Waterkring West] Een bufferings- en infiltratievoorziening, die tijdelijk gevuld is met hemelwater. De naam verwijst naar de Arabische naam voor een vaak droogstaand rivierdal en is ook een acroniem van Water Afvoer Door Infiltratie.
alternative label: Infiltratieveld
scope note: Collection of facts MDS
scope note: Collection of facts HYD
type: Class
subclass of: Begroeide infiltratievoorziening
subclass of: Restriction
  on property: heeft Uitvoering
  has value: BeplanteLaagte
subclass of: Restriction
  on class: NLCS_ITR_RETENTIE_WADI
  on property: is represented by
  max qualified cardinality: 1

NLCS_ITR_RIOOLPUT
author of change: Marinus Vonhof
date of change: 2018-11-07
definition: Lijntype: CONTINUOUS
notation: 1989
author at start life: Marinus Vonhof
date of start life: 2018-10-27
scope note: Collection of facts NLCS
type: Class
subclass of: NLCS_Object
subclass of: Restriction
  author at start life: Marinus Vonhof
  date of start life: 2018-10-27
  on class: Rioolput
  on property: is represented by (inverse)
  max qualified cardinality: 1

NLCS_ITR_RIOOLPUT_ONTSTOPPINGSPUT
author of change: Marinus Vonhof
date of change: 2018-11-07
definition: Lijntype: CONTINUOUS / Symbool: 1009 - PUT_ONTSTOPPINGSPUT
notation: 1999
author at start life: Marinus Vonhof
date of start life: 2018-10-27
scope note: Collection of facts NLCS
type: Class
subclass of: NLCS_Object
subclass of: Restriction
  author at start life: Marinus Vonhof
  date of start life: 2018-10-27
  on class: Ontstoppingsput
  on property: is represented by (inverse)
  max qualified cardinality: 1

NLCS_ITR_RIOOLPUT_OVERSTORTPUT
author of change: Marinus Vonhof
date of change: 2018-11-07
definition: Lijntype: CONTINUOUS / Symbool: 2124 - PUT_OVERSTORT
notation: 2002
author at start life: Marinus Vonhof
date of start life: 2018-10-27
scope note: Collection of facts NLCS
type: Class
subclass of: NLCS_Object
subclass of: Restriction
  author at start life: Marinus Vonhof
  date of start life: 2018-10-27
  on class: Overstortput
  on property: is represented by (inverse)
  max qualified cardinality: 1

NLCS_ITR_RIOOLPUT_POMPPUT
author of change: Marinus Vonhof
date of change: 2018-11-07
definition: Lijntype: CONTINUOUS / Symbool: 2125 - PUT_POMPPUT
notation: 2005
author at start life: Marinus Vonhof
date of start life: 2018-10-27
scope note: Collection of facts NLCS
type: Class
subclass of: NLCS_Object
subclass of: Restriction
  author at start life: Marinus Vonhof
  date of start life: 2018-10-27
  on class: Pompput
  on property: is represented by (inverse)
  max qualified cardinality: 1

NLCS_ITR_RIOOLPUT_STUWPUT
author of change: Marinus Vonhof
date of change: 2018-11-07
definition: Lijntype: CONTINUOUS / Symbool: 1013 - PUT_STUWPUT
notation: 2008
author at start life: Marinus Vonhof
date of start life: 2018-10-27
scope note: Collection of facts NLCS
type: Class
subclass of: NLCS_Object
subclass of: Restriction
  author at start life: Marinus Vonhof
  date of start life: 2018-10-27
  on class: Stuwput
  on property: is represented by (inverse)
  max qualified cardinality: 1

NLCS_ITR_TRANSPORTLEIDING
author of change: Marinus Vonhof
date of change: 2018-11-07
definition: Lijntype: RI-ITR
notation: 2017
author at start life: Marinus Vonhof
date of start life: 2018-10-27
scope note: Collection of facts NLCS
type: Class
subclass of: NLCS_Object
subclass of: Restriction
  author at start life: Marinus Vonhof
  date of start life: 2018-10-27
  on class: Vrijverval transportleiding
  on property: is represented by (inverse)
  max qualified cardinality: 1

NLCS_ITR_UITSTROOMBAK
author of change: Marinus Vonhof
date of change: 2018-11-07
definition: Lijntype: CONTINUOUS / Symbool: 1022 - UITSTROOMBAK
notation: 2050
author at start life: Marinus Vonhof
date of start life: 2018-10-27
scope note: Collection of facts NLCS
type: Class
subclass of: NLCS_Object
subclass of: Restriction
  author at start life: Marinus Vonhof
  date of start life: 2018-10-27
  on class: Uitlaatconstructie
  on property: is represented by (inverse)
  max qualified cardinality: 1

NLCS_PERCEELAANSLUITING
author of change: Marinus Vonhof
date of change: 2018-11-07
definition: Lijntype: RI-PERCEELAANSLUITING
notation: 2053
author at start life: Marinus Vonhof
date of start life: 2018-10-27
scope note: Collection of facts NLCS
type: Class
subclass of: NLCS_Object
subclass of: Restriction
  author at start life: Marinus Vonhof
  date of start life: 2018-10-27
  on class: Perceelaansluitleiding
  on property: is represented by (inverse)
  max qualified cardinality: 1

NLCS_PERSLEIDING
author of change: Marinus Vonhof
date of change: 2018-11-07
definition: Lijntype: RI-PERS
notation: 2054
author at start life: Marinus Vonhof
date of start life: 2018-10-27
scope note: Collection of facts NLCS
type: Class
subclass of: NLCS_Object
subclass of: Restriction
  author at start life: Marinus Vonhof
  date of start life: 2018-10-27
  on class: Persleiding
  on property: is represented by (inverse)
  max qualified cardinality: 1

NLCS_PERSLEIDING_GEMAAL
author of change: Marinus Vonhof
date of change: 2018-11-07
definition: Lijntype: CONTINUOUS / Symbool: 973 - GEMAAL
notation: 2066
author at start life: Marinus Vonhof
date of start life: 2018-10-27
scope note: Collection of facts NLCS
type: Class
subclass of: NLCS_Object
subclass of: Restriction
  author at start life: Marinus Vonhof
  date of start life: 2018-10-27
  on class: Rioolgemaal
  on property: is represented by (inverse)
  max qualified cardinality: 1

NLCS_PERSLEIDING_HULPSTUK_ONTSTOPPINGSSTUK
author of change: Marinus Vonhof
date of change: 2018-11-07
definition: Lijntype: CONTINUOUS / Symbool: 989 - HULP_ONTSTOP
notation: 2070
author at start life: Marinus Vonhof
date of start life: 2018-10-27
scope note: Collection of facts NLCS
type: Class
subclass of: NLCS_Object
subclass of: Restriction
  author at start life: Marinus Vonhof
  date of start life: 2018-10-27
  on class: Ontstoppingsstuk
  on property: is represented by (inverse)
  max qualified cardinality: 1

NLCS_PERSLEIDING_PUTDEKSELHOOGTE
author of change: Marinus Vonhof
date of change: 2018-11-07
definition: Lijntype: CONTINUOUS / Symbool: 1018 - PUTDEKSELHOOGTE
notation: 2072
author at start life: Marinus Vonhof
date of start life: 2018-10-27
scope note: Collection of facts NLCS
type: Class
subclass of: NLCS_Object
subclass of: Restriction
  author at start life: Marinus Vonhof
  date of start life: 2018-10-27
  on class: Putdekselniveau
  on property: is represented by (inverse)
  max qualified cardinality: 1

NLCS_PERSLEIDING_RIOOLPUT
author of change: Marinus Vonhof
date of change: 2018-11-07
definition: Lijntype: CONTINUOUS
notation: 2074
author at start life: Marinus Vonhof
date of start life: 2018-10-27
scope note: Collection of facts NLCS
type: Class
subclass of: NLCS_Object
subclass of: Restriction
  author at start life: Marinus Vonhof
  date of start life: 2018-10-27
  on class: Rioolput
  on property: is represented by (inverse)
  max qualified cardinality: 1

NLCS_PERSLEIDING_RIOOLPUT_POMPPUT
author of change: Marinus Vonhof
date of change: 2018-11-07
definition: Lijntype: CONTINUOUS / Symbool: 2125 - PUT_POMPPUT
notation: 2076
author at start life: Marinus Vonhof
date of start life: 2018-10-27
scope note: Collection of facts NLCS
type: Class
subclass of: NLCS_Object
subclass of: Restriction
  author at start life: Marinus Vonhof
  date of start life: 2018-10-27
  on class: Pompput
  on property: is represented by (inverse)
  max qualified cardinality: 1

NLCS_PERSLEIDING_RIOOLPUT_STUWPUT
author of change: Marinus Vonhof
date of change: 2018-11-07
definition: Lijntype: CONTINUOUS / Symbool: 1013 - PUT_STUWPUT
notation: 2077
author at start life: Marinus Vonhof
date of start life: 2018-10-27
scope note: Collection of facts NLCS
type: Class
subclass of: NLCS_Object
subclass of: Restriction
  author at start life: Marinus Vonhof
  date of start life: 2018-10-27
  on class: Stuwput
  on property: is represented by (inverse)
  max qualified cardinality: 1

NLCS_PUT
author of change: Marinus Vonhof
date of change: 2018-11-07
definition: Lijntype: CONTINUOUS
notation: 3064
author at start life: Marinus Vonhof
date of start life: 2018-10-27
scope note: Collection of facts NLCS
type: Class
subclass of: NLCS_Object
subclass of: Restriction
  author of change: Marinus Vonhof
  date of change: 2018-11-11
  author at start life: Marinus Vonhof
  date of start life: 2018-10-27
  on class: Put
  on property: is represented by (inverse)
  max qualified cardinality: 1

NLCS_STROOMRICHTING
author of change: Marinus Vonhof
date of change: 2018-11-07
definition: Lijntype: CONTINUOUS
notation: 2082
author at start life: Marinus Vonhof
date of start life: 2018-10-27
scope note: Collection of facts NLCS
type: Class
subclass of: NLCS_Object
subclass of: Restriction
  author at start life: Marinus Vonhof
  date of start life: 2018-10-27
  on class: Stromingsrichting
  on property: is represented by (inverse)
  max qualified cardinality: 1

NLCS_SWA_HULPSTUK_ONTSTOPPINGSSTUK
author of change: Marinus Vonhof
date of change: 2018-11-07
definition: Lijntype: CONTINUOUS / Symbool: 989 - HULP_ONTSTOP
notation: 2089
author at start life: Marinus Vonhof
date of start life: 2018-10-27
scope note: Collection of facts NLCS
type: Class
subclass of: NLCS_Object
subclass of: Restriction
  author at start life: Marinus Vonhof
  date of start life: 2018-10-27
  on class: Ontstoppingsstuk
  on property: is represented by (inverse)
  max qualified cardinality: 1

NLCS_SWA_KOLK_STRAATKOLK
author of change: Marinus Vonhof
date of change: 2018-11-07
definition: Lijntype: CONTINUOUS / Symbool: 2848 - KOLK_STRAAT_300X303
notation: 2093
author at start life: Marinus Vonhof
date of start life: 2018-10-27
scope note: Collection of facts NLCS
type: Class
subclass of: NLCS_Object
subclass of: Restriction
  author at start life: Marinus Vonhof
  date of start life: 2018-10-27
  on class: Straatkolk
  on property: is represented by (inverse)
  max qualified cardinality: 1

NLCS_SWA_KOLK_TROTTOIRKOLK
author of change: Marinus Vonhof
date of change: 2018-11-07
definition: Lijntype: CONTINUOUS / Symbool: 2117 - KOLK_TROTTOIR
notation: 2094
author at start life: Marinus Vonhof
date of start life: 2018-10-27
scope note: Collection of facts NLCS
type: Class
subclass of: NLCS_Object
subclass of: Restriction
  author at start life: Marinus Vonhof
  date of start life: 2018-10-27
  on class: Trottoirkolk
  on property: is represented by (inverse)
  max qualified cardinality: 1

NLCS_SWA_PUTDEKSELHOOGTE
author of change: Marinus Vonhof
date of change: 2018-11-07
definition: Lijntype: CONTINUOUS / Symbool: 1018 - PUTDEKSELHOOGTE
notation: 2108
author at start life: Marinus Vonhof
date of start life: 2018-10-27
scope note: Collection of facts NLCS
type: Class
subclass of: NLCS_Object
subclass of: Restriction
  author at start life: Marinus Vonhof
  date of start life: 2018-10-27
  on class: Putdekselniveau
  on property: is represented by (inverse)
  max qualified cardinality: 1

NLCS_SWA_RIOOLPUT
author of change: Marinus Vonhof
date of change: 2018-11-07
definition: Lijntype: CONTINUOUS
notation: 2110
author at start life: Marinus Vonhof
date of start life: 2018-10-27
scope note: Collection of facts NLCS
type: Class
subclass of: NLCS_Object
subclass of: Restriction
  author at start life: Marinus Vonhof
  date of start life: 2018-10-27
  on class: Rioolput
  on property: is represented by (inverse)
  max qualified cardinality: 1

NLCS_SWA_RIOOLPUT_ONTSTOPPINGSPUT
author of change: Marinus Vonhof
date of change: 2018-11-07
definition: Lijntype: CONTINUOUS / Symbool: 1009 - PUT_ONTSTOPPINGSPUT
notation: 2120
author at start life: Marinus Vonhof
date of start life: 2018-10-27
scope note: Collection of facts NLCS
type: Class
subclass of: NLCS_Object
subclass of: Restriction
  author at start life: Marinus Vonhof
  date of start life: 2018-10-27
  on class: Ontstoppingsput
  on property: is represented by (inverse)
  max qualified cardinality: 1

NLCS_SWA_RIOOLPUT_OVERSTORTPUT
author of change: Marinus Vonhof
date of change: 2018-11-07
definition: Lijntype: CONTINUOUS / Symbool: 2124 - PUT_OVERSTORT
notation: 2123
author at start life: Marinus Vonhof
date of start life: 2018-10-27
scope note: Collection of facts NLCS
type: Class
subclass of: NLCS_Object
subclass of: Restriction
  author at start life: Marinus Vonhof
  date of start life: 2018-10-27
  on class: Overstortput
  on property: is represented by (inverse)
  max qualified cardinality: 1

NLCS_SWA_RIOOLPUT_POMPPUT
author of change: Marinus Vonhof
date of change: 2018-11-07
definition: Lijntype: CONTINUOUS / Symbool: 2125 - PUT_POMPPUT
notation: 2126
author at start life: Marinus Vonhof
date of start life: 2018-10-27
scope note: Collection of facts NLCS
type: Class
subclass of: NLCS_Object
subclass of: Restriction
  author at start life: Marinus Vonhof
  date of start life: 2018-10-27
  on class: Pompput
  on property: is represented by (inverse)
  max qualified cardinality: 1

NLCS_SWA_RIOOLPUT_STUWPUT
author of change: Marinus Vonhof
date of change: 2018-11-07
definition: Lijntype: CONTINUOUS / Symbool: 1013 - PUT_STUWPUT
notation: 2129
author at start life: Marinus Vonhof
date of start life: 2018-10-27
scope note: Collection of facts NLCS
type: Class
subclass of: NLCS_Object
subclass of: Restriction
  author at start life: Marinus Vonhof
  date of start life: 2018-10-27
  on class: Stuwput
  on property: is represented by (inverse)
  max qualified cardinality: 1

NLCS_SWA_SCHILDMUUR
author of change: Marinus Vonhof
date of change: 2018-11-07
definition: Lijntype: CONTINUOUS / Symbool: 3365 - SCHILDMUUR
notation: 3488
author at start life: Marinus Vonhof
date of start life: 2018-10-27
scope note: Collection of facts NLCS
type: Class
subclass of: NLCS_Object
subclass of: Restriction
  author at start life: Marinus Vonhof
  date of start life: 2018-10-27
  on class: Schildmuur
  on property: is represented by (inverse)
  max qualified cardinality: 1

NLCS_SWA_TRANSPORTLEIDING
author of change: Marinus Vonhof
date of change: 2018-11-07
definition: Lijntype: RI-SWA
notation: 2138
author at start life: Marinus Vonhof
date of start life: 2018-10-27
scope note: Collection of facts NLCS
type: Class
subclass of: NLCS_Object
subclass of: Restriction
  author at start life: Marinus Vonhof
  date of start life: 2018-10-27
  on class: Vrijverval transportleiding
  on property: is represented by (inverse)
  max qualified cardinality: 1

NLCS_TRANSPORTLEIDING
author of change: Marinus Vonhof
date of change: 2018-11-07
definition: Lijntype: RI-TRANSPORTLEIDING
notation: 2193
author at start life: Marinus Vonhof
date of start life: 2018-10-27
scope note: Collection of facts NLCS
type: Class
subclass of: NLCS_Object
subclass of: Restriction
  author at start life: Marinus Vonhof
  date of start life: 2018-10-27
  on class: Transportleiding
  on property: is represented by (inverse)
  max qualified cardinality: 1

NLCS_VACUUMLEIDING
author of change: Marinus Vonhof
date of change: 2018-11-07
definition: Lijntype: RI-VACUUM
notation: 2194
author at start life: Marinus Vonhof
date of start life: 2018-10-27
scope note: Collection of facts NLCS
type: Class
subclass of: NLCS_Object
subclass of: Restriction
  author at start life: Marinus Vonhof
  date of start life: 2018-10-27
  on class: Vacuümleiding
  on property: is represented by (inverse)
  max qualified cardinality: 1

NLCS_VACUUMLEIDING_GEMAAL
author of change: Marinus Vonhof
date of change: 2018-11-07
definition: Lijntype: CONTINUOUS / Symbool: 973 - GEMAAL
notation: 2206
author at start life: Marinus Vonhof
date of start life: 2018-10-27
scope note: Collection of facts NLCS
type: Class
subclass of: NLCS_Object
subclass of: Restriction
  author of change: Marinus Vonhof
  date of change: 2018-11-10
  author at start life: Marinus Vonhof
  date of start life: 2018-10-27
  on class: Vacuümpompstation
  on property: is represented by (inverse)
  max qualified cardinality: 1

NLCS_VACUUMLEIDING_HULPSTUK_ONTSTOPPINGSSTUK
author of change: Marinus Vonhof
date of change: 2018-11-07
definition: Lijntype: CONTINUOUS / Symbool: 989 - HULP_ONTSTOP
notation: 2210
author at start life: Marinus Vonhof
date of start life: 2018-10-27
scope note: Collection of facts NLCS
type: Class
subclass of: NLCS_Object
subclass of: Restriction
  author at start life: Marinus Vonhof
  date of start life: 2018-10-27
  on class: Ontstoppingsstuk
  on property: is represented by (inverse)
  max qualified cardinality: 1

NLCS_VACUUMLEIDING_PUTDEKSELHOOGTE
author of change: Marinus Vonhof
date of change: 2018-11-07
definition: Lijntype: CONTINUOUS / Symbool: 1018 - PUTDEKSELHOOGTE
notation: 2212
author at start life: Marinus Vonhof
date of start life: 2018-10-27
scope note: Collection of facts NLCS
type: Class
subclass of: NLCS_Object
subclass of: Restriction
  author at start life: Marinus Vonhof
  date of start life: 2018-10-27
  on class: Putdekselniveau
  on property: is represented by (inverse)
  max qualified cardinality: 1

NLCS_VACUUMLEIDING_RIOOLPUT
author of change: Marinus Vonhof
date of change: 2018-11-07
definition: Lijntype: CONTINUOUS
notation: 2214
author at start life: Marinus Vonhof
date of start life: 2018-10-27
scope note: Collection of facts NLCS
type: Class
subclass of: NLCS_Object
subclass of: Restriction
  author at start life: Marinus Vonhof
  date of start life: 2018-10-27
  on class: Rioolput
  on property: is represented by (inverse)
  max qualified cardinality: 1

NLCS_VACUUMLEIDING_RIOOLPUT_POMPPUT
author of change: Marinus Vonhof
date of change: 2018-11-07
definition: Lijntype: CONTINUOUS / Symbool: 2125 - PUT_POMPPUT
notation: 2216
author at start life: Marinus Vonhof
date of start life: 2018-10-27
scope note: Collection of facts NLCS
type: Class
subclass of: NLCS_Object
subclass of: Restriction
  author at start life: Marinus Vonhof
  date of start life: 2018-10-27
  on class: Pompput
  on property: is represented by (inverse)
  max qualified cardinality: 1

NLCS_VACUUMLEIDING_RIOOLPUT_STUWPUT
author of change: Marinus Vonhof
date of change: 2018-11-07
definition: Lijntype: CONTINUOUS / Symbool: 1013 - PUT_STUWPUT
notation: 2217
author at start life: Marinus Vonhof
date of start life: 2018-10-27
scope note: Collection of facts NLCS
type: Class
subclass of: NLCS_Object
subclass of: Restriction
  author at start life: Marinus Vonhof
  date of start life: 2018-10-27
  on class: Stuwput
  on property: is represented by (inverse)
  max qualified cardinality: 1

NLCS_VOLSCHUIMEN
author of change: Marinus Vonhof
date of change: 2018-11-07
definition: Lijntype: RI-VOLSCHUIMEN
notation: 2219
author at start life: Marinus Vonhof
date of start life: 2018-10-27
scope note: Collection of facts NLCS
type: Class
subclass of: NLCS_Object
subclass of: Restriction
  author at start life: Marinus Vonhof
  date of start life: 2018-10-27
  on class: Volgeschuimde leiding
  on property: is represented by (inverse)
  max qualified cardinality: 1

Volgeschuimde leiding
author of change: Marinus Vonhof
date of change: 2025-01-16
date of change: 2018-12-10
definition: [IMBOR] Een leiding die buiten gebruik is, maar is volgeschuimd om problemen zoals ongedierte, gasvorming, en verzakkingen te voorkomen.
author at start life: Marinus Vonhof
date of start life: 2016-04-29
scope note: Collection of facts BAS
type: Class
subclass of: Gedammerde leiding
subclass of: Restriction
  author at start life: Marinus Vonhof
  date of start life: 2018-10-27
  on class: NLCS_VOLSCHUIMEN
  on property: is represented by
  max qualified cardinality: 1
subclass of: Restriction
  on property: heeft Uitvoering
  has value: Volgeschuimd

NLCS_VWA
author of change: Marinus Vonhof
date of change: 2018-11-07
definition: Lijntype: RI-VWA
notation: 2220
author at start life: Marinus Vonhof
date of start life: 2018-10-27
scope note: Collection of facts NLCS
type: Class
subclass of: NLCS_Object
subclass of: Restriction
  author at start life: Marinus Vonhof
  date of start life: 2018-10-27
  on class: Vuilwaterriool
  on property: is represented by (inverse)
  max qualified cardinality: 1

NLCS_VWA_AFSCHEIDER_OLIE BENZINE
author of change: Marinus Vonhof
date of change: 2018-11-07
definition: Lijntype: CONTINUOUS / Symbool: 963 - AFSCHEIDER_OLIE_BENZINE
notation: 2222
author at start life: Marinus Vonhof
date of start life: 2018-10-27
scope note: Collection of facts NLCS
type: Class
subclass of: NLCS_Object
subclass of: Restriction
  author at start life: Marinus Vonhof
  date of start life: 2018-10-27
  on class: Olie-/benzineafscheider
  on property: is represented by (inverse)
  max qualified cardinality: 1

Olie-/benzineafscheider
label: Light liquid separator @en
author of change: Finy Teitsma (Oranjewoud)
date of change: 2007-11-12
definition: Een toestel waarin ten gevolge van het verschil in dichtheid en het vertragen van de vloeistofstroom de olie/benzine door opdrijving grotendeels van het afvalwater wordt gescheiden.
definition: [EN 16323:2014] device to separate light liquids from wastewater @en
definition: [NEN 3300:1996] Toestel bestemd voor de behandeling van oliehoudend afvalwater, waarin door het verschil in dichtheid tussen olie en water en het vertragen van de vloeistofstroom, olie door opdrijving grotendeels wordt verwijderd
author at start life: Finy Teitsma (Oranjewoud)
date of start life: 2007-10-23
validity context: *d
comment: 20151014: NEN3300-definitie aangepast
alternative label: Olieafscheider
scope note: Collection of facts BAS
type: Class
subclass of: Constructieonderdeel
subclass of: Restriction
  author at start life: Marinus Vonhof
  date of start life: 2018-10-27
  on class: NLCS_VWA_AFSCHEIDER_OLIE BENZINE
  on property: is represented by
  max qualified cardinality: 1
subclass of: Restriction
  author at start life: Marinus Vonhof
  date of start life: 2019-05-15
  on class: Olie-/benzineafvangput
  on property: has as part (inverse)
  qualified cardinality: 1
subclass of: Restriction
  on property: heeft Functie
  has value: AfscheidenOlie benzine
subclass of: Restriction
  on property: heeft Functie
  has value: ReinigenAfvalwater

NLCS_VWA_AFSCHEIDER_VET
author of change: Marinus Vonhof
date of change: 2018-11-07
definition: Lijntype: CONTINUOUS / Symbool: 965 - AFSCHEIDER_VET
notation: 2223
author at start life: Marinus Vonhof
date of start life: 2018-10-27
scope note: Collection of facts NLCS
type: Class
subclass of: NLCS_Object
subclass of: Restriction
  author at start life: Marinus Vonhof
  date of start life: 2018-10-27
  on class: Vetafscheider
  on property: is represented by (inverse)
  max qualified cardinality: 1

Vetafscheider
label: Grease separator @en
author of change: Marinus Vonhof
date of change: 2019-05-16
date of change: 2026-07-20
definition: Een toestel waarin ten gevolge van het verschil in dichtheid en het vertragen van de vloeistofstroom het vet door opdrijving grotendeels van het afvalwater wordt gescheiden. Verticale schotten in de afscheider zorgen ervoor dat het geloosde afvalwater in de put tot rust komt. Door bezinken en opdrijven vindt scheiding plaats van de verontreinigingen die niet op het openbare riool mogen worden geloosd
definition: [EN 16323:2014] device to separate grease from wastewater @en
definition: [NEN 3300:1996] Toestel bestemd voor de behandeling van met vet verontreinigd afvalwater, waarin ten gevolge van verschil in dichtheid en het vertragen van de vloeistofstroom, vet door opdrijving grotendeels wordt verwijderd uit het afvalwater
author at start life: Finy Teitsma (Oranjewoud)
date of start life: 2007-10-23
validity context: 10d
comment: 20151014: NEN3300-definitie aangepast
scope note: Collection of facts REV
scope note: Collection of facts BAS
type: Class
subclass of: Constructieonderdeel
subclass of: Restriction
  author at start life: Marinus Vonhof
  date of start life: 2018-10-27
  on class: NLCS_VWA_AFSCHEIDER_VET
  on property: is represented by
  max qualified cardinality: 1
subclass of: Restriction
  author at start life: Wouter van Riel
  date of start life: 2022-09-26
  on class: Appendage-oriëntatie
  on property: has as aspect
  max qualified cardinality: 1
subclass of: Restriction
  on property: heeft Functie
  has value: AfscheidenVet
subclass of: Restriction
  on property: heeft Functie
  has value: ReinigenAfvalwater
subclass of: Restriction
  on property: heeft Functie
  has value: VerwijderenOpgedrevenDelen
subclass of: Restriction
  on class: Vetvangput
  on property: has as part (inverse)
  qualified cardinality: 1

NLCS_VWA_HULPSTUK_ONTSTOPPINGSSTUK
author of change: Marinus Vonhof
date of change: 2018-11-07
definition: Lijntype: CONTINUOUS / Symbool: 989 - HULP_ONTSTOP
notation: 2243
author at start life: Marinus Vonhof
date of start life: 2018-10-27
scope note: Collection of facts NLCS
type: Class
subclass of: NLCS_Object
subclass of: Restriction
  author at start life: Marinus Vonhof
  date of start life: 2018-10-27
  on class: Ontstoppingsstuk
  on property: is represented by (inverse)
  max qualified cardinality: 1

NLCS_VWA_PUTDEKSELHOOGTE
author of change: Marinus Vonhof
date of change: 2018-11-07
definition: Lijntype: CONTINUOUS / Symbool: 1018 - PUTDEKSELHOOGTE
notation: 2248
author at start life: Marinus Vonhof
date of start life: 2018-10-27
scope note: Collection of facts NLCS
type: Class
subclass of: NLCS_Object
subclass of: Restriction
  author at start life: Marinus Vonhof
  date of start life: 2018-10-27
  on class: Putdekselniveau
  on property: is represented by (inverse)
  max qualified cardinality: 1

NLCS_VWA_RIOOLPUT
author of change: Marinus Vonhof
date of change: 2018-11-07
definition: Lijntype: CONTINUOUS
notation: 2250
author at start life: Marinus Vonhof
date of start life: 2018-10-27
scope note: Collection of facts NLCS
type: Class
subclass of: NLCS_Object
subclass of: Restriction
  author at start life: Marinus Vonhof
  date of start life: 2018-10-27
  on class: Rioolput
  on property: is represented by (inverse)
  max qualified cardinality: 1

NLCS_VWA_RIOOLPUT_ONTSTOPPINGSPUT
author of change: Marinus Vonhof
date of change: 2018-11-07
definition: Lijntype: CONTINUOUS / Symbool: 1009 - PUT_ONTSTOPPINGSPUT
notation: 2263
author at start life: Marinus Vonhof
date of start life: 2018-10-27
scope note: Collection of facts NLCS
type: Class
subclass of: NLCS_Object
subclass of: Restriction
  author at start life: Marinus Vonhof
  date of start life: 2018-10-27
  on class: Ontstoppingsput
  on property: is represented by (inverse)
  max qualified cardinality: 1

NLCS_VWA_RIOOLPUT_OVERSTORTPUT
author of change: Marinus Vonhof
date of change: 2018-11-07
definition: Lijntype: CONTINUOUS / Symbool: 2124 - PUT_OVERSTORT
notation: 2266
author at start life: Marinus Vonhof
date of start life: 2018-10-27
scope note: Collection of facts NLCS
type: Class
subclass of: NLCS_Object
subclass of: Restriction
  author at start life: Marinus Vonhof
  date of start life: 2018-10-27
  on class: Overstortput
  on property: is represented by (inverse)
  max qualified cardinality: 1

NLCS_VWA_RIOOLPUT_POMPPUT
author of change: Marinus Vonhof
date of change: 2018-11-07
definition: Lijntype: CONTINUOUS / Symbool: 2125 - PUT_POMPPUT
notation: 2269
author at start life: Marinus Vonhof
date of start life: 2018-10-27
scope note: Collection of facts NLCS
type: Class
subclass of: NLCS_Object
subclass of: Restriction
  author at start life: Marinus Vonhof
  date of start life: 2018-10-27
  on class: Pompput
  on property: is represented by (inverse)
  max qualified cardinality: 1

NLCS_VWA_RIOOLPUT_SLIBVANGER
author of change: Marinus Vonhof
date of change: 2018-11-07
definition: Lijntype: CONTINUOUS / Symbool: 964 - AFSCHEIDER_SLIBVANGPUT
notation: 2272
author at start life: Marinus Vonhof
date of start life: 2018-10-27
scope note: Collection of facts NLCS
type: Class
subclass of: NLCS_Object
subclass of: Restriction
  author at start life: Marinus Vonhof
  date of start life: 2018-10-27
  on class: Slibvanger
  on property: is represented by (inverse)
  max qualified cardinality: 1

Slibvanger
author of change: Johan Post
date of change: 2022-11-25
definition: [NEN 3300:1996] Bezinkbak voor verontreinigd afvalwater waarin door het verschil in dichtheid en het vertragen van de vloeistofstroom, slib en afvalwater wordt gescheiden
author at start life: Marinus Vonhof
date of start life: 2012-04-29
comment: 20151014: NEN3300-definitie aangepast
alternative label: Slibvangput
scope note: Collection of facts MDS
type: Class
subclass of: Slibafscheider
subclass of: Restriction
  author at start life: Marinus Vonhof
  date of start life: 2018-10-27
  on class: NLCS_VWA_RIOOLPUT_SLIBVANGER
  on property: is represented by
  max qualified cardinality: 1
subclass of: Restriction
  author at start life: Marinus Vonhof
  date of start life: 2021-08-06
  on class: Opvangcapaciteit
  on property: has as aspect
  max qualified cardinality: 1
subclass of: Restriction
  on property: heeft Uitvoering
  has value: BakOfPut

NLCS_VWA_RIOOLPUT_STUWPUT
author of change: Marinus Vonhof
date of change: 2018-11-07
definition: Lijntype: CONTINUOUS / Symbool: 1013 - PUT_STUWPUT
notation: 2274
author at start life: Marinus Vonhof
date of start life: 2018-10-27
scope note: Collection of facts NLCS
type: Class
subclass of: NLCS_Object
subclass of: Restriction
  author at start life: Marinus Vonhof
  date of start life: 2018-10-27
  on class: Stuwput
  on property: is represented by (inverse)
  max qualified cardinality: 1

NLCS_VWA_SEPTICTANK
author of change: Marinus Vonhof
date of change: 2018-11-07
definition: Lijntype: CONTINUOUS / Symbool: 1021 - TANK_SEPTIC
notation: 2284
author at start life: Marinus Vonhof
date of start life: 2018-10-27
scope note: Collection of facts NLCS
type: Class
subclass of: NLCS_Object
subclass of: Restriction
  author at start life: Marinus Vonhof
  date of start life: 2018-10-27
  on class: Septictank
  on property: is represented by (inverse)
  max qualified cardinality: 1

NLCS_VWA_TRANSPORTLEIDING
author of change: Marinus Vonhof
date of change: 2018-11-07
definition: Lijntype: RI-VWA
notation: 2286
author at start life: Marinus Vonhof
date of start life: 2018-10-27
scope note: Collection of facts NLCS
type: Class
subclass of: NLCS_Object
subclass of: Restriction
  author at start life: Marinus Vonhof
  date of start life: 2018-10-27
  on class: Vrijverval transportleiding
  on property: is represented by (inverse)
  max qualified cardinality: 1

Naam openbare ruimte
author at start life: Marinus Vonhof
date of start life: 2016-02-05
see also: [BAG] Een door het bevoegde gemeentelijke orgaan aan een Openbare ruimte toegekende benaming
comment: [is aspect]
scope note: Collection of facts MDS
scope note: Collection of facts RRB
scope note: Collection of facts LDR
type: Class
subclass of: Kenmerk

Neerslaggebeurtenis
definition: [NEN 3300:1996] De gebeurtenis bestaande uit alle neerslagperioden en neerslagpauzes, waarbij een neerslagpauze niet groter is dan een bepaalde tijdsduur
author at start life: Marinus Vonhof
date of start life: 2022-09-30
validity context: *d
scope note: Collection of facts BAS
type: Class
subclass of: NEN 3300 Term

Neerslagintensiteit
definition: [NEN 3300:1996] De neerslag per eenheid van horizontaal oppervlak, gedeeld door het tijdsinterval waarbinnen de neerslag valt
author at start life: Marinus Vonhof
date of start life: 2022-09-30
validity context: *d
scope note: Collection of facts BAS
type: Class
subclass of: NEN 3300 Term

Neerslagmeter
definition: [NEN 3300:1996] Een instrument voor de bepaling van de hoeveelheid neerslag per tijdseenheid
author at start life: Marinus Vonhof
date of start life: 2022-09-30
validity context: *d
scope note: Collection of facts BAS
type: Class
subclass of: NEN 3300 Term

Neerslagreeks
definition: [NEN 3300:1996] Een opeenvolging (reeks) van tijdvakken waarbij de neerslagsommen per tijdvak zijn vastgelegd
author at start life: Marinus Vonhof
date of start life: 2022-09-30
validity context: *d
scope note: Collection of facts BAS
type: Class
subclass of: NEN 3300 Term

Neerslagverlies
definition: [NEN 3300:1996] De hoeveelheid neerslag die niet tot afstroming naar de riolering komt door verdamping, oppervlakteberging, interceptie en infiltratie
author at start life: Marinus Vonhof
date of start life: 2022-09-30
validity context: *d
scope note: Collection of facts BAS
type: Class
subclass of: NEN 3300 Term

Niet gescheurde rubberring die zichtbaar is
definition: [NEN 3300:1996] Geen aanvullende definitie in NEN 3300
author at start life: Marinus Vonhof
date of start life: 2022-09-30
validity context: *d
scope note: Collection of facts BAS
type: Class
subclass of: NEN 3300 Term

Niet-stationaire stroming
definition: [NEN 3300:1996] Een stromingssituatie die in de tijd niet constant is
author at start life: Marinus Vonhof
date of start life: 2022-09-30
validity context: *d
scope note: Collection of facts BAS
type: Class
subclass of: NEN 3300 Term

Niet-visuele inspectie
definition: [NEN 3300:1996] Het met andere dan optische hulpmiddelen inspecteren van de toestand van objecten
author at start life: Marinus Vonhof
date of start life: 2022-09-30
validity context: *d
scope note: Collection of facts BAS
type: Class
subclass of: NEN 3300 Term

Noodoverstortput
author of change: Finy Teitsma (Oranjewoud)
date of change: 2007-11-12
definition: Een externe overstortput aangelegd voor afvoer als gevolg van een calamiteit.
author at start life: Finy Teitsma (Oranjewoud)
date of start life: 2007-10-23
alternative label: Noodoverlaat
scope note: Collection of facts MDS
scope note: Collection of facts HYD
scope note: Collection of facts DMO
type: Class
subclass of: Externe overstortput
subclass of: Restriction
  author at start life: Marinus Vonhof
  date of start life: 2018-11-07
  on class: Sym_Nooduitlaat
  on property: is represented by
  max qualified cardinality: 1
subclass of: Restriction
  on property: heeft Functie
  has value: BijCalamiteitAfvalwaterAfvoeren

Sym_Nooduitlaat
author of change: Marinus Vonhof
date of change: 2018-11-11
definition: Aangepaste stijl: Lijnkleur 255 0 0, Vulkleur 255 0 0. Grootte 10
author at start life: Marinus Vonhof
date of start life: 2018-11-07
scope note: Collection of facts NLCS
type: Class
subclass of: Geo-symbool
subclass of: Restriction
  author at start life: Marinus Vonhof
  date of start life: 2018-11-07
  on class: Noodoverstortput
  on property: is represented by (inverse)
  max qualified cardinality: 1
subclass of: Restriction
  author at start life: Marinus Vonhof
  date of start life: 2018-11-07
  on class: Nooduitlaat
  on property: is represented by (inverse)
  max qualified cardinality: 1

Nooduitlaat
author of change: Marinus Vonhof
date of change: 2015-03-01
definition: Een uitlaat aangelegd voor afvoer als gevolg van een calamiteit.
definition: [NEN 3300:1996] constructie voor de lozing van afvalwater op het oppervlaktewater bij calamiteiten
author at start life: Finy Teitsma (Oranjewoud)
date of start life: 2007-10-23
scope note: Collection of facts MDS
scope note: Collection of facts HYD
scope note: Collection of facts DMO
type: Class
subclass of: Uitlaatconstructie
subclass of: Restriction
  author at start life: Marinus Vonhof
  date of start life: 2018-11-07
  on class: Sym_Nooduitlaat
  on property: is represented by
  max qualified cardinality: 1
subclass of: Restriction
  on property: heeft Functie
  has value: BijCalamiteitAfvalwaterAfvoeren
subclass of: Restriction
  on property: heeft Toepassing
  has value: Calamiteit
subclass of: Restriction
  on property: heeft Functie
  has value: LozenAfvalwater

Nuttige berging
definition: [NEN 3300:1996] De inhoud van de riolering beneden de laagste overstortdrempel minus de verliezen door vervuiling, verzakking en aanwezig stromend afvalwater
author at start life: Marinus Vonhof
date of start life: 2022-09-30
validity context: *d
scope note: Collection of facts BAS
type: Class
subclass of: NEN 3300 Term

O90-waarde
definition: De filtergradatie van de filterdichtheid, de poriegrootte of mate van zanddichtheid. Uitgedrukt in een afstand.
author at start life: Marinus Vonhof
date of start life: 2026-07-16
units of measurements: µm
comment: De waarde wordt uitgedrukt in micrometer, deze eenheid toegevoegd aan het GWSW
alternative label: Filterdichtheid
alternative label: Poriegrootte
comment: [is aspect]
scope note: Collection of facts BAS
type: Class
subclass of: Kenmerk
subclass of: Restriction
  on property: has as value
  all values from: integer
subclass of: Restriction
  on class: Omhulling
  on property: has as aspect (inverse)
  qualified cardinality: 1

Obstakel
definition: [NEN 3300:1996] Voorwerpen in het riool die geen functie in rioleringstechnische zin hebben en geen deel uitmaken van een normale afvalwaterstroom
author at start life: Marinus Vonhof
date of start life: 2022-09-30
validity context: *d
scope note: Collection of facts BAS
type: Class
subclass of: NEN 3300 Term

Olie-/benzineafvangput
author of change: Marinus Vonhof
date of change: 2025-01-16
definition: [IMBOR] Een put met daarin een voorziening om olieachtige stoffen uit het afvalwater te halen.
author at start life: Marinus Vonhof
date of start life: 2019-05-15
scope note: Collection of facts BAS
type: Class
subclass of: Aansluitput
subclass of: Restriction
  author at start life: Marinus Vonhof
  date of start life: 2019-05-15
  on class: Olie-/benzineafscheider
  on property: has as part
  qualified cardinality: 1
subclass of: Restriction
  author at start life: Marinus Vonhof
  date of start life: 2021-08-05
  on class: Opvangcapaciteit
  on property: has as aspect
  max qualified cardinality: 1
subclass of: Restriction
  on property: heeft Uitvoering
  has value: PutMetScheidingsvoorziening

Opvangcapaciteit
author of change: Marinus Vonhof
date of change: 2025-01-16
definition: [IMBOR] Maat voor de hoeveelheid water welke door het object opgevangen kan worden.
author at start life: Marinus Vonhof
date of start life: 2021-08-05
units of measurements: m3
comment: [is aspect]
scope note: Collection of facts BAS
type: Class
subclass of: Capaciteit
subclass of: Restriction
  author at start life: Marinus Vonhof
  date of start life: 2021-08-05
  on class: Olie-/benzineafvangput
  on property: has as aspect (inverse)
  max qualified cardinality: 1
subclass of: Restriction
  author at start life: Marinus Vonhof
  date of start life: 2021-08-05
  on class: Vetvangput
  on property: has as aspect (inverse)
  max qualified cardinality: 1
subclass of: Restriction
  author at start life: Marinus Vonhof
  date of start life: 2021-08-05
  on class: Zandvangput
  on property: has as aspect (inverse)
  max qualified cardinality: 1
subclass of: Restriction
  author at start life: Marinus Vonhof
  date of start life: 2021-08-06
  on class: Slibvanger
  on property: has as aspect (inverse)
  max qualified cardinality: 1
subclass of: Restriction
  on property: has as value
  all values from: decimal

Onderbak
definition: Bodemelement van de putconstructie
author at start life: Marinus Vonhof
date of start life: 2026-07-17
alternative label: Onderstuk
scope note: Collection of facts BAS
type: Class
subclass of: Constructieonderdeel
subclass of: Restriction
  on property: heeft Toepassing
  has value: ElementPutconstructie
subclass of: Restriction
  on class: Rioolput
  on property: has as part (inverse)
  qualified cardinality: 1

Sym_Onderbemaling
author at start life: Johan Post
date of start life: 2021-10-01
scope note: Collection of facts NLCS
type: Class
subclass of: Geo-symbool
subclass of: Restriction
  author at start life: Marinus Vonhof
  date of start life: 2018-11-07
  on class: Onderbemaling
  on property: is represented by (inverse)
  max qualified cardinality: 1

Onderdrempelberging
definition: [NEN 3300:1996] De hoeveelheid water (in m3 of in mm ten opzichte van het afvoerend oppervlak) die in het beschouwde rioolstelsel onder het niveau van de laagste overstortdrempel en boven het laagste inslagpeil geborgen kan worden
author at start life: Marinus Vonhof
date of start life: 2022-09-30
validity context: *d
scope note: Collection of facts BAS
type: Class
subclass of: NEN 3300 Term

Ondergrondse infiltratievoorziening
definition: Een ondergrondse voorziening (infiltratieriool, infiltratieput, infiltratiekolk, infiltratiekrat, -koffer en/of bassin) met waterdoorlatende wanden, waarin het hemelwater wordt ingezameld, getransporteerd en tijdelijk wordt geborgen en waarbij het hemelwater via de wanden en bodem infiltreert in de ondergrond. Bij overbelasting en voor de vertraagde leegloop van de voorziening kunnen onderdelen (drainage, noodoverstort, slokop etc.) zijn aangebracht voor het reguleren van hemelwater- en grondwater.
author at start life: Marinus Vonhof
date of start life: 2026-07-13
scope note: Collection of facts MDS
scope note: Collection of facts HYD
type: Class
subclass of: Infiltratievoorziening
subclass of: Restriction
  on property: heeft Uitvoering
  has value: OnderMaaiveld

Fundering onderheid
author of change: Marinus Vonhof
date of change: 2025-01-16
date of change: 2021-08-06
definition: Object over het gehele oppervlak onderheid
definition: [IMBOR] Een fundament van heipalen.
author at start life: Marinus Vonhof
date of start life: 2013-10-05
scope note: Collection of facts MDS
scope note: Collection of facts RGM
type: Class
subclass of: Fundering
subclass of: Restriction
  on property: heeft Uitvoering
  has value: MetHeipalen

Fundering onderheid op kleef
author of change: Marinus Vonhof
date of change: 2025-01-16
date of change: 2019-01-07
author at start life: Marinus Vonhof
date of start life: 2018-12-06
scope note: Collection of facts MDS
scope note: Collection of facts RGM
type: Class
subclass of: Fundering onderheid
subclass of: Restriction
  on property: heeft Uitvoering
  has value: DraagvermogenDoorKleef

Fundering onderheid stuit
author of change: Marinus Vonhof
date of change: 2025-01-16
date of change: 2019-01-07
author at start life: Marinus Vonhof
date of start life: 2018-12-06
scope note: Collection of facts MDS
scope note: Collection of facts RGM
type: Class
subclass of: Fundering onderheid
subclass of: Restriction
  on property: heeft Uitvoering
  has value: DraagvermogenDoorStuit

Sym_Ontspanningsventiel
author of change: Johan Post
date of change: 2021-10-01
definition: Aangepaste stijl: Vulkleur 0 0 0, Grootte 11
author at start life: Marinus Vonhof
date of start life: 2018-11-07
scope note: Collection of facts NLCS
type: Class
subclass of: Geo-symbool
subclass of: Restriction
  author at start life: Marinus Vonhof
  date of start life: 2018-11-07
  on class: Ontspanningsventiel
  on property: is represented by (inverse)
  max qualified cardinality: 1
subclass of: Restriction
  on class: Ontluchter
  on property: is represented by (inverse)
  max qualified cardinality: 1

Ontluchtingsleiding
definition: [NEN 3300:1996] Leiding bestemd voor de afvoer van lucht
author at start life: Marinus Vonhof
date of start life: 2012-04-29
validity context: 10d
comment: 20151014: NEN3300-definitie aangepast
scope note: Collection of facts BAS
scope note: Collection of facts PLI
type: Class
subclass of: Leiding
subclass of: Restriction
  author of change: Marinus Vonhof
  date of change: 2015-03-01
  author at start life: Marinus Vonhof
  date of start life: 2012-04-29
  on class: Persleidingstelsel
  on property: has as part (inverse)
  max qualified cardinality: 1
subclass of: Restriction
  on property: heeft Functie
  has value: AfvoerVanGassenUitDeRiolering

Ontluchtingsunit
author of change: Marinus Vonhof
author of change: Johan Post
date of change: 2025-01-16
date of change: 2026-05-01
definition: [IMBOR] Een onderdeel dat vrijgekomen lucht, stank of gas afvoert.
author at start life: Marinus Vonhof
date of start life: 2018-12-06
validity context: 10d
scope note: Collection of facts BAS
type: Class
subclass of: Constructieonderdeel
subclass of: Restriction
  author at start life: Marinus Vonhof
  date of start life: 2018-12-06
  on class: Putdeksel
  on property: has as part (inverse)
  max qualified cardinality: 1
subclass of: Restriction
  on property: heeft Functie
  has value: OntluchtenVanRiolering
subclass of: Restriction
  on class: Roosterdeksel
  on property: has as part (inverse)
  max qualified cardinality: 1

Ontluchtingsventiel
definition: Ventiel dat wordt gebruikt om een mechanische leiding te ontluchten
author at start life: Marinus Vonhof
date of start life: 2018-12-05
validity context: 10d
scope note: Collection of facts BAS
type: Class
subclass of: Ontspanningsventiel
subclass of: Restriction
  on property: heeft Functie
  has value: OntluchtenMechanischeLeiding

Sym_Ontstoppingsstuk
author at start life: Johan Post
date of start life: 2021-10-01
scope note: Collection of facts NLCS
type: Class
subclass of: Geo-symbool
subclass of: Restriction
  author at start life: Marinus Vonhof
  date of start life: 2018-11-07
  on class: Ontstoppingsstuk
  on property: is represented by (inverse)
  max qualified cardinality: 1

Ontwerpcapaciteit pomp
author of change: Johan Post
date of change: 2022-11-25
definition: De capaciteit op basis van het ontwerp
author at start life: Marinus Vonhof
date of start life: 2013-02-05
units of measurements: m3/h
comment: [is aspect]
scope note: Collection of facts BAS
scope note: Collection of facts RGM
type: Class
subclass of: Capaciteit
subclass of: Restriction
  author of change: Marinus Vonhof
  date of change: 2014-03-25
  author at start life: Marinus Vonhof
  date of start life: 2013-02-05
  on class: Pomp
  on property: has as aspect (inverse)
  max qualified cardinality: 1
subclass of: Restriction
  on property: has as value
  all values from: decimal

Onverhard oppervlak hellend
notation: ONV_HEL
author at start life: Marinus Vonhof
date of start life: 2011-12-15
units of measurements: m2
comment: [is aspect]
scope note: Collection of facts MDS
scope note: Collection of facts HYD
type: Class
subclass of: Afvoerend oppervlak hellend
subclass of: Restriction
  on property: has as value
  all values from: Onverhard oppervlak hellend (datatype)

Onverhard oppervlak vlak
notation: ONV_VLA
author at start life: Marinus Vonhof
date of start life: 2011-12-15
units of measurements: m2
comment: [is aspect]
scope note: Collection of facts MDS
scope note: Collection of facts HYD
type: Class
subclass of: Afvoerend oppervlak vlak
subclass of: Restriction
  on property: has as value
  all values from: Onverhard oppervlak vlak (datatype)

Onverhard oppervlak vlak uitgestrekt
notation: ONV_VLU
author at start life: Marinus Vonhof
date of start life: 2011-12-15
units of measurements: m2
comment: [is aspect]
scope note: Collection of facts MDS
scope note: Collection of facts HYD
type: Class
subclass of: Afvoerend oppervlak vlak uitgestrekt
subclass of: Restriction
  on property: has as value
  all values from: Onverhard oppervlak vlak uitgestrekt (datatype)

Terreinriolering
author of change: Marinus Vonhof
date of change: 2025-01-16
date of change: 2021-08-05
definition: Stelsel van leidingen voor de afvoer van (afval)water van een perceel, niet zijnde gebouwriolering.
definition: [IMBOR] Rioolstelsel op particulier terrein.
author at start life: Marinus Vonhof
date of start life: 2016-08-25
validity context: 10d
scope note: Collection of facts BAS
type: Class
subclass of: Rioolstelsel
subclass of: Extra objecttype (rol)
subclass of: Restriction
  on property: heeft Toepassing
  has value: RioleringOpEenPerceel

Straatpot
author of change: Marinus Vonhof
date of change: 2018-12-06
definition: Een kokervormige constructie met een deksel om vanaf straatniveau toegang tot ondergrondse voorziening te geven
author at start life: Marinus Vonhof
date of start life: 2014-09-06
scope note: Collection of facts MLD
scope note: Collection of facts REV
scope note: Collection of facts BAS
type: Class
subclass of: Deksel
subclass of: Restriction
  on property: heeft Functie
  has value: AfdekkenOndergrondseVoorziening

Fundering op staal
author of change: Marinus Vonhof
date of change: 2025-01-16
date of change: 2021-08-06
definition: Gefundeerde object staat direct op zand (bijvoorbeeld in het wegcunet) of andere ondergrond
author at start life: Marinus Vonhof
date of start life: 2013-10-05
scope note: Collection of facts MDS
scope note: Collection of facts RGM
type: Class
subclass of: Fundering
subclass of: Restriction
  on property: heeft Uitvoering
  has value: DirectOpDeOndergrond

Projectreferentie opdrachtnemer
notation: EBI
author at start life: Marinus Vonhof
date of start life: 2015-10-26
validity context: 3d 6d 14d
comment: [is aspect]
scope note: Collection of facts TOP
type: Class
subclass of: Unieke identificatie
subclass of: Restriction
  author at start life: Marinus Vonhof
  date of start life: 2015-10-26
  validity context: 1t 10t 12t
  on class: Project
  on property: has as aspect (inverse)
  max qualified cardinality: 1

Open berging
author of change: Eric van Gorkom
date of change: 2023-09-23
definition: Een verlaging in het terrein waarin het afvalwater tijdelijk wordt opgevangen
author at start life: Marinus Vonhof
date of start life: 2017-05-31
alternative label: Groene berging
scope note: Collection of facts BAS
type: Class
subclass of: Reservoir
subclass of: Restriction
  on property: heeft Functie
  has value: RegelingVanDeAfvoerVanHetAfvalwater
subclass of: Restriction
  on property: heeft Functie
  has value: TijdelijkeBergingVanAfvalwater
subclass of: Restriction
  on property: heeft Doel
  has value: VerminderenVuilbelastingVanOppervlaktewater

Profiel open leiding
author of change: Marinus Vonhof
date of change: 2020-04-18
date of change: 2024-12-07
definition: Een curve die de doorsnede dwars op de richting beginpunt naar eindpunt van een open leiding beschrijft. Het bestaat uit minimaal 3 x/y waarden in [m], decimaalteken (punt) toegestaan. Voor watergangen worden deze x/y waarrden vaak als y/z waarden uitgedrukt.
author at start life: Marinus Vonhof
date of start life: 2019-05-15
units of measurements: gml
comment: [is aspect]
scope note: Collection of facts BAS
type: Class
subclass of: Lijn
subclass of: Restriction
  author at start life: Marinus Vonhof
  date of start life: 2019-05-15
  on class: Open leiding
  on property: has as aspect (inverse)
  max qualified cardinality: 1
subclass of: Restriction
  author at start life: Marinus Vonhof
  date of start life: 2019-05-15
  on class: Waterdeel
  on property: has as aspect (inverse)
  max qualified cardinality: 1
subclass of: Restriction
  on property: has as value
  all values from: gmlLiteral

Open verhard oppervlak hellend
notation: OVH_HEL
author at start life: Marinus Vonhof
date of start life: 2011-12-15
units of measurements: m2
comment: [is aspect]
scope note: Collection of facts MDS
scope note: Collection of facts HYD
type: Class
subclass of: Afvoerend oppervlak hellend
subclass of: Restriction
  on property: has as value
  all values from: Open verhard oppervlak hellend (datatype)

Open verhard oppervlak vlak
notation: OVH_VLA
author at start life: Marinus Vonhof
date of start life: 2011-12-15
units of measurements: m2
comment: [is aspect]
scope note: Collection of facts MDS
scope note: Collection of facts HYD
type: Class
subclass of: Afvoerend oppervlak vlak
subclass of: Restriction
  on property: has as value
  all values from: Open verhard oppervlak vlak (datatype)

Open verhard oppervlak vlak uitgestrekt
notation: OVH_VLU
author at start life: Marinus Vonhof
date of start life: 2011-12-15
units of measurements: m2
comment: [is aspect]
scope note: Collection of facts MDS
scope note: Collection of facts HYD
type: Class
subclass of: Afvoerend oppervlak vlak uitgestrekt
subclass of: Restriction
  on property: has as value
  all values from: Open verhard oppervlak vlak uitgestrekt (datatype)

Openbaar hemelwaterstelsel
author of change: Marinus Vonhof
date of change: 2025-01-16
definition: [Waterwet] Voorziening voor de inzameling en verdere verwerking van afvloeiend hemelwater, niet zijnde een openbaar vuilwaterriool, in beheer bij een gemeente of een rechtspersoon die door een gemeente met het beheer is belast
author at start life: Marinus Vonhof
date of start life: 2014-09-05
validity context: *d
scope note: Collection of facts BAS
type: Class
subclass of: Extra objecttype (rol)
subclass of: Hemelwaterstelsel
subclass of: Restriction
  on property: heeft Toepassing
  has value: InBeheerBijGemeente

Openbaar ontwateringsstelsel
author of change: Marinus Vonhof
date of change: 2025-01-16
definition: [Waterwet] Voorziening voor de inzameling en verdere verwerking van grondwater, niet zijnde een openbaar vuilwaterriool, in beheer bij een gemeente of een rechtspersoon die door een gemeente met het beheer is belast
author at start life: Marinus Vonhof
date of start life: 2014-09-05
scope note: Collection of facts BAS
type: Class
subclass of: Drainagestelsel
subclass of: Restriction
  on property: heeft Toepassing
  has value: InBeheerBijGemeente

Openbaar vuilwaterstelsel
author of change: Eric van Gorkom
date of change: 2021-10-01
definition: [Waterwet] Voorziening voor de inzameling en het transport van stedelijk afvalwater, in beheer bij een gemeente of een rechtspersoon die door een gemeente met het beheer is belast
author at start life: Marinus Vonhof
date of start life: 2014-09-05
validity context: *d
alternative label: Openbaar vuilwaterriool
scope note: Collection of facts BAS
type: Class
subclass of: Vuilwaterstelsel
subclass of: Restriction
  on property: heeft Toepassing
  has value: InBeheerBijGemeente

Opening in wand
author of change: Marinus Vonhof
date of change: 2025-01-16
date of change: 2019-05-15
definition: Een opening in een wand zonder afvoerregeling
definition: [IMBOR] Een doorlaat in de vorm van een opening in een wand.
author at start life: Marinus Vonhof
date of start life: 2012-04-24
comment: Als de opening gecombineerd is met bijvoorbeeld een klep of schuif, gebruik dan een subtype van Mechanische Afsluiter als hydraulisch element
scope note: Collection of facts MDS
scope note: Collection of facts REV
scope note: Collection of facts HYD
scope note: Collection of facts DMO
type: Class
subclass of: Doorlaat
subclass of: Restriction
  author of change: Marinus Vonhof
  date of change: 2018-12-12
  author at start life: Marinus Vonhof
  date of start life: 2015-09-07
  on class: Stuwconstructie
  on property: has as part (inverse)
  qualified cardinality: 1
subclass of: Restriction
  author of change: Marinus Vonhof
  date of change: 2018-12-12
  author at start life: Marinus Vonhof
  date of start life: 2017-12-07
  on class: Stuwput
  on property: has as part (inverse)
  max qualified cardinality: 1
subclass of: Restriction
  on property: heeft Uitvoering
  has value: UitsparingInWand

Operationeel aanlegprogramma
definition: [NEN 3300:1996] Beschrijving van de op korte termijn aan te leggen riolering naar aard, omvang en tijdstip en de daartoe te verrichten activiteiten
author at start life: Marinus Vonhof
date of start life: 2022-09-30
validity context: *d
scope note: Collection of facts BAS
type: Class
subclass of: NEN 3300 Term

Operationeel maatregelenprogramma
definition: [NEN 3300:1996] Beschrijving van de op korte termijn uit te voeren (beheer)maatregelen, naar aard, omvang en tijdstip en de daartoe te verrichten activiteiten
author at start life: Marinus Vonhof
date of start life: 2022-09-30
validity context: *d
scope note: Collection of facts BAS
type: Class
subclass of: NEN 3300 Term

Operationeel onderzoeksprogramma
definition: [NEN 3300:1996] Beschrijving van het op korte termijn uit te voeren onderzoek, naar aard, omvang en tijdstip en de daartoe te verrichten activiteiten
author at start life: Marinus Vonhof
date of start life: 2022-09-30
validity context: *d
scope note: Collection of facts BAS
type: Class
subclass of: NEN 3300 Term

Operationeel rioleringsbeheer
author of change: Marinus Vonhof
date of change: 2018-12-14
author at start life: Marinus Vonhof
date of start life: 2014-11-29
scope note: Collection of facts BAS
type: Class
subclass of: Rioleringsbeheer

Operationele activiteit
definition: [NEN 3300:1996] Activiteiten gericht op de uitvoering van maatregelen en op het verkrijgen van gegevens
author at start life: Marinus Vonhof
date of start life: 2022-09-30
validity context: *d
scope note: Collection of facts BAS
type: Class
subclass of: NEN 3300 Term

Waarneming
label: Observation @en
author of change: Marinus Vonhof
date of change: 2018-04-06
author at start life: Marinus Vonhof
date of start life: 2013-01-07
validity context: 5d 6d 11d
comment: Was specialisatie van Inspecteren
scope note: Collection of facts TOP
type: Class
subclass of: Activiteit

Oppervlaktewater (materie)
definition: Water dat een grondoppervlak bedekt
author at start life: Marinus Vonhof
date of start life: 2024-10-28
scope note: Collection of facts BAS
type: Class
subclass of: Water

Oppervlaktewatergemaal
author of change: Marinus Vonhof
date of change: 2025-01-16
date of change: 2022-10-03
definition: Een gemaal voor het verpompen van oppervlaktewater
author at start life: Marinus Vonhof
date of start life: 2021-08-05
scope note: Collection of facts BAS
scope note: Collection of facts RGM
type: Class
subclass of: Gemaal
subclass of: Restriction
  on property: heeft Functie
  has value: VerpomptOppervlaktewater

Waterkering
author of change: Marinus Vonhof
date of change: 2025-01-16
date of change: 2016-04-28
definition: [IMBOR] Een voorziening en afgebakend gebied bedoeld om water te keren, inclusief alle kerende elementen.
author at start life: Marinus Vonhof
date of start life: 2013-03-31
validity context: *d
see also: [IMGeo:1.0/2007] Waterkerende kunstmatige of natuurlijke hoogte of hooggelegen gronden.
scope note: Collection of facts BAS
type: Class
subclass of: Kunstwerk
subclass of: Restriction
  author of change: Marinus Vonhof
  date of change: 2016-04-28
  author at start life: Marinus Vonhof
  date of start life: 2012-04-29
  on class: Oppervlaktewatersysteem
  on property: has as part (inverse)
  qualified cardinality: 1
subclass of: Restriction
  author of change: Marinus Vonhof
  date of change: 2018-04-23
  author at start life: Marinus Vonhof
  date of start life: 2014-12-02
  on class: Risicogebied
  on property: has as part (inverse)
  max qualified cardinality: 1
subclass of: Restriction
  on property: heeft Uitvoering
  has value: KunstmatigeOfNatuurlijkeHoogte
subclass of: Restriction
  on property: heeft Functie
  has value: OppervlaktewaterKeren

Vetvangput
author of change: Marinus Vonhof
date of change: 2025-01-16
date of change: 2026-07-20
definition: [IMBOR] Een bak- of cilindervormige put bedoeld om vette bestanddelen van de aangevoerde stof te scheiden en af te vangen.
author at start life: Marinus Vonhof
date of start life: 2019-05-15
scope note: Collection of facts BAS
type: Class
subclass of: Aansluitput
subclass of: Restriction
  author at start life: Marinus Vonhof
  date of start life: 2021-08-05
  on class: Opvangcapaciteit
  on property: has as aspect
  max qualified cardinality: 1
subclass of: Restriction
  validity context: *t
  on class: Vetafscheider
  on property: has as part
  qualified cardinality: 1
subclass of: Restriction
  on property: heeft Uitvoering
  has value: PutMetScheidingsvoorziening

Zandvangput
author of change: Marinus Vonhof
author of change: Johan Post
date of change: 2025-01-16
date of change: 2021-10-01
definition: [IMBOR] Een bak- of cilindervormige put bedoeld om zanderige bestanddelen van de aangevoerde stof te scheiden en af te vangen.
author at start life: Marinus Vonhof
date of start life: 2019-05-15
comment: ron afbeelding: Giverbo BV
scope note: Collection of facts BAS
type: Class
subclass of: Aansluitput
subclass of: Restriction
  author at start life: Marinus Vonhof
  date of start life: 2021-08-05
  on class: Opvangcapaciteit
  on property: has as aspect
  max qualified cardinality: 1
subclass of: Restriction
  on property: heeft Uitvoering
  has value: PutMetScheidingsvoorziening
subclass of: Restriction
  on class: Sym Zandvangput
  on property: is represented by
  max qualified cardinality: 1

Opvangput
author of change: Eric van Gorkom
date of change: 2021-09-23
definition: Kolk met grote afmeting (bijvoorbeeld 2x1 meter) en voorzien van een rooster, soms onderling verbonden met een hemelwaterriool
author at start life: Marinus Vonhof
date of start life: 2017-05-31
scope note: Collection of facts BAS
type: Class
subclass of: Put
subclass of: Restriction
  author at start life: Marinus Vonhof
  date of start life: 2017-05-31
  on class: Roosterdeksel
  on property: has as part
  qualified cardinality: 1
subclass of: Restriction
  on property: heeft Uitvoering
  has value: GroteAfmeting

Opvoergemaal
author of change: Marinus Vonhof
date of change: 2025-01-16
date of change: 2019-01-11
definition: Een gemaal in een vrijverval rioolstelsel voor het verpompen van afvalwater naar een hoger gelegen vrijverval rioolstelsel zonder gebruik te maken van een persleiding buiten het bouwwerk.
author at start life: Nic Roest (Idoro)
date of start life: 2007-11-29
scope note: Collection of facts MDS
scope note: Collection of facts HYD
scope note: Collection of facts RGM
scope note: Collection of facts DMO
type: Class
subclass of: Rioolgemaal
subclass of: Restriction
  on property: heeft Uitvoering
  has value: VerpomptBinnenHetBouwwerk

Organisatie afname
definition: Naam van de organisatie die verantwoordelijk is voor de afname van afvalwater (bijvoorbeeld de naam van een waterschap)
author at start life: Marinus Vonhof
date of start life: 2026-07-15
scope note: Collection of facts BAS
scope note: Collection of facts DMO
type: Class
subclass of: Levensvorm
subclass of: Restriction
  on class: Overnamepunt
  on property: has as aspect (inverse)
  max qualified cardinality: 1

Overgangsstuk
definition: [NEN 3300:1996] hulpstuk voor het verbinden van twee buizen van verschillende materialen of verbindingstypen
author at start life: Marinus Vonhof
date of start life: 2012-04-29
scope note: Collection of facts MDS
scope note: Collection of facts LDR
scope note: Collection of facts PLI
scope note: Collection of facts HYD
type: Class
subclass of: Verbindingsstuk
subclass of: Restriction
  on property: heeft Functie
  has value: VerbindenVanLeidingenMetVerschillendMatOfVerb

Sym_Overnamepunt
author of change: Marinus Vonhof
date of change: 2018-11-11
definition: Aangepaste stijl: Lijnkleur 255 0 0, Vulkleur 255 0 0. Grootte 10
author at start life: Marinus Vonhof
date of start life: 2018-11-07
scope note: Collection of facts NLCS
type: Class
subclass of: Geo-symbool
subclass of: Restriction
  author at start life: Marinus Vonhof
  date of start life: 2018-11-07
  on class: Overnamepunt
  on property: is represented by (inverse)
  max qualified cardinality: 1

Riooleindgemaal
author of change: Marinus Vonhof
date of change: 2025-01-16
date of change: 2017-04-06
definition: Het rioolgemaal waar de overdracht plaatsvindt van een stelsel onder beheer van een gemeente naar een stelsel of ontvangstput onder beheer van een waterschap.
author at start life: Marinus Vonhof
date of start life: 2014-11-30
see also: [IRIS-RIOKEN:2012] Voor het waterschap zijn in principe alleen de riooleindgemalen interessant, waar overdracht van afvalwater plaatsvindt naar een stelsel dat onder beheer van dit waterschap is.
alternative label: Overnamegemaal
scope note: Collection of facts MDS
scope note: Collection of facts HYD
scope note: Collection of facts RGM
scope note: Collection of facts DMO
type: Class
subclass of: Rioolgemaal
subclass of: Restriction
  author at start life: Marinus Vonhof
  date of start life: 2026-07-14
  on class: Overnamepunt
  on property: has as part
  max qualified cardinality: 1
subclass of: Restriction
  on property: heeft Toepassing
  has value: IsOverdrachtspunt

Overstortbemaling
author of change: Marinus Vonhof
author of change: Johan Post
date of change: 2016-04-15
date of change: 2024-04-30
date of change: 2024-07-15
definition: Bemaling, meestal naar oppervlaktewater, die eerst dan in werking treedt als een bepaald peil in het rioolstelsel is bereikt
definition: [NEN 3300:1996] aanvullende bemaling, meestal naar oppervlaktewater, die eerst dan in werking treedt als een bepaald peil in het rioolstelsel is bereikt
author at start life: Marinus Vonhof
date of start life: 2012-04-29
scope note: Collection of facts BAS
scope note: Collection of facts HYD
scope note: Collection of facts RGM
type: Class
subclass of: Constructieonderdeel
subclass of: Restriction
  author of change: Marinus Vonhof
  date of change: 2024-05-17
  on class: Overstortput
  on property: has as part (inverse)
  max qualified cardinality: 1
subclass of: Restriction
  author at start life: Marinus Vonhof
  date of start life: 2024-07-15
  on class: Rioolgemaal
  on property: has as part (inverse)
  max qualified cardinality: 1
subclass of: Restriction
  author at start life: Wouter van Riel
  date of start life: 2022-09-26
  on class: Constructieonderdeeloriëntatie
  on property: has as aspect
  max qualified cardinality: 1
subclass of: Restriction
  on property: heeft Functie
  has value: AanvullendeBemaling
subclass of: Restriction
  on class: Pomp
  on property: has as part
  min qualified cardinality: 1

Vorm drempel
author of change: Marinus Vonhof
date of change: 2020-04-18
definition: Uitvoeringswijze van de bovenkant overstortdrempel
author at start life: Nic Roest (Idoro)
date of start life: 2006-02-21
comment: Intrinsiek aspect
comment: [is aspect]
scope note: Collection of facts BAS
type: Class
subclass of: Vorm
subclass of: Restriction
  author of change: Marinus Vonhof
  date of change: 2015-07-28
  author at start life: Finy Teitsma (Oranjewoud)
  date of start life: 2006-02-25
  on class: Overstortdrempel
  on property: has as aspect (inverse)
  max qualified cardinality: 1
subclass of: Restriction
  author at start life: Marinus Vonhof
  date of start life: 2019-03-20
  on class: Stuwmuur
  on property: has as aspect (inverse)
  max qualified cardinality: 1
subclass of: Restriction
  on property: has as reference (qualification)
  all values from: Vorm drempel (coll)

Vorm drempel in bovenaanzicht
author of change: Marinus Vonhof
definition: Uitvoeringswijze van de overstortdrempel in bovenaanzicht, die de ligging van de drempel in het horizontale vlak beschrijft.
author at start life: Johan Post
date of start life: 2026-07-13
date of start life: 2026-07-02
comment: Intrinsiek aspect
comment: [is aspect]
scope note: Collection of facts BAS
type: Class
subclass of: Vorm
subclass of: Restriction
  on property: has as reference (qualification)
  all values from: Vorm drempel in bovenaanzicht (coll)
subclass of: Restriction
  on class: Overstortdrempel
  on property: has as aspect (inverse)
  max qualified cardinality: 1
subclass of: Restriction
  on class: Stuwmuur
  on property: has as aspect (inverse)
  max qualified cardinality: 1

Overstorting
definition: [NEN 3300:1996] De lozing van afvalwater via een overstortdrempel
author at start life: Marinus Vonhof
date of start life: 2022-09-30
validity context: *d
alternative label: Overstortgebeurtenis
scope note: Collection of facts BAS
type: Class
subclass of: NEN 3300 Term

Overstortingsdebiet
definition: [NEN 3300:1996] De hoeveelheid afvalwater per tijdseenheid die de overstortdrempel passeert
author at start life: Marinus Vonhof
date of start life: 2022-09-30
validity context: *d
scope note: Collection of facts BAS
type: Class
subclass of: NEN 3300 Term

Overstortingsfrequentie
definition: [NEN 3300:1996] Het totaal aantal overstortingen in de beschouwde periode gedeeld door de beschouwde periode in jaren
author at start life: Marinus Vonhof
date of start life: 2022-09-30
validity context: *d
scope note: Collection of facts BAS
type: Class
subclass of: NEN 3300 Term

Overstortingsgebeurtenis
definition: [NEN 3300:1996] De gebeurtenis bestaande uit alle overstortingsperioden en overstortingspauzes, waarbij een overstortingspauze niet groter is dan een bepaalde tijdsduur
author at start life: Marinus Vonhof
date of start life: 2014-11-30
comment: 20151014: NEN3300-definitie aangepast
see also: [IRIS-RIOKEN:2012] Eén overstorting dan wel een reeks van overstortingen met tussenliggende overstortingspauze(s) van elk minder dan 24 uur, overeenkomstig de definitie volgens de module C2100 van de Leidraad Riolering.
scope note: Collection of facts BAS
scope note: Collection of facts DMO
type: Class
subclass of: NEN 3300 Term

Overstortingshoeveelheid
definition: [NEN 3300:1996] De totale hoeveelheid overgestort afvalwater in een bepaalde tijdsduur per eenheid van volume (m3) of in eenheid van volume per eenheid van horizontaal oppervlak (mm)
author at start life: Marinus Vonhof
date of start life: 2022-09-30
validity context: *d
scope note: Collection of facts BAS
type: Class
subclass of: NEN 3300 Term

Overstortleiding
author of change: Finy Teitsma (Oranjewoud)
date of change: 2007-11-12
definition: Een gesloten rioolleiding voor het transport van het afvalwater van een overstortput naar het lozingspunt
definition: [NEN 3300:1996] riool bestemd voor de afvoer van afvalwater geloosd via een overstort
author at start life: Finy Teitsma (Oranjewoud)
date of start life: 2007-10-23
alternative label: Overstortriool
scope note: Collection of facts MDS
scope note: Collection of facts REV
scope note: Collection of facts HYD
type: Class
subclass of: Vrijverval rioolleiding
subclass of: Restriction
  author at start life: Marinus Vonhof
  date of start life: 2018-11-07
  on class: Sym_Overstortleiding
  on property: is represented by
  max qualified cardinality: 1
subclass of: Restriction
  on property: heeft Functie
  has value: TransportVanOverstortendAfvalwater

Sym_Overstortleiding
author of change: Marinus Vonhof
date of change: 2018-11-10
definition: Standaard stijl: Lijntype doorgetrokken, Lijnkleur 0 0 255, Lijndikte 1.5
author at start life: Marinus Vonhof
date of start life: 2018-11-07
scope note: Collection of facts NLCS
type: Class
subclass of: Geo-symbool
subclass of: Restriction
  author at start life: Marinus Vonhof
  date of start life: 2018-11-07
  on class: Overstortleiding
  on property: is represented by (inverse)
  max qualified cardinality: 1

Overstortmeter
author of change: Wouter van Riel
date of change: 2024-04-22
author at start life: Marinus Vonhof
date of start life: 2015-07-27
see also: [Waterkring West] Registreert de overstortingsgebeurtenis
scope note: Collection of facts BAS
type: Class
subclass of: Meetinstrument
subclass of: Restriction
  author at start life: Wouter van Riel
  date of start life: 2024-04-22
  on class: Bouwwerk
  on property: has as part (inverse)
  max qualified cardinality: 1
subclass of: Restriction
  author at start life: Wouter van Riel
  date of start life: 2024-04-22
  on class: Compartiment
  on property: has as part (inverse)
  max qualified cardinality: 1
subclass of: Restriction
  author at start life: Wouter van Riel
  date of start life: 2024-04-22
  on class: Overstortput
  on property: has as part (inverse)
  max qualified cardinality: 1
subclass of: Restriction
  on property: heeft Functie
  has value: OverstortgebeurtenisRegistreren
subclass of: Restriction
  on class: Sym_Overstortmeter
  on property: is represented by
  max qualified cardinality: 1

Sym_Overstortmeter
author at start life: Johan Post
date of start life: 2021-10-01
scope note: Collection of facts NLCS
type: Class
subclass of: Geo-symbool
subclass of: Restriction
  author at start life: Marinus Vonhof
  date of start life: 2018-11-07
  on class: Overstortmeter
  on property: is represented by (inverse)
  max qualified cardinality: 1

Sym_Overstortput
author of change: Marinus Vonhof
date of change: 2018-11-11
definition: Aangepaste stijl: Lijnkleur 255 0 0, Vulkleur 255 0 0. Grootte 10
author at start life: Marinus Vonhof
date of start life: 2018-11-07
scope note: Collection of facts NLCS
type: Class
subclass of: Geo-symbool
subclass of: Restriction
  author at start life: Marinus Vonhof
  date of start life: 2018-11-07
  on class: Overstortput
  on property: is represented by (inverse)
  max qualified cardinality: 1

Paaljukfundering
author of change: Marinus Vonhof
date of change: 2025-01-16
date of change: 2021-08-06
definition: Object via één of meer paaljukken ondersteund
author at start life: Marinus Vonhof
date of start life: 2018-12-06
scope note: Collection of facts MDS
scope note: Collection of facts RGM
type: Class
subclass of: Fundering
subclass of: Restriction
  on property: heeft Uitvoering
  has value: MetPalenEnBalken

Parallelriool
author of change: Marinus Vonhof
date of change: 2025-01-16
date of change: 2022-09-29
date of change: 2024-08-01
definition: Een vrijverval rioolleiding die naast één of meerdere vrijverval rioolleidingen ligt, de leidingen sluiten op dezelfde putten aan.
author at start life: Marinus Vonhof
date of start life: 2018-12-06
scope note: Collection of facts BAS
type: Class
subclass of: Vrijverval rioolleiding
subclass of: Extra objecttype (rol)
subclass of: Restriction
  on property: heeft Uitvoering
  has value: LigtNaastEenRioolleiding

Peilbuisdeksel
author of change: Marinus Vonhof
author of change: Johan Post
date of change: 2025-01-16
date of change: 2026-05-01
definition: [IMBOR] De deksel aan het oppervlak die aanduidt dat het object in de ondergrond een peilbuis is.
author at start life: Marinus Vonhof
date of start life: 2018-12-06
validity context: 14d
scope note: Collection of facts REV
scope note: Collection of facts BAS
type: Class
subclass of: Deksel
subclass of: Restriction
  author at start life: Marinus Vonhof
  date of start life: 2021-08-06
  on class: Peilbuis
  on property: has as part (inverse)
  max qualified cardinality: 1
subclass of: Restriction
  on property: heeft Functie
  has value: AfdekkenVanPeilbuis

Schutkoker
definition: Een (veelal metalen) beschermkoker die dient als afwerking van een peilbuis boven het maaiveld
author at start life: Johan Post
date of start life: 2025-05-01
validity context: 1d 3d 10d 12d 14d
alternative label: Beschermkoker
scope note: Collection of facts BAS
type: Class
subclass of: Constructieonderdeel
subclass of: Restriction
  author at start life: Marinus Vonhof
  date of start life: 2014-12-02
  on class: Peilbuis
  on property: has as part (inverse)
  max qualified cardinality: 1
subclass of: Restriction
  on property: heeft Functie
  has value: BeschermenPeilbuis

Sym_Peilbuis
author at start life: Johan Post
date of start life: 2021-10-01
scope note: Collection of facts NLCS
type: Class
subclass of: Geo-symbool
subclass of: Restriction
  author at start life: Marinus Vonhof
  date of start life: 2018-11-07
  on class: Peilbuis
  on property: is represented by (inverse)
  max qualified cardinality: 1

Pendelstuk
author of change: Marinus Vonhof
date of change: 2025-01-16
definition: Een leiding voor de opvang van axiale beweging in de ondergrond door bijvoorbeeld zetting
author at start life: Marinus Vonhof
date of start life: 2019-05-15
validity context: 10d
alternative label: Pendelbuis
alternative label: Polderstuk
scope note: Collection of facts BAS
type: Class
subclass of: Leiding
subclass of: Restriction
  on property: heeft Toepassing
  has value: BijZetting
subclass of: Restriction
  on property: heeft Functie
  has value: OpvangenAxialeBeweging

Sym_Persleiding
author of change: Marinus Vonhof
date of change: 2018-11-10
definition: Standaard stijl: Lijntype doorgetrokken, Lijnkleur 204 0 204, Lijndikte 2.0
author at start life: Marinus Vonhof
date of start life: 2018-11-07
scope note: Collection of facts NLCS
type: Class
subclass of: Geo-symbool
subclass of: Restriction
  author at start life: Marinus Vonhof
  date of start life: 2018-11-07
  on class: Persleiding
  on property: is represented by (inverse)
  max qualified cardinality: 1

Sym_Persleidingsysteem
author of change: Johan Post
date of change: 2024-04-30
author at start life: Johan Post
date of start life: 2021-10-01
scope note: Collection of facts NLCS
type: Class
subclass of: Geo-symbool
subclass of: Restriction
  author at start life: Marinus Vonhof
  date of start life: 2018-11-07
  on class: Persleidingstelsel
  on property: is represented by (inverse)
  max qualified cardinality: 1

Persluchtpomp
author of change: Finy Teitsma (Oranjewoud)
date of change: 2007-10-25
definition: Een pomp waarbij de vloeistof door middel van perslucht wordt verplaatst.
author at start life: Finy Teitsma (Oranjewoud)
date of start life: 2007-10-24
scope note: Collection of facts BAS
scope note: Collection of facts HYD
scope note: Collection of facts RGM
scope note: Collection of facts DMO
type: Class
subclass of: Pomp
subclass of: Restriction
  on property: heeft Technologie
  has value: VerplaatsingDoorMiddelVanPerslucht

Perspomp
definition: Een pomp om afvalwater onder druk te transporteren.
author at start life: Marinus Vonhof
date of start life: 2026-07-15
scope note: Collection of facts BAS
scope note: Collection of facts RGM
type: Class
subclass of: Pomp
subclass of: Restriction
  on property: heeft Toepassing
  has value: DeelVanVacuumriolering
subclass of: Restriction
  on property: heeft Technologie
  has value: DoorMiddelVanOverdruk
subclass of: Restriction
  on class: Vacuümpompstation
  on property: has as part (inverse)
  qualified cardinality: 1

Reinigen mechanische leiding
author at start life: Marinus Vonhof
date of start life: 2019-04-04
validity context: 6d
scope note: Collection of facts BAS
scope note: Collection of facts PLI
scope note: Collection of facts MTR
type: Class
subclass of: Reinigen

Reinigingsplan
author of change: Marinus Vonhof
date of change: 2018-12-12
definition: Een plan dat beschrijft hoe en wanneer de riolering gereinigd wordt
author at start life: Marinus Vonhof
date of start life: 2018-12-06
scope note: Collection of facts BAS
scope note: Collection of facts DMO
type: Class
subclass of: Rioleringsplan
subclass of: Restriction
  author at start life: Marinus Vonhof
  date of start life: 2018-12-13
  on class: Planvorming rioleringsbeheer
  on property: has as output (inverse)
  max qualified cardinality: 1
subclass of: Restriction
  author at start life: Marinus Vonhof
  date of start life: 2018-12-13
  on class: Reinigings- en inspectieproject kolken
  on property: has as output
  max qualified cardinality: 1
subclass of: Restriction
  author at start life: Marinus Vonhof
  date of start life: 2018-12-13
  on class: Reinigingsproject riolering
  on property: has as output
  max qualified cardinality: 1

Plas
author of change: Marinus Vonhof
date of change: 2025-01-16
definition: [IMBOR] Een massa stilstaand landoppervlaktewater. (Bron: definities.geostandaarden.nl)
author at start life: Marinus Vonhof
date of start life: 2017-05-31
validity context: 1d 3d 10d 12d 14d
scope note: Collection of facts MDS
type: Class
subclass of: Watervlakte
subclass of: Restriction
  on property: heeft Uitvoering
  has value: NatuurlijkEnKlein
subclass of: Restriction
  on property: heeft Structuur
  has value: NietStromend

Pluviograaf
definition: [NEN 3300:1996] Een zelfregistrerende regenmeter
author at start life: Marinus Vonhof
date of start life: 2022-09-30
validity context: *d
scope note: Collection of facts BAS
type: Class
subclass of: NEN 3300 Term

Pluviogram
definition: [NEN 3300:1996] Een grafische weergave van de neerslag in een cumulatieve vorm
author at start life: Marinus Vonhof
date of start life: 2022-09-30
validity context: *d
scope note: Collection of facts BAS
type: Class
subclass of: NEN 3300 Term

Pocket
definition: Korte leiding voor het verbinden van vacuümleidingen en het overbruggen van hoogteverschil
author at start life: Marinus Vonhof
date of start life: 2026-07-15
scope note: Collection of facts BAS
type: Class
subclass of: Hulpstuk
subclass of: Restriction
  on property: heeft Functie
  has value: OverbruggenHoogteverschil

Poel
author of change: Marinus Vonhof
date of change: 2025-01-16
definition: [IMBOR] Een massa stilstaand landoppervlaktewater. (Bron: definities.geostandaarden.nl). Een omsloten stilstaand en ondiep oppervlaktewater.
author at start life: Marinus Vonhof
date of start life: 2017-05-31
validity context: 1d 3d 10d 12d 14d
scope note: Collection of facts MDS
type: Class
subclass of: Watervlakte
subclass of: Restriction
  on property: heeft Structuur
  has value: NatuurlijkEnKlein

Polystyreen fundering
author of change: Marinus Vonhof
date of change: 2025-01-16
date of change: 2018-12-10
definition: [IMBOR] Een funderingslaag die bestaat uit onderdelen van polystyreen.
author at start life: Marinus Vonhof
date of start life: 2018-12-06
scope note: Collection of facts MDS
scope note: Collection of facts RGM
type: Class
subclass of: Fundering
subclass of: Restriction
  on property: heeft Uitvoering
  has value: LaagVanPolystyreen

Pompfabrikaat
author of change: Marinus Vonhof
date of change: 2016-04-23
author at start life: Nic Roest (Idoro)
date of start life: 2006-02-21
alternative label: Pomptype
comment: [is aspect]
scope note: Collection of facts BAS
scope note: Collection of facts RGM
type: Class
subclass of: Kenmerk
subclass of: Restriction
  author at start life: Finy Teitsma (Oranjewoud)
  date of start life: 2006-02-25
  on class: Pomp
  on property: has as aspect (inverse)
  max qualified cardinality: 1

Stankfilter
author of change: Marinus Vonhof
author of change: Johan Post
date of change: 2025-01-16
date of change: 2026-05-21
date of change: 2020-05-26
definition: Voorziening die afgezogen of vrijkomende lucht behandelt om geurstoffen te verwijderen of te reduceren, zodat stankoverlast voor de omgeving wordt voorkomen.
definition: [IMBOR] Een fijn net of rooster dat de stank veroorzakende bestanddelen uit vrijgekomen lucht afvangt.
author at start life: Marinus Vonhof
date of start life: 2018-05-03
validity context: 1d 3d 10d
alternative label: Geurfilter
scope note: Collection of facts BAS
scope note: Collection of facts RGM
type: Class
subclass of: Constructieonderdeel
subclass of: Restriction
  author at start life: Johan Post
  date of start life: 2026-05-21
  on class: Vacuümpompstation
  on property: has as part (inverse)
  max qualified cardinality: 1
subclass of: Restriction
  author at start life: Marinus Vonhof
  date of start life: 2018-05-03
  on class: Pompput
  on property: has as part (inverse)
  max qualified cardinality: 1
subclass of: Restriction
  on property: heeft Functie
  has value: VoorkomenStank

Sym_Pompput
author of change: Marinus Vonhof
date of change: 2018-11-11
definition: Aangepaste stijl: Lijnkleur 0 0 0, Grootte 10
author at start life: Marinus Vonhof
date of start life: 2018-11-07
scope note: Collection of facts NLCS
type: Class
subclass of: Geo-symbool
subclass of: Restriction
  author at start life: Marinus Vonhof
  date of start life: 2018-11-07
  on class: Pompput
  on property: is represented by (inverse)
  max qualified cardinality: 1
subclass of: Restriction
  author at start life: Marinus Vonhof
  date of start life: 2018-11-07
  on class: Pompunit
  on property: is represented by (inverse)
  max qualified cardinality: 1

Privédrainage
author of change: Marinus Vonhof
date of change: 2025-01-16
definition: Drainage die hoofdzakelijk is gelegen in achtertuinen van woningen. De gemeente is niet verantwoordelijk voor dit type drainage
author at start life: Marinus Vonhof
date of start life: 2020-04-17
scope note: Collection of facts BAS
type: Class
subclass of: Drainagestelsel
subclass of: Restriction
  on property: heeft Toepassing
  has value: NietInBeheerBijGemeente

Projectreferentie opdrachtgever
label: Employers job reference @en
definition: [EN13508-2+A1] De opdrachtcode van de opdrachtgever
definition: [EN13508-2+A1] The employer’s job reference code @en
notation: ABJ
notation: CBJ
notation: EBJ
notation: GBJ
notation: JBJ
author at start life: Marinus Vonhof
date of start life: 2011-12-02
validity context: 3d 6d 14d
alternative label: Opdrachtcode opdrachtgever (EN)
comment: [is aspect]
scope note: Collection of facts TOP
type: Class
subclass of: Unieke identificatie
subclass of: Restriction
  author of change: Marinus Vonhof
  date of change: 2015-10-26
  author at start life: Marinus Vonhof
  date of start life: 2011-12-02
  validity context: 1t 10t 12t
  on class: Project
  on property: has as aspect (inverse)
  max qualified cardinality: 1

Putbuis
author of change: Marinus Vonhof
date of change: 2025-01-16
date of change: 2018-12-11
definition: Een inspectieschacht aangebracht op een buis met grote afmeting
author at start life: Marinus Vonhof
date of start life: 2018-12-05
scope note: Collection of facts MDS
scope note: Collection of facts REV
scope note: Collection of facts HYD
type: Class
subclass of: Rioolput
subclass of: Restriction
  on property: heeft Uitvoering
  has value: InspectieschachtOpLeiding

Putdeksel - licht verkeer
author of change: Marinus Vonhof
date of change: 2025-01-16
definition: [IMBOR] Een deksel om de opening van een put af te sluiten, die sterk genoeg is om het passeren van voertuigen van gering gewicht te doorstaan.
author at start life: Marinus Vonhof
date of start life: 2018-12-06
scope note: Collection of facts MDS
scope note: Collection of facts REV
type: Class
subclass of: Putdeksel
subclass of: Restriction
  on property: heeft Functie
  has value: DragenVanLichtVerkeer

Putdeksel - zwaar verkeer
author of change: Marinus Vonhof
date of change: 2025-01-16
definition: [IMBOR] Een deksel om de opening van een put af te sluiten, die sterk genoeg is om het passeren van voertuigen van fors gewicht te doorstaan.
author at start life: Marinus Vonhof
date of start life: 2018-12-06
scope note: Collection of facts MDS
scope note: Collection of facts REV
type: Class
subclass of: Putdeksel
subclass of: Restriction
  on property: heeft Functie
  has value: DragenVanZwaarVerkeer

Putschacht
label: Chamber unit @en
author of change: Marinus Vonhof
author of change: Eric van Gorkom
date of change: 2025-01-16
date of change: 2024-05-13
date of change: 2026-08-04
definition: [EN 16323:2014] (part of a manhole or inspection chamber) vertical hollow component that has a uniform cross-section except at the joint profile @en
definition: [IMBOR] Een hol compartiment dat vanaf het oppervlak toegang biedt tot een put.
author at start life: Marinus Vonhof
date of start life: 2013-02-05
scope note: Collection of facts BAS
type: Class
subclass of: Constructieonderdeel
subclass of: Restriction
  author of change: Marinus Vonhof
  date of change: 2016-04-15
  date of change: 2023-01-10
  author at start life: Marinus Vonhof
  date of start life: 2013-02-05
  validity context: *t
  on class: Rioolput
  on property: has as part (inverse)
  qualified cardinality: 1
subclass of: Restriction
  on property: heeft Toepassing
  has value: DeelVanEenPut

RWS kolk
author of change: Marinus Vonhof
author of change: Johan Post
date of change: 2025-01-16
date of change: 2021-11-17
definition: [IMBOR] Tweedelige trottoirkolk beton/gietijzer, type RWS aansluitend op RWS-bandprofiel met U-vormige omranding.
author at start life: Marinus Vonhof
date of start life: 2021-08-06
scope note: Collection of facts MDS
scope note: Collection of facts RRB
scope note: Collection of facts LDR
scope note: Collection of facts REV
type: Class
subclass of: Kolk
subclass of: Restriction
  on property: heeft Uitvoering
  has value: HeeftU vormigeOmranding
subclass of: Restriction
  on property: heeft Toepassing
  has value: SluitAanOpRWS bandprofiel

Sym_RWZI
author of change: Marinus Vonhof
date of change: 2018-11-11
definition: Aangepaste stijl: Lijnkleur 0 0 255, Vulkleur 89 158 255, Grootte 10
author at start life: Marinus Vonhof
date of start life: 2018-11-07
scope note: Collection of facts NLCS
type: Class
subclass of: Geo-symbool
subclass of: Restriction
  author at start life: Marinus Vonhof
  date of start life: 2018-11-07
  on class: RWZI
  on property: is represented by (inverse)
  max qualified cardinality: 1

Radiale verplaatsing
definition: [NEN 3300:1996] Een verplaatsing van twee buizen ten opzichte van elkaar, loodrecht op de asrichting van de buizen
author at start life: Marinus Vonhof
date of start life: 2022-09-30
validity context: *d
scope note: Collection of facts BAS
type: Class
subclass of: NEN 3300 Term

Randvoorziening (coll)
definition: Een voorziening bestemd om de lozing van het vuil uit het rioolstelsel op het oppervlaktewater te verminderen.
definition: [NEN 3300:1996] vloeistofdichte voorziening als onderdeel van het rioolstelsel die als doel heeft de lozing van vuil uit het rioolstelsel op oppervlaktewater te verminderen
validity context: *d
see also: [IRIS-RIOKEN:2012] Vloeistofdichte voorziening als onderdeel van het rioolstelsel, die als doel heeft de lozing van vuil uit het rioolstelsel op het oppervlaktewater te verminderen.
comment: [is coll]
scope note: Collection of facts MDS
scope note: Collection of facts DMO
type: Class
subclass of: Verzameling soorten
subclass of: Class
  one of: Bergbezinkbassin
  one of: Bezinkbassin
  one of: Bergbezinkleiding
  one of: Bergingsvijver
subclass of: Restriction
  on property: heeft Doel
  has value: VerminderenVuilbelastingVanOppervlaktewater

Vorm deksel (coll)
comment: [is coll]
scope note: Collection of facts MDS
scope note: Collection of facts REV
type: Class
subclass of: Verzameling soorten

Recreatiebedrijf
author of change: Marinus Vonhof
date of change: 2016-04-24
author at start life: Marinus Vonhof
date of start life: 2014-12-01
scope note: Collection of facts RRB
scope note: Collection of facts LDR
scope note: Collection of facts BAS
type: Class
subclass of: Bedrijfslocatie

Reeksberekening
definition: [NEN 3300:1996] Hydraulische berekening met een neerslagreeks
author at start life: Marinus Vonhof
date of start life: 2022-09-30
validity context: *d
scope note: Collection of facts BAS
type: Class
subclass of: NEN 3300 Term

Regenmeter
author of change: Johan Post
date of change: 2021-10-01
definition: Een instrument dat de hoeveelheid neerslag per oppervlak meet.
author at start life: Finy Teitsma (Oranjewoud)
date of start life: 2007-10-23
alternative label: Pluviometer
scope note: Collection of facts BAS
type: Class
subclass of: Meetinstrument
subclass of: Restriction
  author at start life: Wouter van Riel
  date of start life: 2024-04-22
  on class: Bouwwerk
  on property: has as part (inverse)
  max qualified cardinality: 1
subclass of: Restriction
  on property: heeft Functie
  has value: MetenHoeveelheidHemelwater
subclass of: Restriction
  on class: Sym_Regenmeter
  on property: is represented by
  max qualified cardinality: 1

Sym_Regenmeter
author at start life: Johan Post
date of start life: 2021-10-01
scope note: Collection of facts NLCS
type: Class
subclass of: Geo-symbool
subclass of: Restriction
  author at start life: Marinus Vonhof
  date of start life: 2018-11-07
  on class: Regenmeter
  on property: is represented by (inverse)
  max qualified cardinality: 1

Regenweerafvoer
definition: [Waterwet] Soort afvalwater
notation: RWA
author at start life: Eric van Gorkom
date of start life: 2022-12-24
see also: [IRIS-RIOKEN:2012] Het water dat bij regen door de riolering moet worden afgevoerd. Deze bestaat uit huishoudelijk- en industrieel afvalwater, lekwater en hemelwater.
scope note: Collection of facts BAS
scope note: Collection of facts DMO
type: Class
subclass of: Afvalwater

Reinigings- en inspectieproject kolken
author of change: Marinus Vonhof
date of change: 2017-04-06
definition: Een project dat tot doel heeft de kolken in het rioleringssysteem te reinigen en inspecteren.
author at start life: Marinus Vonhof
date of start life: 2014-04-29
validity context: 3d 14d
scope note: Collection of facts MDS
scope note: Collection of facts RRB
type: Class
subclass of: Project
subclass of: Restriction
  author of change: Marinus Vonhof
  date of change: 2014-09-03
  author at start life: Marinus Vonhof
  date of start life: 2014-04-29
  on class: Reinigen en inspecteren kolk
  on property: has as part
  min qualified cardinality: 1
subclass of: Restriction
  author at start life: Marinus Vonhof
  date of start life: 2018-12-13
  on class: Reinigingsplan
  on property: has as output (inverse)
  max qualified cardinality: 1

Reinigende put
author of change: Marinus Vonhof
date of change: 2018-12-05
definition: Een rioolput met een fysisch reinigende voorziening, waarbij de vervuiling wordt gescheiden van het afvalwater. Kan ook beschouwd worden als een soort reinigende voorziening.
author at start life: Finy Teitsma (Oranjewoud)
date of start life: 2006-11-29
scope note: Collection of facts MDS
scope note: Collection of facts HYD
type: Class
subclass of: Inspectieput
subclass of: Restriction
  on property: heeft Uitvoering
  has value: BevatFysischReinigendeVoorziening
subclass of: Restriction
  on property: heeft Technologie
  has value: FysischReinigen
subclass of: Restriction
  on property: heeft Functie
  has value: VerwijderenVervuiling

Reiniger
author of change: Marinus Vonhof
date of change: 2015-10-31
notation: GBH
notation: JBH
author at start life: Marinus Vonhof
date of start life: 2014-12-23
validity context: 3d 14d
see also: [RIB] Naam en bedrijf reiniger
scope note: Collection of facts MDS
scope note: Collection of facts RRB
type: Class
subclass of: Opdrachtnemer

Restlevensduur
definition: [NEN 3300:1996] Tijd vanaf het moment van waarneming tot het moment waarop het betreffende object naar verwachting niet meer aan de gestelde maatstaven voldoet
author at start life: Marinus Vonhof
date of start life: 2022-09-30
validity context: *d
scope note: Collection of facts BAS
type: Class
subclass of: NEN 3300 Term

Revisietekeningnummer
author of change: Nic Roest (Idoro)
date of change: 2006-11-23
definition: Eenduidige nummeraanduiding van de tekening, waarop de bestaande situatie is vastgelegd
author at start life: Nic Roest (Idoro)
date of start life: 2006-02-21
comment: [is aspect]
scope note: Collection of facts BAS
type: Class
subclass of: Kenmerk
subclass of: Restriction
  author at start life: Marinus Vonhof
  date of start life: 2014-04-29
  on class: Revisietekening
  on property: has as aspect (inverse)
  max qualified cardinality: 1

Rietmatten
author of change: Marinus Vonhof
date of change: 2025-01-16
date of change: 2016-04-28
definition: [IMBOR] Een fundering gemaakt vlakken van samengebonden gedroogde rietstengels.
author at start life: Marinus Vonhof
date of start life: 2015-07-27
see also: [Waterkring West] Wordt in kleigrond toegepast
scope note: Collection of facts MDS
scope note: Collection of facts RGM
type: Class
subclass of: Fundering
subclass of: Restriction
  on property: heeft Toepassing
  has value: InKleigrond
subclass of: Restriction
  on property: heeft Uitvoering
  has value: LaagVanRietmatten

Sym_Afsluiter
author of change: Marinus Vonhof
date of change: 2018-11-11
definition: Aangepaste stijl: Vulkleur 0 0 0, Grootte 10
author at start life: Marinus Vonhof
date of start life: 2018-11-07
scope note: Collection of facts NLCS
type: Class
subclass of: Geo-symbool
subclass of: Restriction
  author of change: Marinus Vonhof
  date of change: 2020-04-17
  author at start life: Marinus Vonhof
  date of start life: 2018-11-07
  on class: Rioolafsluiter
  on property: is represented by (inverse)
  max qualified cardinality: 1

Riooldrainage
author of change: Marinus Vonhof
date of change: 2025-01-16
definition: Drainage die is gelegen tussen en aangesloten op rioolputten
author at start life: Marinus Vonhof
date of start life: 2020-04-17
scope note: Collection of facts BAS
type: Class
subclass of: Drainagestelsel
subclass of: Restriction
  on property: heeft Uitvoering
  has value: AangeslotenOpRioolputten

Sym_Rioolgemaal
author of change: Marinus Vonhof
date of change: 2018-11-11
definition: Aangepaste stijl: Lijnkleur 0 0 0, Vulkleur 0 0 0, Grootte 10
author at start life: Marinus Vonhof
date of start life: 2018-11-07
scope note: Collection of facts NLCS
type: Class
subclass of: Geo-symbool
subclass of: Restriction
  author at start life: Marinus Vonhof
  date of start life: 2018-11-07
  on class: Rioolgemaal
  on property: is represented by (inverse)
  max qualified cardinality: 1

SDR-waarde
label: Standard dimension ratio @en
author of change: Marinus Vonhof
date of change: 2019-09-02
definition: De SDR-waarde (Standard Dimension Ratio) is gebaseerd op de kunststof leiding in nieuwstaat. Het is de waarde van de buitendiameter van de leiding gedeeld door de wanddikte van de leiding.
author at start life: Marinus Vonhof
date of start life: 2019-03-20
alternative label: Buiskengetal
comment: [is aspect]
scope note: Collection of facts PLI
scope note: Collection of facts HYD
type: Class
subclass of: Kenmerk
subclass of: Restriction
  author at start life: Marinus Vonhof
  date of start life: 2024-05-16
  on class: Rioolleiding
  on property: has as aspect (inverse)
  max qualified cardinality: 1
subclass of: Restriction
  author at start life: Marinus Vonhof
  date of start life: 2024-05-16
  on class: Transportleiding
  on property: has as aspect (inverse)
  max qualified cardinality: 1
subclass of: Restriction
  author at start life: Marinus Vonhof
  date of start life: 2025-11-11
  on property: has as value
  all values from: integer

Vuilvangrooster
author of change: Marinus Vonhof
date of change: 2026-08-20
date of change: 2016-04-13
definition: Een constructie bij een put of leiding voor het opvangen van vuil uit afvalwater
author at start life: Finy Teitsma (Oranjewoud)
date of start life: 2007-10-23
validity context: 10d
scope note: Collection of facts REV
scope note: Collection of facts BAS
type: Class
subclass of: Constructieonderdeel
subclass of: Restriction
  author at start life: Wouter van Riel
  date of start life: 2022-09-26
  on class: Appendage-oriëntatie
  on property: has as aspect
  max qualified cardinality: 1
subclass of: Restriction
  author at start life: Marinus Vonhof
  date of start life: 2026-08-20
  on class: Rioolleiding
  on property: has as part (inverse)
  max qualified cardinality: 1
subclass of: Restriction
  author at start life: Marinus Vonhof
  date of start life: 2026-08-20
  on class: Rioolput
  on property: has as part (inverse)
  max qualified cardinality: 1
subclass of: Restriction
  on property: heeft Functie
  has value: OpvangenVuil
subclass of: Restriction
  on property: heeft Functie
  has value: ReinigenAfvalwater

Warmtewinningsnet
author of change: Marinus Vonhof
date of change: 2025-01-16
definition: Een stelsel waarbij warmte gewonnen wordt uit rioolwater
definition: [IMBOR] Een stelsel van thermische leidingen, stadswarmteleidingen of andere ondergrondse infrastructuur voor het transport van warmte.
author at start life: Eric van Gorkom
date of start life: 2022-09-27
validity context: 10d 14d
alternative label: Riothermie
scope note: Collection of facts BAS
type: Class
subclass of: Stelsel
subclass of: Extra objecttype (rol)
subclass of: Restriction
  author at start life: Eric van Gorkom
  date of start life: 2022-09-27
  on class: Rioolleiding
  on property: has as part
  min qualified cardinality: 1
subclass of: Restriction
  on property: heeft Doel
  has value: WarmteWinnenUitRioolwater

Rioolput met geleiding
author of change: Marinus Vonhof
date of change: 2015-09-20
definition: [NEN-EN 752:2008] mantoegankelijke put met een steil aflopende leiding of steil aflopend kanaal vanuit een op een hoger niveau gelegen aansluitleiding of riool
author at start life: Marinus Vonhof
date of start life: 2012-04-29
scope note: Collection of facts BAS
type: Class
subclass of: Rioolput
subclass of: Extra objecttype (rol)
subclass of: Restriction
  on property: heeft Uitvoering
  has value: VoorzienVanSteilAflLeidOfKanaalVanuitHogerLeid

Rioolrechtverordening
definition: [NEN 3300:1996] Verordening door de gemeenteraad vastgesteld voor de heffing en invordering van rioolrecht
author at start life: Marinus Vonhof
date of start life: 2022-09-30
validity context: *d
scope note: Collection of facts BAS
type: Class
subclass of: NEN 3300 Term

Rioolstreng
author of change: Marinus Vonhof
date of change: 2017-12-07
definition: [NEN 3300:1996] Aanduiding voor de riolering tussen het hart van een put en het hart van een volgende put (niet noodzakelijk de eerstvolgende)
author at start life: Marinus Vonhof
date of start life: 2012-04-29
scope note: Collection of facts BAS
type: Class
subclass of: Representatie fysiek object

Rioolverzakking
definition: [NEN 3300:1996] Een afwijking ten opzichte van de oorspronkelijke ligging van het riool in het verticale vlak
author at start life: Marinus Vonhof
date of start life: 2022-09-30
validity context: *d
scope note: Collection of facts BAS
type: Class
subclass of: NEN 3300 Term

Rioolvreemd water
definition: Water dat niet in het riool thuishoort, waarvoor het niet ontworpen is
author at start life: Marinus Vonhof
date of start life: 2021-08-05
scope note: Collection of facts BAS
type: Class
subclass of: Water

Rioolwater
author of change: Marinus Vonhof
date of change: 2017-09-09
definition: Alle water waarvan men zich via de riolering wil ontdoen
author at start life: Marinus Vonhof
date of start life: 2013-09-10
scope note: Collection of facts BAS
scope note: Collection of facts DMO
type: Class
subclass of: Afvalwater

Rioolwaterzuiveringsinrichting
definition: [NEN 3300:1996] Het totaal van de grond, gebouwen en apparatuur voor de zuivering van rioolwater
author at start life: Marinus Vonhof
date of start life: 2022-09-30
validity context: *d
scope note: Collection of facts BAS
type: Class
subclass of: NEN 3300 Term

Spoorlijn
author of change: Marinus Vonhof
date of change: 2025-01-16
date of change: 2016-04-20
author at start life: Marinus Vonhof
date of start life: 2015-04-20
validity context: *d
scope note: Collection of facts BAS
scope note: Collection of facts PLI
type: Class
subclass of: Bouwwerk
subclass of: Restriction
  author of change: Marinus Vonhof
  date of change: 2018-04-23
  author at start life: Marinus Vonhof
  date of start life: 2014-12-02
  on class: Risicogebied
  on property: has as part (inverse)
  max qualified cardinality: 1
subclass of: Restriction
  on property: heeft Functie
  has value: GeleidenVanTreinen

Rivier
author of change: Marinus Vonhof
date of change: 2025-01-16
definition: [IMBOR] Een natuurlijke waterloop dat het water uit een bepaald gebied wordt afvoert.
author at start life: Marinus Vonhof
date of start life: 2017-05-31
validity context: *d
scope note: Collection of facts BAS
type: Class
subclass of: Waterloop
subclass of: Restriction
  on property: heeft Uitvoering
  has value: NatuurlijkEnGroot

Sym_Schildmuur
author at start life: Johan Post
date of start life: 2021-10-01
scope note: Collection of facts NLCS
type: Class
subclass of: Geo-symbool
subclass of: Restriction
  author at start life: Marinus Vonhof
  date of start life: 2018-11-07
  on class: Schildmuur
  on property: is represented by (inverse)
  max qualified cardinality: 1

Schildmuur (eindkap)
definition: Een schildmuur als eindkap (knooppunt). Bevindt zich aan het eind van een leiding (uitlegger), zonder verdere koppeling met een put en dergelijke.
author at start life: Marinus Vonhof
date of start life: 2026-07-16
scope note: Collection of facts HYD
type: Class
subclass of: Hulpstuk
subclass of: Restriction
  on property: heeft Functie
  has value: AfsluitenVanLeidingen

Schouwsloot
author of change: Marinus Vonhof
date of change: 2025-01-16
definition: [IMBOR] Een sloot die niet door het waterschap wordt onderhouden, maar wel door het waterschap wordt gecontroleerd.
author at start life: Marinus Vonhof
date of start life: 2017-05-31
validity context: 1d 3d 10d 12d 14d
scope note: Collection of facts MDS
type: Class
subclass of: Sloot
subclass of: Restriction
  on property: heeft Toepassing
  has value: InBeheerBijWaterschap

Schroefcentrifugaalpomp
author of change: Marinus Vonhof
date of change: 2016-04-13
definition: Een pomp waarbij de vloeistof door middel van een schroefcentrifugaalwaaier wordt verplaatst.
author at start life: Finy Teitsma (Oranjewoud)
date of start life: 2007-10-24
scope note: Collection of facts BAS
scope note: Collection of facts HYD
scope note: Collection of facts RGM
scope note: Collection of facts DMO
type: Class
subclass of: Pomp
subclass of: Restriction
  on property: heeft Technologie
  has value: VerplaatsingDoorMiddelVanEenDraaiendeSchroef

Schroefpomp
author of change: Finy Teitsma (Oranjewoud)
date of change: 2007-10-25
definition: Een pomp waarbij de vloeistof door middel van een schroef wordt verplaatst.
author at start life: Finy Teitsma (Oranjewoud)
date of start life: 2007-10-24
scope note: Collection of facts BAS
scope note: Collection of facts HYD
scope note: Collection of facts RGM
scope note: Collection of facts DMO
type: Class
subclass of: Pomp
subclass of: Restriction
  on property: heeft Technologie
  has value: VerplaatsingDoorMiddelVanEenSchroef

Sym_IBA
author at start life: Johan Post
date of start life: 2021-10-01
scope note: Collection of facts NLCS
type: Class
subclass of: Geo-symbool
subclass of: Restriction
  author at start life: Marinus Vonhof
  date of start life: 2018-11-07
  on class: IBA
  on property: is represented by (inverse)
  max qualified cardinality: 1
subclass of: Restriction
  on class: Septictank
  on property: is represented by (inverse)
  max qualified cardinality: 1

Stankafsluiter
definition: Een constructie om het vrijkomen van gassen uit het riool te voorkomen
author at start life: Marinus Vonhof
date of start life: 2020-05-26
validity context: 1d 3d 10d 12d 14d
scope note: Collection of facts RRB
scope note: Collection of facts REV
scope note: Collection of facts BAS
type: Class
subclass of: Constructieonderdeel
subclass of: Restriction
  author at start life: Wouter van Riel
  date of start life: 2022-09-26
  on class: Appendage-oriëntatie
  on property: has as aspect
  max qualified cardinality: 1
subclass of: Restriction
  on property: heeft Functie
  has value: VoorkomenStank

Sleutelnummer
author of change: Marinus Vonhof
date of change: 2025-01-16
definition: [IMBOR] Het nummer van de sleutel waarmee de kast kan worden geopend.
author at start life: Marinus Vonhof
date of start life: 2018-05-03
comment: [is aspect]
scope note: Collection of facts RRB
scope note: Collection of facts BAS
scope note: Collection of facts RGM
type: Class
subclass of: Unieke identificatie

Slibafscheider
label: Grit separator @en
author of change: Finy Teitsma (Oranjewoud)
date of change: 2007-11-12
definition: Een toestel waarin ten gevolge van het verschil in dichtheid en het vertragen van de vloeistofstroom het slib door bezinking grotendeels van het afvalwater wordt gescheiden.
definition: [EN 16323:2014] device to separate grit, sand or similar mineral material from wastewater @en
author at start life: Finy Teitsma (Oranjewoud)
date of start life: 2007-10-23
validity context: 10d
scope note: Collection of facts MDS
type: Class
subclass of: Constructieonderdeel
subclass of: Restriction
  author at start life: Wouter van Riel
  date of start life: 2022-09-26
  on class: Appendage-oriëntatie
  on property: has as aspect
  max qualified cardinality: 1
subclass of: Restriction
  on property: heeft Functie
  has value: AfscheidenSlib
subclass of: Restriction
  on property: heeft Functie
  has value: ReinigenAfvalwater
subclass of: Restriction
  on property: heeft Doel
  has value: VerwijderenBezinksel

Sym_DefaultPut
definition: Standaard stijl: Vorm cirkel, Lijnkleur 185 185 185, Grootte 4
author at start life: Marinus Vonhof
date of start life: 2019-10-08
scope note: Collection of facts NLCS
type: Class
subclass of: Geo-symbool
subclass of: Restriction
  author at start life: Marinus Vonhof
  date of start life: 2019-10-08
  on class: Slokop
  on property: is represented by (inverse)
  max qualified cardinality: 1

Sloofconstructie
author of change: Marinus Vonhof
date of change: 2025-01-16
date of change: 2016-04-28
definition: [IMBOR] Een horizontale balk bovenop een verticale wand, grondkering of muur die het gewicht van bovenaf gelijk verdeelt.
author at start life: Marinus Vonhof
date of start life: 2013-10-05
scope note: Collection of facts MDS
scope note: Collection of facts RGM
type: Class
subclass of: Fundering
subclass of: Restriction
  on property: heeft Uitvoering
  has value: MetBalken

Spoelgemaal
author of change: Marinus Vonhof
date of change: 2025-01-16
definition: Een gemaal voor het verpompen van spoelwater
author at start life: Eric van Gorkom
date of start life: 2022-09-27
validity context: 11d 12d
scope note: Collection of facts MDS
scope note: Collection of facts HYD
scope note: Collection of facts RGM
type: Class
subclass of: Gemaal
subclass of: Restriction
  on property: heeft Functie
  has value: VerpomptSpoelwater

Spoelleiding
author of change: Marinus Vonhof
date of change: 2016-04-28
author at start life: Marinus Vonhof
date of start life: 2015-09-20
validity context: 5d 12d
scope note: Collection of facts MDS
type: Class
subclass of: Mechanische transportleiding
subclass of: Restriction
  author at start life: Marinus Vonhof
  date of start life: 2015-09-20
  on class: Spoelvoorziening
  on property: has as part (inverse)
  max qualified cardinality: 1
subclass of: Restriction
  on property: heeft Functie
  has value: TransportVanSpoelwater

Sport- en speldrainage
definition: Drainage onder sport- en speelvelden, vaak bestaande uit parallel aan elkaar gelegen drainageleidingen
author at start life: Johan Post
date of start life: 2026-08-19
scope note: Collection of facts BAS
type: Class
subclass of: Velddrainage
subclass of: Restriction
  on property: heeft Toepassing
  has value: SpeelveldenEnSportvelden

Velddrainage
author of change: Marinus Vonhof
author of change: Johan Post
date of change: 2025-01-16
date of change: 2026-08-19
definition: Drainage onder parken en velden, vaak bestaande uit parallel aan elkaar gelegen drainageleidingen
author at start life: Marinus Vonhof
date of start life: 2020-04-17
scope note: Collection of facts BAS
type: Class
subclass of: Drainagestelsel
subclass of: Restriction
  on property: heeft Toepassing
  has value: ParkenEnGrasvelden

Stationaire stroming
definition: [NEN 3300:1996] Een stromingssituatie die in de tijd niet verandert
author at start life: Marinus Vonhof
date of start life: 2022-09-30
validity context: *d
scope note: Collection of facts BAS
type: Class
subclass of: NEN 3300 Term

Stedelijk afvalwater
definition: [Waterwet] Huishoudelijk afvalwater of een mengsel daarvan met bedrijfsafvalwater, afvloeiend hemelwater, grondwater of ander afvalwater
author at start life: Marinus Vonhof
date of start life: 2014-09-05
scope note: Collection of facts BAS
scope note: Collection of facts DMO
type: Class
subclass of: Afvalwater

Stedelijk water
definition: [Waterwet] Stedelijk water is het samenhangend geheel van drinkwater, afvalwater, hemelwater, grondwater en oppervlaktewater, dat in de vorm van wateraanvoer, -berging, -afvoer en –verwerking bijdraagt aan een gezond, veilig, duurzaam en aangenaam leven in de bebouwde kom
author at start life: Marinus Vonhof
date of start life: 2016-04-07
scope note: Collection of facts BAS
type: Class
subclass of: Water
subclass of: Restriction
  on property: has as reference (qualification)
  all values from: Stedelijk water (coll)

Stedelijk water (coll)
validity context: 6d
comment: [is coll]
scope note: Collection of facts BAS
type: Class
subclass of: Verzameling soorten
subclass of: Class
  one of: Hemelwater
  one of: Grondwater
  one of: Afvalwater
  one of: Oppervlaktewater (materie)
  one of: Drinkwater

Steenwolblok
author of change: Marinus Vonhof
author of change: Johan Post
date of change: 2025-01-16
date of change: 2024-04-30
definition: Een verzameling van meerdere steenwolelementen die in een koffer worden toegepast voor de tijdelijke berging van hemelwater onder het maaiveld.
definition: [IMBOR] Infiltratieblokken van natuurlijk materiaal die, omhuld met filterdoek, worden aangebracht op plaatsen waar water zich ophoopt om overlast van hemelwater tegen te gaan.
author at start life: Marinus Vonhof
date of start life: 2020-04-17
validity context: 10d
scope note: Collection of facts BAS
type: Class
subclass of: Constructieonderdeel
subclass of: Restriction
  author at start life: Marinus Vonhof
  date of start life: 2020-04-17
  on class: Steenwolkoffer
  on property: has as part (inverse)
  qualified cardinality: 1
subclass of: Restriction
  on property: heeft Toepassing
  has value: ElementVanEenSteenwolkoffer

Steenwolkoffer
author of change: Marinus Vonhof
date of change: 2025-01-16
date of change: 2026-07-13
definition: [IMBOR] Een constructie gevuld met steenwol waar regenwater de tijd krijgt om langzaam in de bodem opgenomen te worden.
author at start life: Marinus Vonhof
date of start life: 2020-04-17
scope note: Collection of facts MDS
type: Class
subclass of: Infiltratiekoffer
subclass of: Restriction
  author at start life: Marinus Vonhof
  date of start life: 2020-04-17
  on class: Steenwolblok
  on property: has as part
  min qualified cardinality: 1
subclass of: Restriction
  on property: heeft Uitvoering
  has value: GevuldMetSteenwol

Stippengrafiek volgens Kuipers
definition: [NEN 3300:1996] De hoeveelheid neerslag in mm van buien met meer dan 4 mm neerslag in de periode van 1926 t/m 1962, uitgezet tegen de tijdsduur in minuten waarin de neerslag is gevallen (is geen neerslagreeks)
author at start life: Marinus Vonhof
date of start life: 2022-09-30
validity context: *d
scope note: Collection of facts BAS
type: Class
subclass of: NEN 3300 Term

Verhardingstype
author of change: Marinus Vonhof
author of change: Eric van Gorkom
date of change: 2015-10-21
date of change: 2024-05-13
notation: AXB
notation: CXB
author at start life: Marinus Vonhof
date of start life: 2013-03-26
validity context: 5d 6d 15d
see also: [RIB] De verharding van het wegdek volgens BGT, bij wisselende verharding de dominante aanhouden.
alternative label: Verharding wegdek
comment: [is aspect]
scope note: Collection of facts MDS
scope note: Collection of facts RRB
scope note: Collection of facts LDR
type: Class
subclass of: Kenmerk
subclass of: Restriction
  author of change: Marinus Vonhof
  date of change: 2015-10-31
  author at start life: Marinus Vonhof
  date of start life: 2013-03-26
  on class: Straat
  on property: has as aspect (inverse)
  max qualified cardinality: 1
subclass of: Restriction
  on property: has as reference (qualification)
  all values from: Verhardingstype (coll)

Straatnaam
author of change: Marinus Vonhof
date of change: 2017-08-31
author at start life: Marinus Vonhof
date of start life: 2012-05-06
validity context: 6d
comment: BAG / STUF-berichten - R02 Straat
see also: [NEN 5826:2002] de officiële door de gemeente vastgestelde naam van een straat
comment: [is aspect]
scope note: Collection of facts MDS
scope note: Collection of facts RRB
scope note: Collection of facts LDR
type: Class
subclass of: Naam openbare ruimte
subclass of: Restriction
  author of change: Marinus Vonhof
  date of change: 2017-08-31
  author at start life: Marinus Vonhof
  date of start life: 2013-03-26
  on class: Straat
  on property: has as aspect (inverse)
  qualified cardinality: 1

Type bebouwing
author at start life: Marinus Vonhof
date of start life: 2013-10-05
alternative label: Multifunctioneel gebied
comment: [is aspect]
scope note: Collection of facts BAS
scope note: Collection of facts DMO
type: Class
subclass of: Kenmerk
subclass of: Restriction
  author of change: Marinus Vonhof
  date of change: 2018-12-11
  author at start life: Marinus Vonhof
  date of start life: 2013-10-05
  on class: Straat
  on property: has as aspect (inverse)
  max qualified cardinality: 1
subclass of: Restriction
  on property: has as reference (qualification)
  all values from: Type bebouwing (coll)

Wegtype
author of change: Marinus Vonhof
date of change: 2025-01-16
date of change: 2024-12-07
definition: [IMBOR] Het enumeratietype voor de domeinwaardenlijst van de klasse Verharding en het attribuut gebruiksfunctie.
author at start life: Marinus Vonhof
date of start life: 2013-03-26
validity context: 6d
alternative label: Verhardinggebruiksfunctie
comment: [is aspect]
scope note: Collection of facts BAS
type: Class
subclass of: Kenmerk
subclass of: Restriction
  author at start life: Marinus Vonhof
  date of start life: 2013-03-26
  on class: Straat
  on property: has as aspect (inverse)
  max qualified cardinality: 1
subclass of: Restriction
  on property: has as reference (qualification)
  all values from: Wegtype (coll)

Streefpeil
definition: Het nagestreefde peil van het oppervlaktewater
author at start life: Marinus Vonhof
date of start life: 2018-12-06
units of measurements: m
comment: [is aspect]
scope note: Collection of facts BAS
type: Class
subclass of: Waterpeil
subclass of: Restriction
  on property: has as value
  all values from: decimal

Strijkriool
definition: Een vrijverval rioolleiding die boven een dieper gelegen transportrioolleiding ligt, waar aansluitleidingen op aangesloten worden.
author at start life: Johan Post
date of start life: 2026-08-12
scope note: Collection of facts BAS
type: Class
subclass of: Vrijverval rioolleiding
subclass of: Extra objecttype (rol)
subclass of: Restriction
  on property: heeft Uitvoering
  has value: LigtBovenEenTransportrioolleiding

Stripperput
definition: Een rioolput waar gerichte ontgassing plaats vindt met als doel het verlagen van de h2S concentratie in het rioolwater om daarmee het benedenstroomse riool te beschermen. Afhankelijk van de ligging is luchtbehandeling bij een stripperput noodzakelijk.
author at start life: Johan Post
date of start life: 2026-05-01
scope note: Collection of facts BAS
type: Class
subclass of: Rioolput
subclass of: Restriction
  on property: heeft Functie
  has value: Ontgassing

Stuwklep
author of change: Marinus Vonhof
definition: Klep als onderdeel van de stuwconstructie
author at start life: Marinus Vonhof
date of start life: 2026-07-17
date of start life: 2020-04-17
scope note: Collection of facts HYD
type: Class
subclass of: Keerklep
subclass of: Restriction
  author of change: Marinus Vonhof
  date of change: 2020-04-17
  author at start life: Marinus Vonhof
  date of start life: 2014-04-29
  on class: Stuwconstructie
  on property: has as part (inverse)
  max qualified cardinality: 1
subclass of: Restriction
  on property: heeft Toepassing
  has value: DeelVanEenStuwconstructie
subclass of: Restriction
  author of change: Marinus Vonhof
  date of change: 2020-04-17
  author at start life: Marinus Vonhof
  date of start life: 2017-12-07
  on class: Stuwput
  on property: has as part (inverse)
  max qualified cardinality: 1

Wervelventiel
label: Vortex flow control @en
author of change: Marinus Vonhof
date of change: 2017-12-13
definition: [NEN 3300:1996] doorlaat die het debiet regelt
notation: D
author at start life: Nic Roest (Idoro)
date of start life: 2007-11-29
validity context: 1d 3d
scope note: Collection of facts MDS
scope note: Collection of facts REV
scope note: Collection of facts HYD
scope note: Collection of facts DMO
type: Class
subclass of: Doorlaat
subclass of: Restriction
  author at start life: Marinus Vonhof
  date of start life: 2018-12-12
  on class: Stuwconstructie
  on property: has as part (inverse)
  max qualified cardinality: 1
subclass of: Restriction
  author at start life: Marinus Vonhof
  date of start life: 2018-12-12
  on class: Stuwput
  on property: has as part (inverse)
  max qualified cardinality: 1
subclass of: Restriction
  on property: heeft Functie
  has value: AfremmenVanDeStroomsnelheidVanHetAfvalwater

Sym_Stuwput
author of change: Marinus Vonhof
date of change: 2018-11-11
definition: Aangepaste stijl: Lijnkleur 0 0 0, Vulkleur 0 0 0, Grootte 10
author at start life: Marinus Vonhof
date of start life: 2018-11-07
scope note: Collection of facts NLCS
type: Class
subclass of: Geo-symbool
subclass of: Restriction
  author at start life: Marinus Vonhof
  date of start life: 2018-11-07
  on class: Stuwput
  on property: is represented by (inverse)
  max qualified cardinality: 1

Stuwrioolleiding
author of change: Finy Teitsma (Oranjewoud)
date of change: 2007-11-12
definition: Een gesloten rioolleiding met een verkleinde doorsnede om de bergingscapaciteit van het bovenstroomse rioolstelsel te benutten.
definition: [NEN 3300:1996] 1. riool met een verkleinde doorsnede om de bergingscapaciteit bovenstrooms door stuwen van afvalwater te vergroten; 2. riool om de afvoer te beperken
author at start life: Finy Teitsma (Oranjewoud)
date of start life: 2006-11-29
alternative label: Knijpriool
alternative label: Stuwriool
scope note: Collection of facts MDS
scope note: Collection of facts HYD
type: Class
subclass of: Vrijverval rioolleiding
subclass of: Restriction
  on property: heeft Functie
  has value: RegelenVanHetDebietBenuttenBerging

Geo-symbool
author of change: Marinus Vonhof
date of change: 2026-08-20
date of change: 2018-11-11
author at start life: Marinus Vonhof
date of start life: 2018-11-07
scope note: Collection of facts NLCS
type: Class
subclass of: Informatiedrager

Sym_DefaultLeiding
definition: Standaard stijl: Lijntype doorgetrokken, Lijnkleur 0 0 0, Lijndikte 0.4
author at start life: Marinus Vonhof
date of start life: 2019-10-08
scope note: Collection of facts NLCS
type: Class
subclass of: Geo-symbool
subclass of: Restriction
  author at start life: Marinus Vonhof
  date of start life: 2019-10-08
  on class: Goot
  on property: is represented by (inverse)
  max qualified cardinality: 1

Verholen goot
author of change: Johan Post
date of change: 2021-10-01
definition: Grotendeels overdekte goot waarvan de bovenkant gelijk ligt met het oppervlak van de verharding.
author at start life: Finy Teitsma (Oranjewoud)
date of start life: 2007-10-23
scope note: Collection of facts MDS
scope note: Collection of facts HYD
type: Class
subclass of: Goot
subclass of: Restriction
  on property: heeft Uitvoering
  has value: GrotendeelsOverdekt BovenkantGelijkMetDeVerh
subclass of: Restriction
  on class: Goot
  on property: is represented by (inverse)
  max qualified cardinality: 1

Sym_Transportrioolleiding
author of change: Johan Post
date of change: 2021-10-01
definition: Standaard stijl: Lijntype doorgetrokken, Lijnkleur 255 127 0, Lijndikte 2.0
author at start life: Marinus Vonhof
date of start life: 2018-11-07
scope note: Collection of facts NLCS
type: Class
subclass of: Geo-symbool
subclass of: Restriction
  author at start life: Marinus Vonhof
  date of start life: 2018-11-07
  on class: Transportrioolleiding
  on property: is represented by (inverse)
  max qualified cardinality: 1

Sym_UitlaatPunt
author of change: Marinus Vonhof
date of change: 2019-10-08
definition: Aangepaste stijl: Lijnkleur 0 0 255, Grootte 10
author at start life: Marinus Vonhof
date of start life: 2018-11-07
scope note: Collection of facts NLCS
type: Class
subclass of: Geo-symbool
subclass of: Restriction
  author at start life: Marinus Vonhof
  date of start life: 2018-11-07
  on class: Uitlaat (punt)
  on property: is represented by (inverse)
  max qualified cardinality: 1
subclass of: Restriction
  author at start life: Marinus Vonhof
  date of start life: 2019-11-07
  on class: Uitlaatconstructie
  on property: is represented by (inverse)
  max qualified cardinality: 1

Sym_Vacuumgemaal
author at start life: Johan Post
date of start life: 2021-10-01
scope note: Collection of facts NLCS
type: Class
subclass of: Geo-symbool
subclass of: Restriction
  author at start life: Marinus Vonhof
  date of start life: 2018-11-07
  on class: Vacuümpompstation
  on property: is represented by (inverse)
  max qualified cardinality: 1

Sym_Vacuumleiding
author of change: Johan Post
date of change: 2021-10-01
definition: Standaard stijl: Lijntype doorgetrokken, Lijnkleur 255 127 255, Lijndikte 1.0
author at start life: Marinus Vonhof
date of start life: 2018-11-07
scope note: Collection of facts NLCS
type: Class
subclass of: Geo-symbool
subclass of: Restriction
  author at start life: Marinus Vonhof
  date of start life: 2018-11-07
  on class: Vacuümleiding
  on property: is represented by (inverse)
  max qualified cardinality: 1

Sym_Vacuumopslagtank
author at start life: Johan Post
date of start life: 2021-10-01
scope note: Collection of facts NLCS
type: Class
subclass of: Geo-symbool
subclass of: Restriction
  author at start life: Marinus Vonhof
  date of start life: 2018-11-07
  on class: Bufferput
  on property: is represented by (inverse)
  max qualified cardinality: 1

Sym_Vacuumriolering
author at start life: Johan Post
date of start life: 2021-10-01
scope note: Collection of facts NLCS
type: Class
subclass of: Geo-symbool
subclass of: Restriction
  author at start life: Marinus Vonhof
  date of start life: 2018-11-07
  on class: Vacuümriolering
  on property: is represented by (inverse)
  max qualified cardinality: 1

Sym_VerbeterdGescheidenStelsel
author at start life: Johan Post
date of start life: 2021-10-01
scope note: Collection of facts NLCS
type: Class
subclass of: Geo-symbool
subclass of: Restriction
  author at start life: Marinus Vonhof
  date of start life: 2018-11-07
  on class: Verbeterd gescheiden systeem
  on property: is represented by (inverse)
  max qualified cardinality: 1

Verbeterd gescheiden systeem
author of change: Eric van Gorkom
date of change: 2022-09-27
definition: Een samengesteld vrijverval rioolstelsel waarin het vuilwater en hemelwater gescheiden van elkaar wordt ingezameld en getransporteerd, waarbij een beperkt deel van het hemelwater wordt afgevoerd naar de RWZI.
definition: [NEN 3300:1996] Gescheiden rioolstelsel met voorzieningen waardoor een deel van de neerslag naar het vuilwaterriool wordt afgevoerd
notation: VGS
author at start life: Nic Roest (Idoro)
date of start life: 2007-11-29
comment: 20151014: NEN3300-definitie aangepast
alternative label: Verbeterd gescheiden rioolstelsel
alternative label: Verbeterd gescheiden stelsel
scope note: Collection of facts BAS
scope note: Collection of facts DMO
type: Class
subclass of: Gescheiden systeem
subclass of: Restriction
  author at start life: Marinus Vonhof
  date of start life: 2018-12-06
  on class: Verbeterd hemelwaterstelsel
  on property: has as part
  min qualified cardinality: 1
subclass of: Restriction
  on property: heeft Uitvoering
  has value: GescheidenMetGedeeltelijkeAfvoerHemelwaterNaarRWZI
subclass of: Restriction
  on class: Sym_VerbeterdGescheidenStelsel
  on property: is represented by
  max qualified cardinality: 1

Sym_VrijvervalLeidingsegment
definition: Standaard stijl: Lijntype doorgetrokken, Lijnkleur 0 0 0, Lijndikte 1.0
author at start life: Johan Post
date of start life: 2021-10-10
scope note: Collection of facts NLCS
type: Class
subclass of: Geo-symbool
subclass of: Restriction
  author at start life: Marinus Vonhof
  date of start life: 2018-11-07
  on class: Vrijverval leidingsegment
  on property: is represented by (inverse)
  max qualified cardinality: 1

Vrijverval leidingsegment
author of change: Marinus Vonhof
author of change: Johan Post
date of change: 2025-01-16
date of change: 2021-10-01
definition: Deel van een vrijverval rioolleiding begrensd door wijziging materiaal, wijziging afmeting of locatie appendages
author at start life: Marinus Vonhof
date of start life: 2018-12-06
scope note: Collection of facts MDS
scope note: Collection of facts HYD
scope note: Collection of facts DMO
type: Class
subclass of: Vrijverval transportleiding
subclass of: Restriction
  author of change: Marinus Vonhof
  date of change: 2025-01-03
  author at start life: Marinus Vonhof
  date of start life: 2018-12-06
  on class: Transportrioolleiding
  on property: has as part (inverse)
  max qualified cardinality: 1
subclass of: Restriction
  on property: heeft Uitvoering
  has value: DeelVanVrijvervalTransportleiding
subclass of: Restriction
  on class: Sym_VrijvervalLeidingsegment
  on property: is represented by
  max qualified cardinality: 1

Restriction
on class: Materiaal leiding
on property: has as aspect (inverse)
max qualified cardinality: 1

Restriction
on class: Put
on property: has as aspect (inverse)
max qualified cardinality: 1

Restriction
on class: Theoretische levensduur
on property: has as aspect (inverse)
max qualified cardinality: 1

Restriction
author at start life: Marinus Vonhof
date of start life: 2018-09-03
on class: Ondergrond
on property: has as part (inverse)
max qualified cardinality: 1

Restriction
author at start life: Marinus Vonhof
date of start life: 2018-12-05
on class: Voegmateriaal
on property: has as aspect
max qualified cardinality: 1

Restriction
author at start life: Marinus Vonhof
date of start life: 2018-12-12
on class: Registratief gebied
on property: has as part (inverse)
max qualified cardinality: 1

Restriction
author at start life: Marinus Vonhof
date of start life: 2019-05-15
on class: Afwateringsgebied
on property: has as part (inverse)
max qualified cardinality: 1

Restriction
author at start life: Marinus Vonhof
date of start life: 2020-04-17
on class: WIBON thema
on property: has as aspect
max qualified cardinality: 1

Restriction
on class: Theoretische levensduur
on property: has as aspect
max qualified cardinality: 1

Restriction
on class: Theoretische levensduur
on property: has as aspect
max qualified cardinality: 1

Restriction
on class: Bekabeling
on property: has as part
min qualified cardinality: 0

Restriction
author at start life: Marinus Vonhof
date of start life: 2014-12-23
validity context: *t
comment: Relatie (kardinaliteit) uitgeschakeld voor CFK's (SHACL-syntax) (20260403) (20260824)
on class: Reinigen rioolput
on property: has as output (inverse)
qualified cardinality: 1

Restriction
author at start life: Marinus Vonhof
date of start life: 2018-05-03
on class: Coating
on property: has as part
max qualified cardinality: 1

Restriction
author at start life: Marinus Vonhof
date of start life: 2019-03-14
on class: Boorkern nemen
on property: has as input (inverse)
max qualified cardinality: 1

Restriction
author at start life: Marinus Vonhof
date of start life: 2019-05-15
on class: Klimijzer
on property: has as part
min qualified cardinality: 0

Restriction
author at start life: Marinus Vonhof
date of start life: 2024-05-20
on class: Bodemprofiel
on property: has as aspect
max qualified cardinality: 1

Restriction
author at start life: Marinus Vonhof
date of start life: 2026-07-17
on class: Onderbak
on property: has as part
max qualified cardinality: 1

Restriction
author at start life: Marinus Vonhof
date of start life: 2026-07-17
on class: Opzetstuk
on property: has as part
max qualified cardinality: 1

Restriction
author at start life: Marinus Vonhof
date of start life: 2026-07-23
on class: Afdekplaat
on property: has as part
max qualified cardinality: 1

Restriction
on class: Roosterdeksel
on property: has as part
min qualified cardinality: 0